{"text_format":"1","workbook":"xlsx","n_sheets":4,"sheets":["Viitenumber","tudengid","testid","testid (2)"],"not_rendered":{"charts":0,"images":1,"macros":1,"external_links":0,"defined_names":11,"comments":0,"pivot_tables":1},"unopened":[],"bounds":{"document_bytes":16777216,"sheet_cells":100000,"rows_first":2000,"rows_last":500,"rows_between":2000,"halvings":0,"cell_chars":16384,"cell_head_chars":4096},"cells_cut":0,"cells_raw":0,"read":"whole","date_system":"1900"}

{"sheet":"Viitenumber","index":0,"n_rows":17,"n_cols":4,"rows_kept":17,"cut":false,"hidden":false,"merged":[]}
[]
[]
[]
[]
[]
[]
[]
[]
[null,"Algne number","Kontrolljärk","Viitenumber"]
[null,3698525,{"$f":"kontroll(B10)","v":4},{"$f":"v_number(B10)","v":36985254}]
[null,201911458,{"$f":"kontroll(B11)","v":7},{"$f":"v_number(B11)","v":2019114587}]
[null,369,{"$f":"kontroll(B12)","v":6},{"$f":"v_number(B12)","v":3696}]
[null,"A1458",{"$f":"kontroll(B13)","v":{"$error":"#VALUE!"}},{"$f":"v_number(B13)","v":{"$error":"#VALUE!"}}]
[null,20085789125,{"$f":"kontroll(B14)","v":9},{"$f":"v_number(B14)","v":200857891259}]
[null,25874,{"$f":"kontroll(B15)","v":2},{"$f":"v_number(B15)","v":258742}]
[null,134589,{"$f":"kontroll(B16)","v":0},{"$f":"v_number(B16)","v":1345890}]
[null,12345,{"$f":"kontroll(B17)","v":3},{"$f":"v_number(B17)","v":123453}]

{"sheet":"tudengid","index":1,"n_rows":42,"n_cols":23,"rows_kept":42,"cut":false,"hidden":false,"merged":[]}
[]
[null,null,null,{"$f":"_xlfn.FORMULATEXT(E5)","v":"=AVERAGEIFS(Tulemus;Nimi;$D5;Test;E$4;Mitmes;\"<=3\")"},null,null,null,null,{"$f":"_xlfn.FORMULATEXT(I5)","v":"=MAXIFS(Tulemus;Nimi;$D5;Test;E$4)"}]
[null,null,null,null,"Viimase kolme keskmised",null,null,null,"Parim tulemus",null,null,null,null,"Mitmes","(Multiple Items)",null,null,null,null,null,null,null,{"$f":"_xlfn.FORMULATEXT(W7)","v":"=INDEX(Täisnimi;MATCH(1;(Ryhm=U7)*(Test01=V7);0))"}]
["Rühm","Eesnimi","Perenimi","Täisnimi","Test01","Test02","Test03","Test04","Test01","Test02","Test03","Test04",null,null,null,null,null,null,null,null,{"$f":"_xlfn.FORMULATEXT(V7)","v":"=MAXIFS(Test01;Ryhm;U7)"}]
["R2","Katrin","Laurits",{"$f":"B5&\" \"&C5","v":"Katrin Laurits"},{"$f":"AVERAGEIFS(Tulemus,Nimi,$D5,Test,E$4,Mitmes,\"<=3\")","v":46.333333333333336},39,78,64,{"$f":"_xlfn.MAXIFS(Tulemus,Nimi,$D5,Test,E$4)","v":98},{"$f":"_xlfn.MAXIFS(Tulemus,Nimi,$D5,Test,F$4)","v":84},{"$f":"_xlfn.MAXIFS(Tulemus,Nimi,$D5,Test,G$4)","v":99},{"$f":"_xlfn.MAXIFS(Tulemus,Nimi,$D5,Test,H$4)","v":97},null,"Average of Tulemus","Column Labels"]
["R1","Anette","Lepp",{"$f":"B6&\" \"&C6","v":"Anette Lepp"},76.333333333333329,63.333333333333336,71,37.666666666666664,94,99,97,80,null,"Row Labels","Test01","Test02","Test03","Test04","Grand Total",null,"Rühm","Test01","Tudeng"]
["R3","Reimo","Kala","Reimo Kala",75,79.666666666666671,51.666666666666664,76.333333333333329,95,90,98,92,null,"Alari Suur",79,68.666666666666671,61,56,66.166666666666671,null,"R2",{"$f":"_xlfn.MAXIFS(Test01,Ryhm,U7)","v":85.666666666666671},{"$f":"INDEX(Täisnimi,MATCH(1,(Ryhm=U7)*(Test01=V7),0))","v":"Jaagup Kivi"}]
["R3","Egert","Vint","Egert Vint",44,41.666666666666664,64,38.333333333333336,100,81,84,78,null,"Anette Lepp",76.333333333333329,63.333333333333336,71,37.666666666666664,62.083333333333336,null,"R1",{"$f":"_xlfn.MAXIFS(Test01,Ryhm,U8)","v":83},{"$f":"INDEX(Täisnimi,MATCH(1,(Ryhm=U8)*(Test01=V8),0))","v":"Brita Kaljula"}]
["R2","Carmen","Sõrmus","Carmen Sõrmus",31.333333333333332,57.333333333333336,45.666666666666664,73.333333333333329,70,97,67,86,null,"Anna Koel",51.333333333333336,50,48.333333333333336,59.666666666666664,52.333333333333336,null,"R3",{"$f":"_xlfn.MAXIFS(Test01,Ryhm,U9)","v":92},{"$f":"INDEX(Täisnimi,MATCH(1,(Ryhm=U9)*(Test01=V9),0))","v":"Karin Saar"}]
["R2","Armin","Kaasik","Armin Kaasik",75,46.666666666666664,61.666666666666664,42,95,79,100,56,null,"Armin Kaasik",75,46.666666666666664,61.666666666666664,42,56.333333333333336]
["R3","Jana","Kiisk","Jana Kiisk",54,63,64.666666666666671,91,84,91,90,91,null,"Artur Piiri",68.333333333333329,84.333333333333329,56.666666666666664,88,74.333333333333329]
["R1","Kaspar","Raude","Kaspar Raude",47,79.333333333333329,70,63,95,94,91,89,null,"Brita Kaljula",83,62.666666666666664,54.333333333333336,43.666666666666664,60.916666666666664]
["R3","Karin","Saar","Karin Saar",92,58.333333333333336,71.333333333333329,65,95,80,96,98,null,"Carmen Sõrmus",31.333333333333332,57.333333333333336,45.666666666666664,73.333333333333329,51.916666666666664]
["R2","Hanna","Laid","Hanna Laid",70.333333333333329,53.666666666666664,69.666666666666671,49.333333333333336,92,84,99,99,null,"Diana Taal",53,79.333333333333329,62.666666666666664,78,68.25]
["R1","Mihkel","Kulp","Mihkel Kulp",48.333333333333336,75.666666666666671,87,83,88,92,94,95,null,"Egert Vint",44,41.666666666666664,64,38.333333333333336,47]
["R1","Markus","Niidas","Markus Niidas",39.666666666666664,77.666666666666671,57,67.666666666666671,51,89,79,92,null,"Emili Loorits",56.333333333333336,74.666666666666671,31.666666666666668,44,51.666666666666664]
["R2","Alari","Suur","Alari Suur",79,68.666666666666671,61,56,96,91,88,93,null,"Erik Pärn",71.333333333333329,59,66,86.666666666666671,70.75]
["R1","Erik","Pärn","Erik Pärn",71.333333333333329,59,66,86.666666666666671,93,94,84,98,null,"Getlin Allas",67.333333333333329,62.666666666666664,63.666666666666664,51.666666666666664,61.333333333333336]
["R1","Martin","Aavik","Martin Aavik",41.333333333333336,46.666666666666664,59.333333333333336,76.666666666666671,91,89,98,99,null,"Hanna Laid",70.333333333333329,53.666666666666664,69.666666666666671,49.333333333333336,60.75]
["R3","Maarja","Pihlak","Maarja Pihlak",92,69,79.666666666666671,62.666666666666664,99,97,87,91,null,"Hans Kukk",75,58.666666666666664,69.666666666666671,53,64.083333333333329]
["R2","Urmas","Lõhmus","Urmas Lõhmus",60.666666666666664,45,57.333333333333336,77,73,89,99,96,null,"Jaagup Kivi",85.666666666666671,70.666666666666671,54.333333333333336,65,68.916666666666671]
["R3","Lauri","Vahtra","Lauri Vahtra",52.666666666666664,67.666666666666671,65.333333333333329,50,98,93,99,97,null,"Jana Kiisk",54,63,64.666666666666671,91,63.6]
["R1","Emili","Loorits","Emili Loorits",56.333333333333336,74.666666666666671,31.666666666666668,44,69,100,85,84,null,"Joonas Haljas",78.333333333333329,35.666666666666664,66.666666666666671,57,59.416666666666664]
["R2","Jaagup","Kivi","Jaagup Kivi",85.666666666666671,70.666666666666671,54.333333333333336,65,98,97,87,93,null,"Karin Saar",92,58.333333333333336,71.333333333333329,65,71.666666666666671]
["R3","Joonas","Haljas","Joonas Haljas",{"$f":"AVERAGEIFS(Tulemus,Nimi,$D25,Test,E$4,Mitmes,\"<=3\")","v":78.333333333333329},35.666666666666664,66.666666666666671,57,92,98,99,86,null,"Kaspar Raude",47,79.333333333333329,70,63,64.833333333333329]
["R1","Robert","Lentso","Robert Lentso",35.666666666666664,63.333333333333336,49,69,76,99,85,97,null,"Katrin Laurits",46.333333333333336,39,78,64,56.833333333333336]
["R3","Viktoria","Lumi","Viktoria Lumi",46.666666666666664,63.333333333333336,80,62.333333333333336,93,98,100,98,null,"Kertu Heinsoo",61.666666666666664,55.666666666666664,44,54,53.833333333333336]
["R2","Sander","Kell","Sander Kell",59.333333333333336,43.666666666666664,69.333333333333329,42.333333333333336,94,86,93,93,null,"Kristina Merila",45,57.333333333333336,72.333333333333329,39,53.416666666666664]
["R1","Hans","Kukk","Hans Kukk",75,58.666666666666664,69.666666666666671,53,100,97,100,96,null,"Lauri Vahtra",52.666666666666664,67.666666666666671,65.333333333333329,50,58.916666666666664]
["R2","Diana","Taal","Diana Taal",53,79.333333333333329,62.666666666666664,78,86,93,95,93,null,"Maarja Pihlak",92,69,79.666666666666671,62.666666666666664,75.833333333333329]
["R3","Kertu","Heinsoo","Kertu Heinsoo",61.666666666666664,55.666666666666664,44,54,90,82,95,100,null,"Markus Niidas",39.666666666666664,77.666666666666671,57,67.666666666666671,60.5]
["R3","Tarvo","Järv","Tarvo Järv",61.666666666666664,49.333333333333336,53.333333333333336,91,87,97,97,99,null,"Martin Aavik",41.333333333333336,46.666666666666664,59.333333333333336,76.666666666666671,56]
["R1","Paul","Hein","Paul Hein",52.333333333333336,65,56.666666666666664,49.666666666666664,97,88,97,83,null,"Mihkel Kulp",48.333333333333336,75.666666666666671,87,83,73.5]
["R1","Artur","Piiri","Artur Piiri",68.333333333333329,84.333333333333329,56.666666666666664,88,98,97,99,93,null,"Paul Hein",52.333333333333336,65,56.666666666666664,49.666666666666664,55.916666666666664]
["R2","Getlin","Allas","Getlin Allas",67.333333333333329,62.666666666666664,63.666666666666664,51.666666666666664,97,92,85,98,null,"Rasmus Kroon",66,61.333333333333336,35.333333333333336,84,61.666666666666664]
["R1","Brita","Kaljula","Brita Kaljula",83,62.666666666666664,54.333333333333336,43.666666666666664,99,100,97,100,null,"Reimo Kala",75,79.666666666666671,51.666666666666664,76.333333333333329,70.666666666666671]
["R1","Anna","Koel","Anna Koel",51.333333333333336,50,48.333333333333336,59.666666666666664,72,99,81,100,null,"Robert Lentso",35.666666666666664,63.333333333333336,49,69,54.25]
["R3","Kristina","Merila","Kristina Merila",45,57.333333333333336,72.333333333333329,39,72,99,97,94,null,"Sander Kell",59.333333333333336,43.666666666666664,69.333333333333329,42.333333333333336,53.666666666666664]
["R2","Rasmus","Kroon","Rasmus Kroon",66,61.333333333333336,35.333333333333336,84,83,95,73,95,null,"Tarvo Järv",61.666666666666664,49.333333333333336,53.333333333333336,91,63.833333333333336]
[null,null,null,null,null,null,null,null,null,null,null,null,null,"Urmas Lõhmus",60.666666666666664,45,57.333333333333336,77,60]
[null,null,null,null,null,null,null,null,null,null,null,null,null,"Viktoria Lumi",46.666666666666664,63.333333333333336,80,62.333333333333336,63.083333333333336]
[null,null,null,null,null,null,null,null,null,null,null,null,null,"Grand Total",61.228571428571428,60.828571428571429,61.38095238095238,62.04854368932039,61.368421052631582]

{"sheet":"testid","index":2,"n_rows":1173,"n_cols":5,"rows_kept":1173,"cut":false,"hidden":false,"merged":[]}
[]
[null,null,null,{"$f":"_xlfn.FORMULATEXT(E5)","v":"=COUNTIFS(Test;A5;Nimi;B5;Aeg;\">=\"&C5)"}]
[]
["Test","Nimi","Aeg","Tulemus","Mitmes"]
["Test02","Robert Lentso","2019-11-12T13:16:35.251",37,{"$f":"COUNTIFS(Test,A5,Nimi,B5,Aeg,\">=\"&C5)","v":8}]
["Test01","Robert Lentso","2019-11-30T09:20:24.603",22,1]
["Test03","Sander Kell","2019-11-14T08:35:59.974",55,2]
["Test04","Kristina Merila","2019-11-21T20:48:11.179",78,5]
["Test01","Kertu Heinsoo","2019-11-28T19:05:40.022",70,3]
["Test03","Kertu Heinsoo","2019-11-20T20:41:35.651",75,6]
["Test01","Urmas Lõhmus","2019-11-13T14:20:00.655",45,4]
["Test04","Robert Lentso","2019-11-17T20:51:19.625",59,3]
["Test03","Joonas Haljas","2019-11-23T08:56:43.995",40,2]
["Test04","Urmas Lõhmus","2019-11-23T15:08:20.630",96,2]
["Test02","Robert Lentso","2019-11-13T17:35:12.257",68,7]
["Test03","Kristina Merila","2019-11-15T16:15:08.575",59,6]
["Test02","Hans Kukk","2019-11-01T10:22:42.466",26,9]
["Test03","Rasmus Kroon","2019-11-11T14:22:22.170",73,7]
["Test01","Maarja Pihlak","2019-11-29T09:41:58.019",89,1]
["Test01","Sander Kell","2019-11-09T13:18:08.716",30,9]
["Test04","Joonas Haljas","2019-11-22T16:27:02.789",57,1]
["Test02","Reimo Kala","2019-11-22T16:20:40.046",87,2]
["Test02","Urmas Lõhmus","2019-11-02T10:17:31.185",45,10]
["Test03","Martin Aavik","2019-11-25T21:13:36.966",63,3]
["Test02","Lauri Vahtra","2019-11-25T17:23:27.962",27,3]
["Test01","Getlin Allas","2019-11-11T21:10:26.773",41,8]
["Test01","Karin Saar","2019-11-24T08:00:23.699",88,2]
["Test01","Egert Vint","2019-11-30T14:29:20.273",29,1]
["Test04","Hanna Laid","2019-11-16T11:05:59.488",36,6]
["Test02","Maarja Pihlak","2019-11-03T11:24:19.446",81,10]
["Test02","Alari Suur","2019-11-14T12:26:57.555",41,5]
["Test01","Anette Lepp","2019-11-10T23:07:57.484",43,5]
["Test01","Carmen Sõrmus","2019-11-17T08:44:30.313",32,3]
["Test04","Rasmus Kroon","2019-11-06T09:20:30.688",95,3]
["Test01","Viktoria Lumi","2019-11-18T17:25:51.432",93,3]
["Test03","Markus Niidas","2019-11-03T13:01:48.405",66,4]
["Test01","Urmas Lõhmus","2019-11-23T17:32:21.250",69,1]
["Test02","Lauri Vahtra","2019-11-08T19:49:14.237",47,9]
["Test04","Kristina Merila","2019-11-27T19:38:03.161",27,3]
["Test03","Robert Lentso","2019-11-16T21:01:02.483",85,9]
["Test01","Anette Lepp","2019-11-10T12:18:50.568",66,6]
["Test04","Kertu Heinsoo","2019-11-01T17:20:52.084",25,9]
["Test02","Markus Niidas","2019-11-07T13:03:59.704",26,7]
["Test01","Kaspar Raude","2019-11-10T09:32:52.618",70,5]
["Test04","Hanna Laid","2019-11-19T15:29:08.312",52,4]
["Test04","Viktoria Lumi","2019-11-26T17:49:25.919",98,2]
["Test02","Tarvo Järv","2019-11-15T17:04:37.910",45,8]
["Test02","Tarvo Järv","2019-11-25T16:48:34.680",48,4]
["Test04","Kaspar Raude","2019-11-03T14:36:34.996",65,8]
["Test01","Armin Kaasik","2019-11-06T12:10:20.256",95,5]
["Test04","Hans Kukk","2019-11-26T21:49:28.605",73,4]
["Test01","Sander Kell","2019-11-04T22:27:01.154",30,10]
["Test02","Tarvo Järv","2019-11-08T19:47:42.241",64,10]
["Test03","Katrin Laurits","2019-11-15T13:04:57.541",41,5]
["Test01","Diana Taal","2019-11-01T12:10:37.538",86,8]
["Test04","Brita Kaljula","2019-11-08T08:30:49.316",30,8]
["Test02","Emili Loorits","2019-11-19T19:00:03.572",92,4]
["Test04","Viktoria Lumi","2019-11-04T17:02:17.438",79,7]
["Test01","Alari Suur","2019-11-20T19:46:51.184",43,4]
["Test04","Jaagup Kivi","2019-11-14T11:07:38.995",72,7]
["Test03","Robert Lentso","2019-11-29T23:36:45.387",24,3]
["Test01","Jaagup Kivi","2019-11-14T13:05:29.465",29,4]
["Test02","Anette Lepp","2019-11-02T23:02:55.140",70,6]
["Test01","Tarvo Järv","2019-11-06T15:43:19.934",87,4]
["Test04","Getlin Allas","2019-11-11T10:28:27.646",28,3]
["Test03","Anette Lepp","2019-11-28T18:36:14.503",97,3]
["Test02","Rasmus Kroon","2019-11-11T11:13:28.317",45,6]
["Test03","Maarja Pihlak","2019-11-22T17:55:23.982",87,3]
["Test01","Kristina Merila","2019-11-14T14:52:28.851",72,{"$f":"COUNTIFS(Test,A69,Nimi,B69,Aeg,\">=\"&C69)","v":1}]
["Test04","Lauri Vahtra","2019-11-24T23:10:52.883",33,2]
["Test04","Brita Kaljula","2019-11-25T10:04:14.109",60,2]
["Test04","Robert Lentso","2019-11-10T15:07:43.267",52,6]
["Test02","Joonas Haljas","2019-11-24T11:24:39.626",55,4]
["Test04","Mihkel Kulp","2019-11-26T15:44:50.085",88,1]
["Test03","Viktoria Lumi","2019-11-22T21:30:12.893",98,4]
["Test03","Tarvo Järv","2019-11-16T15:42:06.281",24,4]
["Test04","Anette Lepp","2019-11-08T12:53:06.590",74,9]
["Test01","Rasmus Kroon","2019-11-01T23:48:33.011",83,11]
["Test01","Artur Piiri","2019-11-18T10:58:29.104",98,2]
["Test02","Erik Pärn","2019-11-01T21:18:20.191",71,15]
["Test01","Armin Kaasik","2019-11-22T22:30:37.591",84,3]
["Test01","Jana Kiisk","2019-11-29T11:20:48.827",53,2]
["Test02","Markus Niidas","2019-11-29T16:10:32.418",87,1]
["Test03","Diana Taal","2019-11-24T14:27:31.071",95,3]
["Test04","Hanna Laid","2019-11-15T17:54:59.868",34,8]
["Test04","Paul Hein","2019-11-20T15:38:03.244",44,1]
["Test03","Jaagup Kivi","2019-11-16T16:21:24.109",27,6]
["Test02","Viktoria Lumi","2019-11-23T11:45:25.515",89,2]
["Test02","Anna Koel","2019-11-05T13:18:36.109",25,5]
["Test04","Hans Kukk","2019-11-26T18:55:40.466",66,5]
["Test03","Reimo Kala","2019-11-19T14:51:21.555",26,2]
["Test04","Alari Suur","2019-11-23T08:33:36.310",65,3]
["Test02","Brita Kaljula","2019-11-11T12:18:53.300",24,5]
["Test02","Egert Vint","2019-11-06T17:07:34.860",37,6]
["Test02","Mihkel Kulp","2019-11-25T22:48:53.848",43,5]
["Test02","Diana Taal","2019-11-25T18:09:02.690",93,2]
["Test02","Getlin Allas","2019-11-28T10:20:51.957",59,1]
["Test01","Tarvo Järv","2019-11-11T12:35:57.181",66,2]
["Test01","Carmen Sõrmus","2019-11-09T23:11:27.574",55,6]
["Test01","Kaspar Raude","2019-11-08T17:08:49.728",61,6]
["Test04","Kaspar Raude","2019-11-05T23:39:20.081",31,6]
["Test03","Martin Aavik","2019-11-02T18:30:33.260",23,15]
["Test02","Mihkel Kulp","2019-11-28T21:32:53.818",92,2]
["Test03","Tarvo Järv","2019-11-07T09:18:25.008",97,9]
["Test02","Armin Kaasik","2019-11-14T20:43:09.474",23,6]
["Test03","Urmas Lõhmus","2019-11-12T09:38:19.905",24,6]
["Test04","Jaagup Kivi","2019-11-30T22:52:37.393",82,2]
["Test01","Armin Kaasik","2019-11-27T21:55:55.696",87,1]
["Test03","Brita Kaljula","2019-11-22T10:11:56.271",92,4]
["Test03","Hans Kukk","2019-11-16T11:50:16.527",71,8]
["Test03","Jana Kiisk","2019-11-04T12:24:03.817",39,7]
["Test04","Martin Aavik","2019-11-20T10:51:47.910",99,3]
["Test02","Katrin Laurits","2019-11-15T08:40:33.908",84,5]
["Test02","Maarja Pihlak","2019-11-21T18:37:39.613",55,3]
["Test04","Paul Hein","2019-11-17T12:43:23.509",83,2]
["Test02","Maarja Pihlak","2019-11-22T20:37:05.053",84,2]
["Test04","Viktoria Lumi","2019-11-24T21:35:52.299",52,4]
["Test04","Alari Suur","2019-11-03T17:13:56.298",66,9]
["Test02","Katrin Laurits","2019-11-07T23:11:38.610",62,6]
["Test02","Paul Hein","2019-11-23T22:54:27.058",49,3]
["Test02","Kristina Merila","2019-11-15T21:39:52.344",52,6]
["Test03","Getlin Allas","2019-11-01T21:21:23.168",79,9]
["Test04","Carmen Sõrmus","2019-11-04T12:56:59.157",86,3]
["Test04","Kertu Heinsoo","2019-11-25T12:41:03.433",25,2]
["Test04","Karin Saar","2019-11-04T10:04:34.492",32,9]
["Test03","Kristina Merila","2019-11-01T16:42:02.460",34,9]
["Test02","Emili Loorits","2019-11-11T17:46:54.434",84,8]
["Test04","Tarvo Järv","2019-11-04T11:43:29.423",85,8]
["Test04","Urmas Lõhmus","2019-11-25T23:16:05.398",85,1]
["Test04","Joonas Haljas","2019-11-01T13:09:36.835",28,7]
["Test04","Alari Suur","2019-11-18T18:09:08.869",20,7]
["Test03","Getlin Allas","2019-11-07T10:16:15.309",35,6]
["Test02","Anette Lepp","2019-11-17T15:22:08.392",52,{"$f":"COUNTIFS(Test,A133,Nimi,B133,Aeg,\">=\"&C133)","v":3}]
["Test02","Kristina Merila","2019-11-15T17:59:01.733",59,7]
["Test03","Getlin Allas","2019-11-14T08:50:00.581",37,5]
["Test01","Sander Kell","2019-11-28T13:40:17.971",52,2]
["Test02","Viktoria Lumi","2019-11-20T08:21:57.267",73,3]
["Test04","Alari Suur","2019-11-19T23:03:32.204",35,6]
["Test02","Markus Niidas","2019-11-18T10:56:39.202",50,5]
["Test04","Diana Taal","2019-11-09T14:33:14.092",85,7]
["Test02","Maarja Pihlak","2019-11-10T16:22:13.249",31,7]
["Test04","Artur Piiri","2019-11-04T16:55:50.081",22,7]
["Test02","Robert Lentso","2019-11-29T19:52:59.877",85,2]
["Test03","Kertu Heinsoo","2019-11-07T22:05:38.694",72,13]
["Test02","Sander Kell","2019-11-27T19:24:57.675",23,1]
["Test03","Artur Piiri","2019-11-18T18:39:09.688",26,5]
["Test01","Reimo Kala","2019-11-13T12:39:48.620",91,4]
["Test02","Maarja Pihlak","2019-11-04T20:58:10.732",71,9]
["Test02","Jana Kiisk","2019-11-17T11:56:09.027",26,6]
["Test01","Martin Aavik","2019-11-12T16:40:37.776",33,8]
["Test03","Kertu Heinsoo","2019-11-26T16:39:22.651",60,2]
["Test01","Artur Piiri","2019-11-28T17:52:28.280",78,1]
["Test04","Brita Kaljula","2019-11-02T15:57:33.053",100,10]
["Test03","Tarvo Järv","2019-11-21T17:38:41.594",69,1]
["Test02","Erik Pärn","2019-11-24T22:47:55.696",55,4]
["Test02","Kristina Merila","2019-11-29T10:47:29.306",83,1]
["Test02","Tarvo Järv","2019-11-13T13:05:21.533",87,9]
["Test03","Kertu Heinsoo","2019-11-04T13:22:43.512",48,14]
["Test01","Kertu Heinsoo","2019-11-20T23:09:53.955",52,5]
["Test01","Hanna Laid","2019-11-19T12:40:09.048",92,6]
["Test02","Emili Loorits","2019-11-01T19:30:00.732",89,11]
["Test03","Alari Suur","2019-11-03T10:22:53.782",81,8]
["Test03","Carmen Sõrmus","2019-11-09T22:21:38.750",46,6]
["Test04","Urmas Lõhmus","2019-11-12T17:48:20.799",32,5]
["Test03","Katrin Laurits","2019-11-28T14:38:45.536",49,1]
["Test01","Tarvo Järv","2019-11-08T21:24:09.366",40,3]
["Test04","Lauri Vahtra","2019-11-18T11:42:19.225",90,3]
["Test04","Anna Koel","2019-11-27T19:23:51.203",66,5]
["Test04","Tarvo Järv","2019-11-02T13:21:11.477",60,9]
["Test02","Anna Koel","2019-11-28T09:54:05.430",32,1]
["Test03","Artur Piiri","2019-11-25T11:25:27.279",35,1]
["Test02","Egert Vint","2019-11-02T22:50:38.213",81,8]
["Test03","Kertu Heinsoo","2019-11-13T19:31:17.253",63,8]
["Test03","Lauri Vahtra","2019-11-06T09:33:37.903",25,10]
["Test02","Joonas Haljas","2019-11-08T10:33:20.504",25,10]
["Test03","Brita Kaljula","2019-11-16T08:19:11.680",57,6]
["Test02","Emili Loorits","2019-11-11T20:52:58.476",72,7]
["Test04","Armin Kaasik","2019-11-25T19:39:25.035",54,3]
["Test01","Emili Loorits","2019-11-17T19:27:05.584",62,3]
["Test03","Getlin Allas","2019-11-24T15:10:58.980",65,1]
["Test03","Joonas Haljas","2019-11-16T15:29:16.307",43,6]
["Test02","Mihkel Kulp","2019-11-01T13:03:03.548",37,11]
["Test02","Hanna Laid","2019-11-03T08:57:56.563",56,3]
["Test01","Viktoria Lumi","2019-11-06T10:19:12.386",86,7]
["Test04","Hanna Laid","2019-11-03T15:47:04.312",32,15]
["Test03","Getlin Allas","2019-11-19T23:46:40.880",74,3]
["Test04","Karin Saar","2019-11-13T22:53:57.480",21,4]
["Test02","Kristina Merila","2019-11-09T09:30:06.068",38,12]
["Test01","Maarja Pihlak","2019-11-15T17:42:36.640",45,5]
["Test01","Kertu Heinsoo","2019-11-30T22:23:05.473",47,1]
["Test01","Kristina Merila","2019-11-13T08:08:38.401",26,3]
["Test01","Martin Aavik","2019-11-22T09:07:55.238",48,4]
["Test02","Anna Koel","2019-11-07T09:56:49.567",61,4]
["Test04","Getlin Allas","2019-11-24T16:32:33.448",38,2]
["Test02","Diana Taal","2019-11-18T08:09:05.990",46,4]
["Test04","Hanna Laid","2019-11-23T23:06:37.372",57,3]
["Test02","Emili Loorits","2019-11-23T22:01:46.344",51,{"$f":"COUNTIFS(Test,A197,Nimi,B197,Aeg,\">=\"&C197)","v":2}]
["Test01","Lauri Vahtra","2019-11-01T22:28:04.754",64,4]
["Test02","Brita Kaljula","2019-11-24T09:26:52.902",83,2]
["Test01","Katrin Laurits","2019-11-22T22:30:32.207",75,1]
["Test01","Reimo Kala","2019-11-20T21:18:40.694",41,1]
["Test02","Sander Kell","2019-11-05T09:02:04.211",60,9]
["Test01","Lauri Vahtra","2019-11-07T11:23:24.923",35,3]
["Test02","Karin Saar","2019-11-11T16:51:06.062",51,7]
["Test02","Brita Kaljula","2019-11-06T13:47:31.633",100,8]
["Test01","Hanna Laid","2019-11-20T09:30:42.188",81,5]
["Test02","Joonas Haljas","2019-11-18T10:40:58.136",98,6]
["Test03","Tarvo Järv","2019-11-18T22:00:02.101",48,3]
["Test02","Egert Vint","2019-11-23T15:00:39.795",40,1]
["Test03","Erik Pärn","2019-11-14T12:08:58.125",45,5]
["Test01","Karin Saar","2019-11-22T18:37:41.144",95,3]
["Test01","Urmas Lõhmus","2019-11-14T17:17:27.217",71,3]
["Test02","Robert Lentso","2019-11-30T23:44:35.957",84,1]
["Test02","Hanna Laid","2019-11-19T18:48:05.611",84,1]
["Test03","Emili Loorits","2019-11-02T22:06:58.760",85,5]
["Test01","Armin Kaasik","2019-11-12T12:27:25.392",44,4]
["Test02","Reimo Kala","2019-11-05T21:53:48.497",51,5]
["Test04","Rasmus Kroon","2019-11-09T12:00:20.809",92,2]
["Test03","Brita Kaljula","2019-11-26T08:06:08.801",36,2]
["Test01","Jaagup Kivi","2019-11-23T15:10:15.393",87,2]
["Test02","Erik Pärn","2019-11-20T23:06:51.128",94,6]
["Test03","Jaagup Kivi","2019-11-15T14:24:26.149",87,8]
["Test04","Kaspar Raude","2019-11-07T19:28:08.703",87,5]
["Test03","Sander Kell","2019-11-09T13:49:15.486",77,4]
["Test02","Joonas Haljas","2019-11-29T09:43:35.393",51,2]
["Test03","Urmas Lõhmus","2019-11-08T20:17:01.805",99,8]
["Test04","Kertu Heinsoo","2019-11-07T21:06:00.666",61,5]
["Test04","Martin Aavik","2019-11-28T19:44:12.980",84,1]
["Test04","Egert Vint","2019-11-27T11:44:49.921",35,1]
["Test02","Getlin Allas","2019-11-24T13:15:48.906",71,4]
["Test01","Armin Kaasik","2019-11-02T17:43:45.010",77,6]
["Test01","Reimo Kala","2019-11-19T10:18:32.173",89,3]
["Test03","Hans Kukk","2019-11-27T20:58:59.960",51,4]
["Test02","Kristina Merila","2019-11-16T15:06:23.968",73,4]
["Test02","Maarja Pihlak","2019-11-01T10:10:07.908",97,11]
["Test03","Lauri Vahtra","2019-11-09T09:03:18.909",58,7]
["Test02","Jana Kiisk","2019-11-11T17:05:12.773",37,7]
["Test02","Getlin Allas","2019-11-03T12:35:38.461",35,13]
["Test02","Maarja Pihlak","2019-11-19T10:00:00.201",45,4]
["Test01","Anette Lepp","2019-11-07T15:04:56.018",63,7]
["Test02","Viktoria Lumi","2019-11-13T17:32:32.522",77,6]
["Test04","Anette Lepp","2019-11-06T08:51:36.932",22,10]
["Test04","Anna Koel","2019-11-23T11:26:03.532",43,8]
["Test01","Reimo Kala","2019-11-08T14:31:45.646",38,7]
["Test04","Jaagup Kivi","2019-11-01T08:04:11.164",72,14]
["Test02","Erik Pärn","2019-11-26T14:19:45.904",73,2]
["Test01","Anette Lepp","2019-11-01T21:01:08.587",80,12]
["Test04","Tarvo Järv","2019-11-30T17:11:17.226",81,1]
["Test03","Maarja Pihlak","2019-11-24T14:56:08.406",84,2]
["Test02","Kertu Heinsoo","2019-11-19T18:15:21.990",62,4]
["Test02","Viktoria Lumi","2019-11-03T16:46:57.446",38,11]
["Test03","Alari Suur","2019-11-24T21:23:39.521",55,2]
["Test03","Tarvo Järv","2019-11-13T20:37:33.708",62,7]
["Test01","Alari Suur","2019-11-18T17:00:07.126",22,5]
["Test03","Hans Kukk","2019-11-30T13:30:38.512",78,1]
["Test04","Lauri Vahtra","2019-11-12T09:34:53.105",62,6]
["Test02","Sander Kell","2019-11-13T18:19:03.776",50,6]
["Test01","Lauri Vahtra","2019-11-27T13:57:22.505",98,1]
["Test01","Markus Niidas","2019-11-27T17:09:34.639",26,2]
["Test01","Maarja Pihlak","2019-11-22T12:34:24.357",60,4]
["Test01","Hanna Laid","2019-11-23T18:51:57.535",37,{"$f":"COUNTIFS(Test,A261,Nimi,B261,Aeg,\">=\"&C261)","v":3}]
["Test02","Rasmus Kroon","2019-11-29T14:22:49.607",33,1]
["Test01","Martin Aavik","2019-11-29T22:47:56.400",40,1]
["Test04","Kristina Merila","2019-11-05T22:01:37.046",89,10]
["Test04","Egert Vint","2019-11-08T18:09:13.176",73,6]
["Test02","Lauri Vahtra","2019-11-30T11:27:06.027",93,1]
["Test01","Getlin Allas","2019-11-16T15:09:29.581",80,4]
["Test01","Anette Lepp","2019-11-13T08:18:54.141",42,4]
["Test04","Tarvo Järv","2019-11-14T20:36:27.817",59,4]
["Test02","Karin Saar","2019-11-17T10:12:45.487",35,2]
["Test04","Hans Kukk","2019-11-04T09:03:27.630",96,9]
["Test01","Erik Pärn","2019-11-26T23:25:54.457",36,4]
["Test02","Robert Lentso","2019-11-16T22:58:58.232",67,5]
["Test03","Hanna Laid","2019-11-12T13:00:31.891",96,5]
["Test04","Urmas Lõhmus","2019-11-04T16:08:25.026",87,7]
["Test01","Sander Kell","2019-11-18T13:31:07.386",74,5]
["Test02","Emili Loorits","2019-11-02T09:21:37.935",76,10]
["Test04","Hanna Laid","2019-11-14T23:22:09.569",47,9]
["Test03","Katrin Laurits","2019-11-01T18:51:52.050",94,8]
["Test01","Alari Suur","2019-11-07T17:21:13.536",85,9]
["Test03","Getlin Allas","2019-11-19T13:27:17.989",55,4]
["Test01","Karin Saar","2019-11-07T08:26:39.509",74,8]
["Test03","Anette Lepp","2019-11-30T22:23:26.186",52,1]
["Test02","Getlin Allas","2019-11-04T08:40:49.696",92,12]
["Test04","Maarja Pihlak","2019-11-25T17:10:55.311",41,1]
["Test03","Paul Hein","2019-11-25T23:54:31.669",97,5]
["Test01","Egert Vint","2019-11-10T11:05:36.158",63,6]
["Test02","Sander Kell","2019-11-03T12:50:22.460",49,10]
["Test01","Getlin Allas","2019-11-18T18:11:24.131",42,2]
["Test04","Hans Kukk","2019-11-28T21:13:32.619",52,1]
["Test01","Hans Kukk","2019-11-06T09:12:26.824",65,6]
["Test03","Karin Saar","2019-11-10T14:58:20.221",81,5]
["Test02","Markus Niidas","2019-11-22T20:34:31.240",66,2]
["Test01","Kaspar Raude","2019-11-17T16:33:09.881",95,4]
["Test03","Artur Piiri","2019-11-15T22:33:17.133",33,8]
["Test03","Joonas Haljas","2019-11-04T11:38:26.307",38,8]
["Test02","Kristina Merila","2019-11-09T20:11:53.375",24,11]
["Test04","Paul Hein","2019-11-15T20:06:26.415",22,3]
["Test03","Kaspar Raude","2019-11-08T09:34:29.637",29,3]
["Test02","Alari Suur","2019-11-08T21:14:04.222",86,7]
["Test01","Robert Lentso","2019-11-28T16:26:06.399",55,2]
["Test03","Hanna Laid","2019-11-07T09:02:33.831",53,6]
["Test04","Karin Saar","2019-11-13T09:23:25.356",98,6]
["Test03","Lauri Vahtra","2019-11-06T21:40:34.662",92,9]
["Test01","Sander Kell","2019-11-11T11:28:50.370",77,8]
["Test04","Kristina Merila","2019-11-28T21:02:45.049",70,2]
["Test03","Robert Lentso","2019-11-28T20:42:23.383",68,4]
["Test04","Diana Taal","2019-11-28T14:29:33.431",80,1]
["Test02","Markus Niidas","2019-11-09T20:03:05.742",61,6]
["Test01","Viktoria Lumi","2019-11-20T19:48:49.123",26,1]
["Test01","Sander Kell","2019-11-02T12:48:19.036",55,11]
["Test02","Karin Saar","2019-11-13T22:57:21.662",34,5]
["Test02","Sander Kell","2019-11-25T09:44:25.716",86,4]
["Test02","Brita Kaljula","2019-11-08T21:54:47.300",84,6]
["Test02","Kaspar Raude","2019-11-12T15:11:21.941",94,1]
["Test04","Armin Kaasik","2019-11-08T10:03:44.338",30,7]
["Test03","Alari Suur","2019-11-14T20:08:50.786",63,4]
["Test02","Urmas Lõhmus","2019-11-08T09:05:29.853",46,8]
["Test03","Urmas Lõhmus","2019-11-10T20:55:13.997",43,7]
["Test04","Tarvo Järv","2019-11-10T17:52:56.156",72,6]
["Test04","Jana Kiisk","2019-11-26T16:45:24.264",91,1]
["Test04","Katrin Laurits","2019-11-15T15:06:27.432",92,6]
["Test01","Joonas Haljas","2019-11-30T18:03:35.030",81,1]
["Test03","Rasmus Kroon","2019-11-25T09:39:25.147",49,3]
["Test02","Anette Lepp","2019-11-21T22:44:11.810",88,{"$f":"COUNTIFS(Test,A325,Nimi,B325,Aeg,\">=\"&C325)","v":1}]
["Test03","Kertu Heinsoo","2019-11-22T15:34:38.715",95,5]
["Test02","Viktoria Lumi","2019-11-15T16:44:39.887",76,5]
["Test01","Artur Piiri","2019-11-01T14:58:44.699",79,4]
["Test04","Artur Piiri","2019-11-17T08:25:09.783",40,4]
["Test03","Lauri Vahtra","2019-11-26T15:13:22.436",94,1]
["Test01","Egert Vint","2019-11-22T10:23:23.826",34,3]
["Test03","Artur Piiri","2019-11-17T13:38:40.054",93,6]
["Test04","Hans Kukk","2019-11-08T08:34:48.314",89,7]
["Test02","Erik Pärn","2019-11-06T17:46:41.163",51,11]
["Test04","Artur Piiri","2019-11-10T15:28:33.743",77,5]
["Test02","Martin Aavik","2019-11-17T08:08:55.516",63,3]
["Test04","Kertu Heinsoo","2019-11-04T21:53:06.203",55,8]
["Test03","Kaspar Raude","2019-11-03T23:33:13.333",34,5]
["Test01","Maarja Pihlak","2019-11-26T16:53:34.006",99,2]
["Test02","Viktoria Lumi","2019-11-18T15:44:19.906",98,4]
["Test04","Anette Lepp","2019-11-12T14:45:06.704",40,5]
["Test02","Martin Aavik","2019-11-19T12:11:42.442",49,1]
["Test01","Martin Aavik","2019-11-22T18:33:15.463",52,3]
["Test02","Paul Hein","2019-11-24T19:17:17.190",83,2]
["Test03","Jaagup Kivi","2019-11-17T08:58:10.973",59,5]
["Test04","Maarja Pihlak","2019-11-13T23:46:04.859",91,6]
["Test03","Martin Aavik","2019-11-02T20:18:01.669",93,14]
["Test04","Maarja Pihlak","2019-11-06T16:02:27.904",40,10]
["Test03","Getlin Allas","2019-11-05T20:13:14.726",38,8]
["Test03","Urmas Lõhmus","2019-11-08T13:57:11.465",85,9]
["Test03","Reimo Kala","2019-11-18T20:08:30.435",31,3]
["Test03","Joonas Haljas","2019-11-30T14:47:28.180",62,1]
["Test04","Anette Lepp","2019-11-15T11:09:02.721",30,4]
["Test03","Urmas Lõhmus","2019-11-06T10:38:40.023",74,10]
["Test03","Joonas Haljas","2019-11-22T22:59:05.188",98,3]
["Test02","Alari Suur","2019-11-27T22:38:28.671",91,1]
["Test03","Reimo Kala","2019-11-11T13:19:25.242",97,4]
["Test01","Kertu Heinsoo","2019-11-18T18:42:58.809",89,7]
["Test01","Emili Loorits","2019-11-26T10:01:18.219",38,1]
["Test04","Erik Pärn","2019-11-13T10:37:20.017",45,6]
["Test02","Carmen Sõrmus","2019-11-13T10:24:01.372",97,7]
["Test04","Lauri Vahtra","2019-11-06T08:52:24.461",96,8]
["Test02","Egert Vint","2019-11-19T09:42:55.596",31,2]
["Test01","Martin Aavik","2019-11-06T23:09:38.819",74,9]
["Test02","Diana Taal","2019-11-24T23:38:08.364",71,3]
["Test01","Artur Piiri","2019-11-17T20:43:25.410",29,3]
["Test01","Mihkel Kulp","2019-11-25T08:08:17.260",54,3]
["Test03","Urmas Lõhmus","2019-11-28T16:22:17.438",46,1]
["Test02","Robert Lentso","2019-11-26T21:26:50.317",21,3]
["Test03","Jaagup Kivi","2019-11-17T18:14:35.353",42,4]
["Test03","Anette Lepp","2019-11-07T18:14:22.195",92,11]
["Test01","Kaspar Raude","2019-11-24T10:49:38.599",33,2]
["Test01","Sander Kell","2019-11-17T20:05:43.153",68,6]
["Test01","Mihkel Kulp","2019-11-12T11:43:45.816",77,5]
["Test04","Carmen Sõrmus","2019-11-25T20:29:12.185",62,1]
["Test03","Diana Taal","2019-11-21T17:48:12.547",64,5]
["Test01","Brita Kaljula","2019-11-02T10:17:08.710",99,10]
["Test02","Erik Pärn","2019-11-16T20:56:07.631",84,8]
["Test02","Paul Hein","2019-11-17T11:17:45.292",69,5]
["Test03","Erik Pärn","2019-11-12T16:12:02.061",83,6]
["Test04","Kertu Heinsoo","2019-11-07T12:57:32.760",100,7]
["Test03","Egert Vint","2019-11-17T13:10:11.245",80,3]
["Test03","Diana Taal","2019-11-20T18:46:48.627",85,7]
["Test02","Paul Hein","2019-11-06T09:28:49.975",39,8]
["Test03","Reimo Kala","2019-11-21T14:05:31.166",98,1]
["Test02","Carmen Sõrmus","2019-11-05T17:08:43.875",89,8]
["Test02","Rasmus Kroon","2019-11-16T20:34:22.921",92,5]
["Test02","Martin Aavik","2019-11-15T17:46:33.483",49,4]
["Test02","Kristina Merila","2019-11-12T10:04:30.834",47,{"$f":"COUNTIFS(Test,A389,Nimi,B389,Aeg,\">=\"&C389)","v":9}]
["Test03","Kristina Merila","2019-11-25T17:23:10.128",81,2]
["Test02","Kristina Merila","2019-11-08T20:20:46.311",21,13]
["Test03","Hanna Laid","2019-11-14T11:42:05.611",84,4]
["Test01","Alari Suur","2019-11-17T11:51:42.802",46,6]
["Test03","Kristina Merila","2019-11-20T10:09:49.643",97,4]
["Test03","Robert Lentso","2019-11-20T14:21:04.479",24,8]
["Test02","Diana Taal","2019-11-16T09:15:29.769",38,6]
["Test04","Anette Lepp","2019-11-26T09:11:15.915",23,2]
["Test04","Egert Vint","2019-11-04T17:24:39.785",60,8]
["Test03","Maarja Pihlak","2019-11-28T17:29:21.495",68,1]
["Test02","Brita Kaljula","2019-11-15T16:55:14.887",30,3]
["Test03","Hans Kukk","2019-11-09T22:56:40.665",31,9]
["Test01","Emili Loorits","2019-11-21T18:32:31.398",69,2]
["Test03","Urmas Lõhmus","2019-11-23T12:38:08.781",75,3]
["Test02","Carmen Sõrmus","2019-11-25T15:22:15.192",55,1]
["Test01","Rasmus Kroon","2019-11-21T14:27:48.297",74,6]
["Test02","Jana Kiisk","2019-11-04T21:21:26.022",79,11]
["Test04","Viktoria Lumi","2019-11-01T17:23:39.436",62,9]
["Test03","Kaspar Raude","2019-11-07T16:21:30.962",66,4]
["Test04","Sander Kell","2019-11-23T08:31:52.651",46,2]
["Test03","Paul Hein","2019-11-27T16:07:35.128",88,3]
["Test04","Hanna Laid","2019-11-01T19:02:50.564",38,17]
["Test04","Anna Koel","2019-11-29T14:42:55.113",70,2]
["Test04","Mihkel Kulp","2019-11-10T16:32:28.877",59,5]
["Test01","Diana Taal","2019-11-04T15:56:04.278",70,7]
["Test01","Anette Lepp","2019-11-07T08:42:32.558",88,8]
["Test03","Mihkel Kulp","2019-11-22T08:51:24.983",49,4]
["Test01","Paul Hein","2019-11-19T20:09:24.942",45,3]
["Test02","Karin Saar","2019-11-20T22:15:31.154",62,1]
["Test01","Brita Kaljula","2019-11-20T14:13:47.808",80,4]
["Test03","Sander Kell","2019-11-22T21:53:22.691",60,1]
["Test02","Karin Saar","2019-11-06T11:09:18.574",51,9]
["Test03","Kristina Merila","2019-11-21T20:07:07.937",70,3]
["Test03","Joonas Haljas","2019-11-01T12:24:21.187",99,9]
["Test03","Katrin Laurits","2019-11-22T21:54:22.842",86,2]
["Test03","Rasmus Kroon","2019-11-22T21:42:48.449",27,5]
["Test04","Emili Loorits","2019-11-15T21:59:54.928",84,5]
["Test02","Alari Suur","2019-11-14T22:39:53.589",64,4]
["Test01","Hans Kukk","2019-11-13T10:22:18.402",32,5]
["Test04","Brita Kaljula","2019-11-18T20:04:31.965",54,4]
["Test01","Hans Kukk","2019-11-01T09:48:32.247",100,9]
["Test01","Anette Lepp","2019-11-26T16:36:37.655",60,1]
["Test01","Markus Niidas","2019-11-28T20:17:20.276",50,1]
["Test04","Kristina Merila","2019-11-29T23:29:49.100",20,1]
["Test04","Artur Piiri","2019-11-17T18:01:39.064",92,3]
["Test01","Diana Taal","2019-11-07T14:17:45.983",35,5]
["Test03","Hanna Laid","2019-11-02T22:49:33.783",71,9]
["Test02","Kristina Merila","2019-11-28T20:58:11.340",36,2]
["Test01","Erik Pärn","2019-11-05T11:25:02.448",61,9]
["Test03","Brita Kaljula","2019-11-02T16:35:37.027",43,12]
["Test03","Alari Suur","2019-11-22T08:50:27.050",84,3]
["Test04","Alari Suur","2019-11-01T20:22:22.236",43,10]
["Test04","Getlin Allas","2019-11-09T13:42:46.363",98,5]
["Test01","Erik Pärn","2019-11-06T19:16:11.199",76,7]
["Test04","Katrin Laurits","2019-11-19T17:11:37.357",97,3]
["Test02","Maarja Pihlak","2019-11-23T16:57:10.761",68,1]
["Test04","Emili Loorits","2019-11-07T20:55:59.140",49,6]
["Test03","Robert Lentso","2019-11-02T15:25:20.960",27,14]
["Test02","Brita Kaljula","2019-11-29T19:25:13.203",75,1]
["Test01","Anette Lepp","2019-11-04T21:47:13.005",54,10]
["Test04","Kristina Merila","2019-11-25T20:37:39.192",65,4]
["Test01","Karin Saar","2019-11-19T19:30:16.239",71,5]
["Test02","Paul Hein","2019-11-30T15:28:14.869",63,1]
["Test01","Erik Pärn","2019-11-28T17:25:55.298",34,{"$f":"COUNTIFS(Test,A453,Nimi,B453,Aeg,\">=\"&C453)","v":3}]
["Test02","Jaagup Kivi","2019-11-11T14:44:56.025",97,3]
["Test01","Karin Saar","2019-11-26T17:29:01.923",93,1]
["Test01","Carmen Sõrmus","2019-11-05T14:35:28.632",21,8]
["Test01","Rasmus Kroon","2019-11-22T17:52:00.137",68,4]
["Test02","Mihkel Kulp","2019-11-07T20:45:32.836",22,8]
["Test01","Maarja Pihlak","2019-11-09T22:54:58.729",93,7]
["Test03","Anna Koel","2019-11-09T11:57:42.460",49,5]
["Test03","Anna Koel","2019-11-26T10:43:39.655",29,1]
["Test02","Diana Taal","2019-11-05T12:18:08.313",71,7]
["Test04","Artur Piiri","2019-11-22T19:17:50.218",79,2]
["Test02","Maarja Pihlak","2019-11-15T19:34:58.393",97,6]
["Test02","Emili Loorits","2019-11-03T08:44:43.048",62,9]
["Test02","Joonas Haljas","2019-11-11T12:25:07.977",70,9]
["Test04","Viktoria Lumi","2019-11-27T16:43:11.469",52,1]
["Test01","Anette Lepp","2019-11-14T21:15:12.714",77,3]
["Test04","Tarvo Järv","2019-11-09T17:37:36.767",53,7]
["Test01","Paul Hein","2019-11-23T22:32:39.520",77,2]
["Test01","Diana Taal","2019-11-27T19:14:33.031",52,1]
["Test01","Reimo Kala","2019-11-02T16:08:25.189",43,8]
["Test04","Anna Koel","2019-11-08T20:42:32.487",97,17]
["Test02","Artur Piiri","2019-11-21T08:31:31.958",79,2]
["Test01","Mihkel Kulp","2019-11-27T14:40:31.455",23,1]
["Test04","Egert Vint","2019-11-16T09:16:15.845",59,5]
["Test03","Jana Kiisk","2019-11-04T22:26:54.803",74,6]
["Test02","Lauri Vahtra","2019-11-24T20:33:18.799",66,4]
["Test04","Artur Piiri","2019-11-08T13:49:55.195",73,6]
["Test03","Anette Lepp","2019-11-21T17:25:01.101",94,4]
["Test01","Anette Lepp","2019-11-03T18:38:18.069",30,11]
["Test04","Alari Suur","2019-11-11T23:21:13.805",93,8]
["Test04","Jaagup Kivi","2019-11-30T22:58:37.332",33,1]
["Test04","Kaspar Raude","2019-11-13T14:45:12.350",44,3]
["Test04","Anna Koel","2019-11-25T17:43:02.368",71,7]
["Test03","Joonas Haljas","2019-11-19T13:26:31.660",25,5]
["Test02","Jana Kiisk","2019-11-22T08:57:55.626",78,4]
["Test03","Viktoria Lumi","2019-11-03T19:53:23.056",97,7]
["Test02","Joonas Haljas","2019-11-03T10:15:12.848",72,11]
["Test01","Jana Kiisk","2019-11-22T12:12:23.626",68,3]
["Test02","Urmas Lõhmus","2019-11-17T16:18:58.040",89,6]
["Test01","Hans Kukk","2019-11-26T21:09:02.659",72,1]
["Test02","Anna Koel","2019-11-24T12:23:04.863",35,3]
["Test03","Karin Saar","2019-11-08T10:41:57.151",36,7]
["Test04","Rasmus Kroon","2019-11-04T17:00:18.513",56,4]
["Test04","Hanna Laid","2019-11-18T15:40:09.392",32,5]
["Test02","Erik Pärn","2019-11-30T19:01:20.389",23,1]
["Test03","Emili Loorits","2019-11-27T14:24:38.002",25,2]
["Test01","Alari Suur","2019-11-28T08:41:57.316",75,2]
["Test01","Joonas Haljas","2019-11-16T18:37:21.607",77,7]
["Test03","Hanna Laid","2019-11-04T22:46:27.439",27,8]
["Test02","Rasmus Kroon","2019-11-21T19:31:09.153",20,4]
["Test02","Carmen Sõrmus","2019-11-23T21:10:51.112",63,3]
["Test02","Armin Kaasik","2019-11-09T18:34:29.316",40,9]
["Test04","Urmas Lõhmus","2019-11-10T21:20:51.963",50,6]
["Test02","Urmas Lõhmus","2019-11-27T16:04:25.137",57,2]
["Test02","Getlin Allas","2019-11-07T23:46:53.537",48,10]
["Test03","Kristina Merila","2019-11-27T17:43:09.171",66,1]
["Test02","Urmas Lõhmus","2019-11-23T10:06:19.257",42,4]
["Test02","Sander Kell","2019-11-06T20:29:47.129",43,8]
["Test04","Erik Pärn","2019-11-22T13:27:00.369",70,4]
["Test01","Reimo Kala","2019-11-01T12:27:27.795",31,9]
["Test02","Martin Aavik","2019-11-05T11:05:28.145",89,5]
["Test03","Getlin Allas","2019-11-22T08:42:20.881",52,2]
["Test02","Kertu Heinsoo","2019-11-25T08:05:16.708",25,3]
["Test03","Paul Hein","2019-11-05T17:45:35.784",69,8]
["Test01","Hanna Laid","2019-11-21T09:28:46.214",47,{"$f":"COUNTIFS(Test,A517,Nimi,B517,Aeg,\">=\"&C517)","v":4}]
["Test03","Robert Lentso","2019-11-21T17:48:25.781",28,6]
["Test01","Robert Lentso","2019-11-16T22:54:42.548",76,4]
["Test01","Getlin Allas","2019-11-14T22:04:52.648",43,7]
["Test01","Carmen Sõrmus","2019-11-15T12:33:13.786",34,4]
["Test04","Viktoria Lumi","2019-11-07T22:08:34.056",89,6]
["Test03","Lauri Vahtra","2019-11-25T09:20:09.138",40,3]
["Test03","Anna Koel","2019-11-01T17:19:46.284",24,6]
["Test03","Robert Lentso","2019-11-14T18:34:00.526",44,11]
["Test01","Anna Koel","2019-11-07T09:04:00.897",66,2]
["Test04","Brita Kaljula","2019-11-25T19:04:50.423",48,1]
["Test01","Tarvo Järv","2019-11-30T09:53:45.761",79,1]
["Test04","Anna Koel","2019-11-29T16:37:13.696",73,1]
["Test04","Rasmus Kroon","2019-11-15T14:04:08.413",65,1]
["Test02","Maarja Pihlak","2019-11-06T16:21:18.234",81,8]
["Test03","Tarvo Järv","2019-11-08T13:17:20.622",77,8]
["Test03","Rasmus Kroon","2019-11-25T23:19:33.093",24,2]
["Test03","Viktoria Lumi","2019-11-29T10:59:39.045",58,1]
["Test03","Brita Kaljula","2019-11-27T14:17:52.945",30,1]
["Test04","Armin Kaasik","2019-11-13T08:39:00.862",29,5]
["Test01","Joonas Haljas","2019-11-27T19:28:31.576",92,2]
["Test03","Alari Suur","2019-11-13T21:55:32.555",88,5]
["Test04","Armin Kaasik","2019-11-29T21:56:11.757",49,2]
["Test03","Mihkel Kulp","2019-11-28T11:05:11.773",88,1]
["Test04","Mihkel Kulp","2019-11-11T18:01:15.874",26,4]
["Test01","Erik Pärn","2019-11-05T12:04:17.972",51,8]
["Test04","Maarja Pihlak","2019-11-08T09:59:53.986",48,9]
["Test03","Diana Taal","2019-11-09T13:49:32.999",45,11]
["Test01","Kaspar Raude","2019-11-23T20:10:11.519",64,3]
["Test02","Hans Kukk","2019-11-06T14:22:38.505",53,6]
["Test04","Maarja Pihlak","2019-11-08T16:07:28.825",85,8]
["Test02","Tarvo Järv","2019-11-22T10:52:42.796",41,6]
["Test02","Erik Pärn","2019-11-17T13:54:36.075",53,7]
["Test02","Urmas Lõhmus","2019-11-28T21:56:26.077",33,1]
["Test01","Hans Kukk","2019-11-14T14:05:57.327",43,4]
["Test01","Kaspar Raude","2019-11-02T22:30:50.662",29,7]
["Test03","Robert Lentso","2019-11-30T18:21:59.099",65,2]
["Test01","Martin Aavik","2019-11-17T20:51:50.480",23,6]
["Test03","Robert Lentso","2019-11-04T09:23:09.661",21,13]
["Test02","Reimo Kala","2019-11-20T10:48:34.877",62,3]
["Test03","Hanna Laid","2019-11-15T23:09:40.796",99,2]
["Test01","Karin Saar","2019-11-12T13:17:56.509",66,6]
["Test02","Emili Loorits","2019-11-18T21:04:26.935",87,5]
["Test01","Getlin Allas","2019-11-28T09:37:33.101",73,1]
["Test01","Markus Niidas","2019-11-20T20:01:55.249",43,3]
["Test04","Anna Koel","2019-11-06T19:48:42.276",28,18]
["Test02","Jana Kiisk","2019-11-29T23:14:35.358",37,2]
["Test04","Joonas Haljas","2019-11-21T18:40:43.186",59,2]
["Test04","Erik Pärn","2019-11-27T21:36:21.758",80,1]
["Test03","Markus Niidas","2019-11-27T14:34:47.261",26,2]
["Test03","Paul Hein","2019-11-22T14:12:50.404",50,6]
["Test04","Katrin Laurits","2019-11-16T15:16:28.041",91,5]
["Test01","Viktoria Lumi","2019-11-19T13:45:08.313",21,2]
["Test04","Kaspar Raude","2019-11-05T13:17:43.255",89,7]
["Test02","Joonas Haljas","2019-11-25T19:34:07.771",20,3]
["Test04","Kertu Heinsoo","2019-11-26T11:20:50.179",82,1]
["Test04","Jaagup Kivi","2019-11-10T17:27:18.186",58,9]
["Test03","Karin Saar","2019-11-08T23:45:43.693",96,6]
["Test03","Katrin Laurits","2019-11-12T18:19:24.708",83,6]
["Test02","Karin Saar","2019-11-02T09:42:46.239",80,12]
["Test03","Jana Kiisk","2019-11-22T18:21:36.425",90,2]
["Test02","Kristina Merila","2019-11-11T22:12:46.247",99,10]
["Test02","Kristina Merila","2019-11-16T11:15:44.007",53,5]
["Test02","Tarvo Järv","2019-11-29T13:10:55.285",45,1]
["Test03","Erik Pärn","2019-11-11T14:35:40.891",36,{"$f":"COUNTIFS(Test,A581,Nimi,B581,Aeg,\">=\"&C581)","v":8}]
["Test03","Egert Vint","2019-11-15T13:28:58.681",77,5]
["Test03","Erik Pärn","2019-11-12T15:02:48.164",35,7]
["Test04","Rasmus Kroon","2019-11-01T19:59:00.935",61,5]
["Test01","Erik Pärn","2019-11-28T22:32:35.575",93,2]
["Test02","Jana Kiisk","2019-11-11T09:22:03.927",91,8]
["Test02","Armin Kaasik","2019-11-10T18:42:49.117",79,8]
["Test04","Maarja Pihlak","2019-11-04T18:47:30.092",69,11]
["Test03","Kertu Heinsoo","2019-11-08T18:29:00.304",40,12]
["Test02","Erik Pärn","2019-11-16T14:46:00.543",65,9]
["Test04","Hanna Laid","2019-11-25T11:57:31.304",22,2]
["Test01","Armin Kaasik","2019-11-02T15:25:54.820",95,7]
["Test01","Mihkel Kulp","2019-11-02T23:52:50.952",63,6]
["Test01","Hanna Laid","2019-11-12T19:16:46.304",38,8]
["Test02","Reimo Kala","2019-11-02T16:32:45.741",31,6]
["Test02","Markus Niidas","2019-11-05T23:28:47.201",89,8]
["Test02","Robert Lentso","2019-11-16T15:28:44.172",56,6]
["Test02","Jana Kiisk","2019-11-06T18:57:38.549",27,9]
["Test02","Lauri Vahtra","2019-11-19T12:53:02.033",77,5]
["Test04","Martin Aavik","2019-11-04T22:01:00.351",46,8]
["Test04","Egert Vint","2019-11-18T17:16:30.616",24,3]
["Test04","Joonas Haljas","2019-11-17T20:56:37.670",70,4]
["Test04","Alari Suur","2019-11-22T19:29:56.273",50,4]
["Test03","Robert Lentso","2019-11-23T10:31:06.255",49,5]
["Test02","Erik Pärn","2019-11-02T11:30:18.883",41,14]
["Test03","Alari Suur","2019-11-08T21:04:14.859",40,6]
["Test04","Armin Kaasik","2019-11-30T19:09:40.160",23,1]
["Test03","Markus Niidas","2019-11-17T22:49:55.072",79,3]
["Test01","Rasmus Kroon","2019-11-17T09:17:25.189",69,8]
["Test01","Alari Suur","2019-11-07T14:09:13.834",96,10]
["Test03","Diana Taal","2019-11-11T15:24:34.719",49,10]
["Test03","Hanna Laid","2019-11-06T17:46:39.337",74,7]
["Test04","Hanna Laid","2019-11-26T08:17:47.076",69,1]
["Test01","Maarja Pihlak","2019-11-23T15:04:27.548",88,3]
["Test04","Katrin Laurits","2019-11-23T09:47:17.405",29,1]
["Test02","Anna Koel","2019-11-26T14:16:51.847",83,2]
["Test04","Kertu Heinsoo","2019-11-07T15:33:43.551",91,6]
["Test04","Diana Taal","2019-11-20T14:42:53.832",69,3]
["Test03","Rasmus Kroon","2019-11-04T09:26:08.444",48,8]
["Test03","Lauri Vahtra","2019-11-23T14:48:03.616",95,4]
["Test03","Artur Piiri","2019-11-02T16:36:44.592",59,12]
["Test03","Anette Lepp","2019-11-08T14:57:39.366",96,10]
["Test02","Urmas Lõhmus","2019-11-05T19:25:58.069",52,9]
["Test02","Brita Kaljula","2019-11-04T11:43:01.871",60,9]
["Test03","Anna Koel","2019-11-10T15:22:51.404",35,3]
["Test04","Kristina Merila","2019-11-19T16:52:40.359",37,7]
["Test01","Rasmus Kroon","2019-11-03T16:05:36.591",50,10]
["Test03","Kristina Merila","2019-11-14T10:00:46.655",94,7]
["Test03","Jaagup Kivi","2019-11-26T12:33:55.039",72,2]
["Test04","Hans Kukk","2019-11-14T13:37:32.464",58,6]
["Test04","Mihkel Kulp","2019-11-14T15:38:26.898",95,3]
["Test04","Maarja Pihlak","2019-11-25T12:29:50.839",68,2]
["Test02","Rasmus Kroon","2019-11-01T11:59:12.279",56,9]
["Test01","Egert Vint","2019-11-27T22:24:06.868",69,2]
["Test03","Tarvo Järv","2019-11-16T09:21:34.888",61,5]
["Test04","Tarvo Järv","2019-11-26T19:50:06.709",99,2]
["Test04","Hans Kukk","2019-11-28T09:24:04.633",37,2]
["Test03","Hans Kukk","2019-11-07T08:21:09.827",61,10]
["Test02","Brita Kaljula","2019-11-12T21:03:03.206",92,4]
["Test02","Kertu Heinsoo","2019-11-28T08:27:16.483",82,1]
["Test02","Hans Kukk","2019-11-17T14:07:51.836",97,4]
["Test04","Viktoria Lumi","2019-11-09T08:51:54.123",54,5]
["Test04","Artur Piiri","2019-11-26T08:01:57.760",93,1]
["Test02","Armin Kaasik","2019-11-22T21:23:40.752",44,4]
["Test01","Katrin Laurits","2019-11-08T20:57:53.914",98,{"$f":"COUNTIFS(Test,A645,Nimi,B645,Aeg,\">=\"&C645)","v":4}]
["Test02","Artur Piiri","2019-11-23T12:05:42.783",77,1]
["Test01","Carmen Sõrmus","2019-11-24T18:59:39.437",35,2]
["Test04","Joonas Haljas","2019-11-14T20:05:20.932",86,5]
["Test03","Mihkel Kulp","2019-11-22T20:04:07.571",79,3]
["Test01","Joonas Haljas","2019-11-02T15:25:20.620",29,12]
["Test04","Anna Koel","2019-11-13T09:08:53.468",39,12]
["Test01","Mihkel Kulp","2019-11-24T11:02:03.794",88,4]
["Test03","Artur Piiri","2019-11-22T16:46:45.572",99,2]
["Test02","Brita Kaljula","2019-11-07T23:43:17.721",54,7]
["Test04","Hanna Laid","2019-11-09T11:25:54.355",99,12]
["Test01","Reimo Kala","2019-11-09T21:14:20.045",24,6]
["Test02","Mihkel Kulp","2019-11-07T12:59:39.662",25,9]
["Test03","Lauri Vahtra","2019-11-11T21:33:38.338",99,6]
["Test02","Robert Lentso","2019-11-01T09:58:13.164",99,10]
["Test03","Reimo Kala","2019-11-04T10:29:30.924",62,5]
["Test04","Getlin Allas","2019-11-05T10:58:48.860",41,6]
["Test01","Brita Kaljula","2019-11-13T19:46:23.424",23,5]
["Test02","Markus Niidas","2019-11-04T16:07:34.854",75,9]
["Test04","Katrin Laurits","2019-11-19T12:07:13.937",79,4]
["Test02","Hans Kukk","2019-11-06T09:11:44.022",40,7]
["Test03","Joonas Haljas","2019-11-15T12:14:42.467",78,7]
["Test04","Anna Koel","2019-11-09T11:40:34.327",97,16]
["Test04","Erik Pärn","2019-11-26T16:55:01.071",82,3]
["Test01","Rasmus Kroon","2019-11-17T22:25:10.179",67,7]
["Test02","Tarvo Järv","2019-11-24T16:05:24.021",35,5]
["Test03","Urmas Lõhmus","2019-11-22T16:02:28.689",39,4]
["Test02","Hans Kukk","2019-11-10T17:10:59.741",91,5]
["Test01","Getlin Allas","2019-11-18T11:43:08.147",87,3]
["Test04","Urmas Lõhmus","2019-11-03T14:37:32.826",41,8]
["Test02","Lauri Vahtra","2019-11-25T20:37:19.919",83,2]
["Test03","Martin Aavik","2019-11-21T14:49:24.704",98,5]
["Test01","Urmas Lõhmus","2019-11-07T09:19:47.186",73,6]
["Test03","Diana Taal","2019-11-28T22:23:09.497",45,2]
["Test01","Martin Aavik","2019-11-28T20:58:37.101",32,2]
["Test03","Tarvo Järv","2019-11-05T10:48:19.999",22,10]
["Test04","Getlin Allas","2019-11-03T09:47:01.183",58,8]
["Test04","Hanna Laid","2019-11-16T09:26:58.995",52,7]
["Test01","Getlin Allas","2019-11-15T08:45:52.623",59,6]
["Test03","Armin Kaasik","2019-11-07T12:30:18.980",99,6]
["Test01","Jana Kiisk","2019-11-16T23:34:20.323",79,5]
["Test04","Kertu Heinsoo","2019-11-12T13:00:10.935",28,4]
["Test04","Markus Niidas","2019-11-07T16:59:16.393",70,4]
["Test04","Jaagup Kivi","2019-11-13T18:24:16.764",93,8]
["Test03","Hans Kukk","2019-11-23T18:16:46",95,5]
["Test03","Emili Loorits","2019-11-24T22:48:49.352",47,3]
["Test02","Lauri Vahtra","2019-11-08T22:40:55.958",70,8]
["Test03","Hans Kukk","2019-11-20T18:19:51.258",100,6]
["Test03","Brita Kaljula","2019-11-15T08:49:31.736",75,7]
["Test01","Reimo Kala","2019-11-11T16:19:34.690",70,5]
["Test02","Tarvo Järv","2019-11-06T08:19:46.755",28,11]
["Test01","Egert Vint","2019-11-13T11:03:55.007",84,5]
["Test03","Emili Loorits","2019-11-13T13:31:22.155",82,4]
["Test03","Diana Taal","2019-11-14T15:54:22.298",83,9]
["Test04","Markus Niidas","2019-11-28T23:01:38.579",59,1]
["Test04","Karin Saar","2019-11-21T16:45:45.644",24,2]
["Test01","Robert Lentso","2019-11-13T18:10:42.621",66,5]
["Test04","Sander Kell","2019-11-05T23:21:57.300",83,5]
["Test01","Alari Suur","2019-11-10T15:20:14.634",30,8]
["Test03","Martin Aavik","2019-11-30T13:04:32.313",64,2]
["Test03","Robert Lentso","2019-11-20T15:42:01.063",36,7]
["Test02","Getlin Allas","2019-11-04T23:29:41.217",37,11]
["Test03","Urmas Lõhmus","2019-11-12T16:39:47.906",99,5]
["Test01","Joonas Haljas","2019-11-21T14:14:43.850",89,5]
["Test03","Maarja Pihlak","2019-11-11T22:24:54.917",61,{"$f":"COUNTIFS(Test,A709,Nimi,B709,Aeg,\">=\"&C709)","v":4}]
["Test02","Sander Kell","2019-11-22T18:36:14.947",55,5]
["Test04","Martin Aavik","2019-11-02T20:37:48.463",34,9]
["Test02","Kaspar Raude","2019-11-01T09:34:02.595",89,3]
["Test03","Artur Piiri","2019-11-20T15:54:33.906",47,4]
["Test04","Reimo Kala","2019-11-19T14:03:49.307",58,3]
["Test03","Artur Piiri","2019-11-10T13:26:01.217",31,10]
["Test04","Armin Kaasik","2019-11-11T19:32:36.323",56,6]
["Test02","Viktoria Lumi","2019-11-07T21:25:20.001",26,9]
["Test02","Sander Kell","2019-11-26T21:58:25.736",38,3]
["Test02","Tarvo Järv","2019-11-03T15:42:20.303",65,13]
["Test04","Lauri Vahtra","2019-11-12T23:17:28.263",97,5]
["Test02","Mihkel Kulp","2019-11-16T21:24:41.768",76,7]
["Test02","Anette Lepp","2019-11-12T23:27:15.321",44,4]
["Test03","Mihkel Kulp","2019-11-01T14:23:06.680",86,8]
["Test04","Getlin Allas","2019-11-09T21:07:43.697",50,4]
["Test01","Jaagup Kivi","2019-11-11T13:50:53.936",74,5]
["Test03","Anette Lepp","2019-11-14T21:28:05.061",33,7]
["Test01","Jaagup Kivi","2019-11-17T16:45:57.543",98,3]
["Test01","Paul Hein","2019-11-03T16:34:11.686",97,5]
["Test03","Markus Niidas","2019-11-30T17:00:45.158",66,1]
["Test01","Armin Kaasik","2019-11-25T22:07:02.781",54,2]
["Test03","Mihkel Kulp","2019-11-14T14:31:37.811",54,7]
["Test03","Jana Kiisk","2019-11-08T20:18:45.693",40,5]
["Test04","Lauri Vahtra","2019-11-29T18:51:16.366",27,1]
["Test03","Alari Suur","2019-11-06T08:24:05.227",44,7]
["Test04","Maarja Pihlak","2019-11-16T13:59:26.529",84,4]
["Test03","Brita Kaljula","2019-11-24T11:05:40.972",97,3]
["Test02","Rasmus Kroon","2019-11-25T19:00:43.589",95,2]
["Test03","Mihkel Kulp","2019-11-18T19:34:16.142",35,5]
["Test04","Anna Koel","2019-11-28T08:38:35.990",75,4]
["Test03","Martin Aavik","2019-11-15T21:32:19.429",90,7]
["Test04","Hanna Laid","2019-11-13T08:08:25.343",27,11]
["Test04","Robert Lentso","2019-11-13T21:20:33.446",21,5]
["Test02","Lauri Vahtra","2019-11-07T12:03:32.769",26,10]
["Test03","Jaagup Kivi","2019-11-29T20:49:37.252",57,1]
["Test03","Armin Kaasik","2019-11-27T15:43:27.739",25,3]
["Test03","Erik Pärn","2019-11-02T14:18:29.860",63,10]
["Test01","Anette Lepp","2019-11-16T23:14:33.289",92,2]
["Test02","Viktoria Lumi","2019-11-04T17:20:04.951",23,10]
["Test04","Anna Koel","2019-11-10T21:19:18.691",50,15]
["Test02","Tarvo Järv","2019-11-28T14:32:00.955",56,2]
["Test03","Kaspar Raude","2019-11-10T20:09:31.691",90,1]
["Test01","Mihkel Kulp","2019-11-25T17:31:29.808",68,2]
["Test04","Jaagup Kivi","2019-11-15T18:28:37.957",56,6]
["Test04","Emili Loorits","2019-11-24T10:26:08.627",74,1]
["Test02","Egert Vint","2019-11-03T17:07:53.281",35,7]
["Test02","Tarvo Järv","2019-11-21T14:46:10.192",97,7]
["Test01","Reimo Kala","2019-11-19T14:11:17.763",95,2]
["Test01","Tarvo Järv","2019-11-01T20:36:26.272",65,5]
["Test03","Kertu Heinsoo","2019-11-22T23:10:34.095",33,4]
["Test03","Anette Lepp","2019-11-28T18:47:23.779",64,2]
["Test02","Joonas Haljas","2019-11-12T09:34:33.999",55,7]
["Test03","Diana Taal","2019-11-23T16:04:57.325",63,4]
["Test03","Alari Suur","2019-11-29T14:49:48.769",44,1]
["Test03","Martin Aavik","2019-11-10T18:05:17.676",49,11]
["Test03","Viktoria Lumi","2019-11-06T17:23:47.186",92,6]
["Test04","Emili Loorits","2019-11-20T11:25:01.850",20,3]
["Test03","Jana Kiisk","2019-11-26T22:33:20.501",55,1]
["Test04","Brita Kaljula","2019-11-23T12:13:00.736",23,3]
["Test03","Diana Taal","2019-11-06T15:51:40.745",68,12]
["Test03","Rasmus Kroon","2019-11-23T13:24:14.117",73,4]
["Test04","Erik Pärn","2019-11-13T18:03:42.239",38,5]
["Test01","Karin Saar","2019-11-07T19:56:53.779",78,7]
["Test01","Jana Kiisk","2019-11-16T17:10:14.300",46,{"$f":"COUNTIFS(Test,A773,Nimi,B773,Aeg,\">=\"&C773)","v":6}]
["Test04","Diana Taal","2019-11-03T14:55:18.607",93,9]
["Test04","Robert Lentso","2019-11-25T09:46:52.579",97,1]
["Test04","Alari Suur","2019-11-26T11:22:04.714",59,2]
["Test03","Viktoria Lumi","2019-11-25T20:48:29.613",82,3]
["Test02","Erik Pärn","2019-11-25T22:53:40.002",81,3]
["Test04","Egert Vint","2019-11-20T22:49:00.657",56,2]
["Test02","Egert Vint","2019-11-02T11:31:57.144",73,9]
["Test02","Anna Koel","2019-11-03T20:56:18.397",99,6]
["Test02","Hanna Laid","2019-11-15T23:47:40.838",21,2]
["Test04","Markus Niidas","2019-11-19T19:33:25.408",52,2]
["Test02","Erik Pärn","2019-11-04T23:37:40.382",71,13]
["Test02","Mihkel Kulp","2019-11-26T08:38:40.999",84,4]
["Test02","Kristina Merila","2019-11-14T16:55:41.246",89,8]
["Test03","Paul Hein","2019-11-17T21:17:03.593",76,7]
["Test02","Rasmus Kroon","2019-11-01T19:59:52.952",86,8]
["Test02","Kristina Merila","2019-11-02T23:48:55.221",77,16]
["Test02","Karin Saar","2019-11-15T08:40:24.783",78,3]
["Test01","Jana Kiisk","2019-11-19T22:19:27.163",29,4]
["Test01","Carmen Sõrmus","2019-11-29T10:50:32.917",27,1]
["Test01","Getlin Allas","2019-11-02T15:23:55.830",91,9]
["Test01","Alari Suur","2019-11-29T20:21:38.494",79,1]
["Test03","Erik Pärn","2019-11-24T19:23:18.132",31,3]
["Test01","Kristina Merila","2019-11-13T14:18:59.610",37,2]
["Test03","Martin Aavik","2019-11-11T18:19:54.928",66,10]
["Test03","Martin Aavik","2019-11-16T22:04:11.893",59,6]
["Test02","Kristina Merila","2019-11-04T10:28:07.403",77,15]
["Test01","Sander Kell","2019-11-16T15:40:20.034",84,7]
["Test03","Artur Piiri","2019-11-20T15:56:41.858",36,3]
["Test04","Joonas Haljas","2019-11-01T18:09:34.549",65,6]
["Test02","Alari Suur","2019-11-02T17:18:22.701",41,8]
["Test04","Diana Taal","2019-11-09T18:14:23.771",23,6]
["Test04","Tarvo Järv","2019-11-19T22:26:42.025",93,3]
["Test04","Anna Koel","2019-11-01T12:45:57.730",67,21]
["Test01","Viktoria Lumi","2019-11-01T12:55:49.215",64,9]
["Test04","Hanna Laid","2019-11-06T11:08:41.039",97,14]
["Test04","Maarja Pihlak","2019-11-16T08:29:09.896",23,5]
["Test02","Karin Saar","2019-11-06T08:09:32.177",65,10]
["Test04","Anna Koel","2019-11-02T19:13:28.196",80,20]
["Test03","Kaspar Raude","2019-11-09T12:09:10.821",91,2]
["Test04","Brita Kaljula","2019-11-04T19:39:20.520",24,9]
["Test04","Viktoria Lumi","2019-11-25T11:10:55.920",37,3]
["Test02","Jaagup Kivi","2019-11-19T15:13:57.459",78,1]
["Test01","Katrin Laurits","2019-11-20T18:42:01.208",35,2]
["Test03","Rasmus Kroon","2019-11-30T10:42:34.697",33,1]
["Test01","Viktoria Lumi","2019-11-17T18:45:04.273",59,4]
["Test02","Reimo Kala","2019-11-07T15:48:44.429",33,4]
["Test01","Egert Vint","2019-11-03T17:52:50.559",27,7]
["Test03","Artur Piiri","2019-11-05T20:09:40.587",26,11]
["Test04","Egert Vint","2019-11-17T09:16:08.206",61,4]
["Test03","Brita Kaljula","2019-11-01T22:36:18.260",33,13]
["Test02","Maarja Pihlak","2019-11-18T11:42:13.053",31,5]
["Test01","Kertu Heinsoo","2019-11-01T10:36:16.038",85,11]
["Test03","Egert Vint","2019-11-14T12:22:02.598",41,6]
["Test03","Erik Pärn","2019-11-26T11:27:52.208",83,1]
["Test03","Tarvo Järv","2019-11-20T22:07:55.667",43,2]
["Test04","Anna Koel","2019-11-27T18:48:16.785",24,6]
["Test02","Carmen Sõrmus","2019-11-15T22:09:29.731",57,4]
["Test03","Kertu Heinsoo","2019-11-11T09:42:52.320",50,10]
["Test02","Getlin Allas","2019-11-27T17:32:36.326",39,2]
["Test01","Markus Niidas","2019-11-19T20:16:21.343",51,4]
["Test03","Anette Lepp","2019-11-10T08:48:55.445",33,8]
["Test02","Joonas Haljas","2019-11-20T21:37:48.744",21,5]
["Test02","Erik Pärn","2019-11-05T16:38:45.481",59,12]
["Test03","Martin Aavik","2019-11-21T20:34:41.713",62,{"$f":"COUNTIFS(Test,A837,Nimi,B837,Aeg,\">=\"&C837)","v":4}]
["Test04","Alari Suur","2019-11-20T21:37:22.996",71,5]
["Test04","Robert Lentso","2019-11-20T17:25:37.342",51,2]
["Test03","Paul Hein","2019-11-26T10:29:02.492",30,4]
["Test02","Urmas Lõhmus","2019-11-25T12:30:52.644",45,3]
["Test01","Egert Vint","2019-11-18T09:40:40.688",100,4]
["Test02","Katrin Laurits","2019-11-04T08:22:04.922",55,7]
["Test02","Joonas Haljas","2019-11-29T10:55:39.515",36,1]
["Test03","Carmen Sõrmus","2019-11-30T16:00:27.246",60,1]
["Test04","Lauri Vahtra","2019-11-08T11:05:51.816",69,7]
["Test01","Jaagup Kivi","2019-11-29T09:00:27.266",72,1]
["Test01","Urmas Lõhmus","2019-11-11T22:52:48.861",49,5]
["Test01","Paul Hein","2019-11-25T12:36:14.208",35,1]
["Test04","Getlin Allas","2019-11-05T10:25:44.115",24,7]
["Test04","Brita Kaljula","2019-11-11T13:24:09.472",100,6]
["Test02","Carmen Sõrmus","2019-11-14T22:31:59.354",60,6]
["Test04","Lauri Vahtra","2019-11-13T18:09:32.168",37,4]
["Test02","Markus Niidas","2019-11-19T21:37:20.681",70,4]
["Test03","Martin Aavik","2019-11-04T17:02:21.724",73,13]
["Test03","Kertu Heinsoo","2019-11-27T15:11:05.388",37,1]
["Test01","Joonas Haljas","2019-11-04T21:44:58.968",62,10]
["Test02","Kertu Heinsoo","2019-11-13T08:15:39.562",63,5]
["Test03","Egert Vint","2019-11-30T17:05:08.491",28,1]
["Test02","Kaspar Raude","2019-11-09T18:17:10.155",55,2]
["Test02","Hans Kukk","2019-11-29T22:49:47.549",22,1]
["Test01","Erik Pärn","2019-11-06T21:52:30.220",83,6]
["Test03","Viktoria Lumi","2019-11-10T12:07:08.497",99,5]
["Test03","Anette Lepp","2019-11-16T20:37:17.551",54,6]
["Test04","Katrin Laurits","2019-11-10T12:14:26.241",61,7]
["Test04","Robert Lentso","2019-11-01T19:11:04.369",65,7]
["Test04","Sander Kell","2019-11-30T17:29:59.060",34,1]
["Test02","Alari Suur","2019-11-09T17:55:10.561",53,6]
["Test01","Rasmus Kroon","2019-11-21T17:34:30.003",25,5]
["Test02","Erik Pärn","2019-11-24T12:26:41.089",22,5]
["Test01","Kertu Heinsoo","2019-11-15T19:29:47.198",68,8]
["Test04","Hanna Laid","2019-11-02T19:49:08.605",51,16]
["Test02","Markus Niidas","2019-11-20T12:12:43.040",80,3]
["Test04","Anna Koel","2019-11-22T09:01:15.779",62,9]
["Test03","Jaagup Kivi","2019-11-21T13:23:54.317",34,3]
["Test01","Erik Pärn","2019-11-21T20:30:59.487",24,5]
["Test04","Hanna Laid","2019-11-14T19:09:23.278",97,10]
["Test03","Mihkel Kulp","2019-11-27T08:11:49.568",94,2]
["Test04","Alari Suur","2019-11-29T17:01:39.518",44,1]
["Test04","Anette Lepp","2019-11-11T18:37:44.496",28,7]
["Test03","Brita Kaljula","2019-11-10T15:56:12.786",51,9]
["Test02","Armin Kaasik","2019-11-30T12:01:33.673",44,2]
["Test03","Karin Saar","2019-11-23T13:49:58.653",85,3]
["Test01","Brita Kaljula","2019-11-27T11:36:58.890",80,1]
["Test04","Hans Kukk","2019-11-27T19:20:51.094",70,3]
["Test03","Rasmus Kroon","2019-11-21T14:39:41.750",63,6]
["Test04","Anna Koel","2019-11-11T23:33:11.434",97,13]
["Test03","Hanna Laid","2019-11-22T20:16:58.494",87,1]
["Test03","Viktoria Lumi","2019-11-03T12:39:27.985",71,8]
["Test04","Anna Koel","2019-11-05T17:28:40.618",100,19]
["Test03","Hans Kukk","2019-11-28T20:21:02.569",62,3]
["Test02","Getlin Allas","2019-11-12T23:18:33.075",50,6]
["Test02","Kertu Heinsoo","2019-11-07T22:02:23.092",41,6]
["Test03","Kertu Heinsoo","2019-11-10T17:05:12.910",63,11]
["Test04","Kristina Merila","2019-11-03T22:29:31.623",62,11]
["Test01","Sander Kell","2019-11-20T23:49:17.010",94,4]
["Test04","Emili Loorits","2019-11-02T18:13:46.469",38,7]
["Test04","Karin Saar","2019-11-23T14:37:37.813",73,1]
["Test02","Lauri Vahtra","2019-11-17T18:45:14.427",26,7]
["Test02","Urmas Lõhmus","2019-11-11T18:02:51.107",54,7]
["Test04","Markus Niidas","2019-11-06T20:07:34.502",84,{"$f":"COUNTIFS(Test,A901,Nimi,B901,Aeg,\">=\"&C901)","v":5}]
["Test02","Jaagup Kivi","2019-11-17T22:34:35.747",37,2]
["Test04","Martin Aavik","2019-11-06T21:25:31.077",24,7]
["Test03","Jana Kiisk","2019-11-21T15:19:02.960",49,3]
["Test04","Maarja Pihlak","2019-11-13T20:45:52.497",81,7]
["Test04","Urmas Lõhmus","2019-11-18T20:44:53.025",67,4]
["Test01","Paul Hein","2019-11-09T08:05:10.645",32,4]
["Test04","Anna Koel","2019-11-28T10:16:03.402",36,3]
["Test01","Viktoria Lumi","2019-11-09T09:04:35.293",71,6]
["Test02","Karin Saar","2019-11-14T15:43:46.417",40,4]
["Test03","Diana Taal","2019-11-19T19:20:19.876",94,8]
["Test03","Kertu Heinsoo","2019-11-23T22:44:01.899",35,3]
["Test02","Paul Hein","2019-11-10T17:29:21.649",67,6]
["Test02","Alari Suur","2019-11-16T09:03:49.753",55,3]
["Test02","Robert Lentso","2019-11-11T16:37:19.266",82,9]
["Test02","Tarvo Järv","2019-11-26T20:34:06.369",47,3]
["Test02","Diana Taal","2019-11-29T13:41:10.761",74,1]
["Test03","Armin Kaasik","2019-11-01T21:10:05.028",80,7]
["Test04","Diana Taal","2019-11-25T23:43:16.032",85,2]
["Test01","Alari Suur","2019-11-16T20:29:10.926",30,7]
["Test04","Kertu Heinsoo","2019-11-24T20:16:09.001",55,3]
["Test02","Kertu Heinsoo","2019-11-06T10:01:34.725",57,7]
["Test02","Sander Kell","2019-11-08T12:03:05.439",70,7]
["Test04","Egert Vint","2019-11-08T08:32:23.996",78,7]
["Test04","Urmas Lõhmus","2019-11-19T13:02:41.695",50,3]
["Test02","Kertu Heinsoo","2019-11-25T20:08:26.772",60,2]
["Test01","Joonas Haljas","2019-11-11T08:27:31.453",23,8]
["Test02","Egert Vint","2019-11-17T10:12:47.344",54,3]
["Test02","Karin Saar","2019-11-01T19:17:58.366",77,13]
["Test02","Rasmus Kroon","2019-11-23T16:03:35.395",56,3]
["Test01","Lauri Vahtra","2019-11-23T19:10:08.938",25,2]
["Test02","Armin Kaasik","2019-11-20T10:45:55.392",23,5]
["Test04","Martin Aavik","2019-11-18T17:55:39.785",20,4]
["Test03","Karin Saar","2019-11-27T18:33:30.749",40,2]
["Test04","Diana Taal","2019-11-10T10:02:27.472",25,5]
["Test04","Jaagup Kivi","2019-11-19T23:06:07.943",80,3]
["Test04","Armin Kaasik","2019-11-23T21:25:30.337",24,4]
["Test02","Jana Kiisk","2019-11-19T10:45:43.001",58,5]
["Test04","Anette Lepp","2019-11-23T10:23:22.376",41,3]
["Test01","Hanna Laid","2019-11-29T22:24:26.191",89,1]
["Test04","Karin Saar","2019-11-10T18:40:06.643",59,7]
["Test03","Katrin Laurits","2019-11-08T14:49:59.496",71,7]
["Test04","Joonas Haljas","2019-11-21T08:55:54.954",55,3]
["Test01","Hans Kukk","2019-11-22T18:31:22.279",53,2]
["Test03","Egert Vint","2019-11-17T10:20:35.570",67,4]
["Test01","Brita Kaljula","2019-11-03T16:54:28.454",43,9]
["Test04","Anette Lepp","2019-11-11T19:46:20.215",24,6]
["Test04","Jaagup Kivi","2019-11-18T18:08:38.035",47,4]
["Test03","Egert Vint","2019-11-28T08:51:58.986",84,2]
["Test02","Jana Kiisk","2019-11-30T23:53:33.008",71,1]
["Test03","Joonas Haljas","2019-11-21T22:38:26.774",31,4]
["Test04","Sander Kell","2019-11-14T20:55:57.581",93,4]
["Test01","Kertu Heinsoo","2019-11-05T14:32:29.687",59,10]
["Test01","Rasmus Kroon","2019-11-30T20:06:31.034",74,1]
["Test03","Anette Lepp","2019-11-19T09:40:16.888",46,5]
["Test01","Karin Saar","2019-11-21T12:15:43.567",40,4]
["Test02","Getlin Allas","2019-11-21T23:32:09.425",87,5]
["Test01","Sander Kell","2019-11-24T15:51:14.614",80,3]
["Test01","Joonas Haljas","2019-11-27T10:39:49.644",62,3]
["Test02","Jana Kiisk","2019-11-06T17:50:58.762",82,10]
["Test03","Paul Hein","2019-11-30T17:24:02.934",38,1]
["Test02","Mihkel Kulp","2019-11-29T16:43:32.509",53,1]
["Test03","Brita Kaljula","2019-11-04T09:03:23.351",38,10]
["Test01","Joonas Haljas","2019-11-19T19:05:38.681",55,6]
["Test02","Katrin Laurits","2019-11-18T16:00:32.186",82,{"$f":"COUNTIFS(Test,A965,Nimi,B965,Aeg,\">=\"&C965)","v":4}]
["Test03","Mihkel Kulp","2019-11-17T08:23:05.387",66,6]
["Test04","Hans Kukk","2019-11-06T21:07:12.019",32,8]
["Test04","Karin Saar","2019-11-06T11:10:52.475",62,8]
["Test04","Mihkel Kulp","2019-11-23T18:13:42.555",66,2]
["Test02","Egert Vint","2019-11-06T18:36:26.176",32,5]
["Test03","Lauri Vahtra","2019-11-08T21:42:48.116",59,8]
["Test04","Viktoria Lumi","2019-11-03T14:34:09.132",76,8]
["Test03","Jaagup Kivi","2019-11-15T15:37:32.777",74,7]
["Test04","Anna Koel","2019-11-16T20:25:28.203",76,11]
["Test04","Anette Lepp","2019-11-26T17:46:58.093",49,1]
["Test03","Maarja Pihlak","2019-11-05T17:17:21.018",57,5]
["Test01","Viktoria Lumi","2019-11-10T20:03:43.840",37,5]
["Test01","Kertu Heinsoo","2019-11-20T10:57:22.837",43,6]
["Test03","Martin Aavik","2019-11-08T17:56:07.804",65,12]
["Test04","Diana Taal","2019-11-07T17:59:20.943",22,8]
["Test04","Paul Hein","2019-11-13T23:08:18.586",62,4]
["Test02","Hans Kukk","2019-11-01T13:49:18.493",77,8]
["Test03","Erik Pärn","2019-11-25T15:36:04.061",84,2]
["Test04","Katrin Laurits","2019-11-20T12:23:05.502",66,2]
["Test03","Getlin Allas","2019-11-06T21:28:11.848",85,7]
["Test01","Diana Taal","2019-11-05T12:32:50.369",77,6]
["Test04","Emili Loorits","2019-11-21T11:35:15.314",38,2]
["Test01","Hanna Laid","2019-11-05T23:42:28.106",88,9]
["Test04","Getlin Allas","2019-11-26T14:06:28.232",89,1]
["Test03","Armin Kaasik","2019-11-28T16:40:37.716",100,2]
["Test02","Getlin Allas","2019-11-09T08:16:19.348",47,9]
["Test03","Artur Piiri","2019-11-16T08:48:19.491",74,7]
["Test04","Hanna Laid","2019-11-06T15:31:44.623",90,13]
["Test02","Armin Kaasik","2019-11-22T22:23:54.649",35,3]
["Test04","Maarja Pihlak","2019-11-17T22:53:42.577",79,3]
["Test01","Brita Kaljula","2019-11-27T09:29:48.287",88,2]
["Test03","Diana Taal","2019-11-29T23:02:14.915",48,1]
["Test02","Artur Piiri","2019-11-09T13:02:14.646",97,3]
["Test02","Kristina Merila","2019-11-07T12:10:33.484",98,14]
["Test02","Viktoria Lumi","2019-11-08T23:41:46.359",49,8]
["Test03","Lauri Vahtra","2019-11-17T11:13:26.031",34,5]
["Test01","Urmas Lõhmus","2019-11-19T08:19:50.203",42,2]
["Test03","Anna Koel","2019-11-15T11:25:36.132",81,2]
["Test03","Carmen Sõrmus","2019-11-18T10:46:43.464",57,2]
["Test01","Robert Lentso","2019-11-26T20:35:19.526",30,3]
["Test01","Anna Koel","2019-11-06T23:54:10.604",51,3]
["Test02","Carmen Sõrmus","2019-11-15T10:14:21.417",73,5]
["Test04","Martin Aavik","2019-11-26T08:59:27.084",47,2]
["Test01","Katrin Laurits","2019-11-05T15:45:53.853",29,5]
["Test04","Reimo Kala","2019-11-26T19:27:05.872",79,2]
["Test04","Jaagup Kivi","2019-11-06T10:06:42.272",27,12]
["Test04","Anette Lepp","2019-11-03T19:28:50.441",80,11]
["Test01","Martin Aavik","2019-11-13T20:50:23.135",91,7]
["Test01","Anette Lepp","2019-11-06T13:17:54.820",94,9]
["Test03","Robert Lentso","2019-11-07T22:28:11.177",68,12]
["Test02","Viktoria Lumi","2019-11-13T14:26:10.409",78,7]
["Test03","Armin Kaasik","2019-11-29T14:15:58.537",60,1]
["Test04","Anna Koel","2019-11-18T12:05:42.152",63,10]
["Test03","Robert Lentso","2019-11-30T19:38:46.649",58,1]
["Test02","Karin Saar","2019-11-10T20:54:53.016",50,8]
["Test02","Anette Lepp","2019-11-10T18:33:56.712",99,5]
["Test02","Paul Hein","2019-11-09T12:42:09.889",88,7]
["Test01","Kertu Heinsoo","2019-11-27T11:56:43.773",90,4]
["Test04","Robert Lentso","2019-11-14T19:33:47.368",38,4]
["Test03","Karin Saar","2019-11-21T22:39:26.897",39,4]
["Test02","Armin Kaasik","2019-11-30T20:03:57.271",61,1]
["Test01","Viktoria Lumi","2019-11-04T20:56:11.367",24,8]
["Test04","Markus Niidas","2019-11-11T09:06:51.450",92,3]
["Test04","Brita Kaljula","2019-11-13T09:51:55.825",100,{"$f":"COUNTIFS(Test,A1029,Nimi,B1029,Aeg,\">=\"&C1029)","v":5}]
["Test03","Tarvo Järv","2019-11-14T12:35:59.930",27,6]
["Test01","Jana Kiisk","2019-11-06T14:58:58.241",57,9]
["Test02","Martin Aavik","2019-11-19T09:46:17.483",28,2]
["Test04","Katrin Laurits","2019-11-08T17:24:24.131",81,8]
["Test01","Hans Kukk","2019-11-05T16:57:03.584",91,7]
["Test03","Jana Kiisk","2019-11-11T11:56:30.215",87,4]
["Test02","Katrin Laurits","2019-11-24T17:01:08.744",53,3]
["Test02","Karin Saar","2019-11-05T14:28:50.382",27,11]
["Test03","Kristina Merila","2019-11-11T10:51:10.874",49,8]
["Test04","Anna Koel","2019-11-11T11:34:36.621",39,14]
["Test02","Hans Kukk","2019-11-17T15:17:21.990",65,3]
["Test04","Anette Lepp","2019-11-10T09:23:21.234",78,8]
["Test01","Diana Taal","2019-11-26T11:33:34.975",28,2]
["Test03","Robert Lentso","2019-11-15T18:07:34.693",23,10]
["Test03","Martin Aavik","2019-11-13T12:27:39.597",96,9]
["Test02","Getlin Allas","2019-11-25T16:49:56.561",90,3]
["Test01","Kertu Heinsoo","2019-11-15T08:35:50.023",74,9]
["Test01","Carmen Sõrmus","2019-11-10T13:47:18.991",47,5]
["Test02","Katrin Laurits","2019-11-30T21:42:34.400",40,1]
["Test03","Paul Hein","2019-11-29T09:30:45.221",44,2]
["Test02","Joonas Haljas","2019-11-12T09:03:56.181",67,8]
["Test01","Markus Niidas","2019-11-14T12:51:18.097",25,5]
["Test02","Mihkel Kulp","2019-11-17T08:42:36.640",86,6]
["Test01","Diana Taal","2019-11-13T17:52:37.136",71,4]
["Test03","Kertu Heinsoo","2019-11-11T15:30:14.787",31,9]
["Test02","Katrin Laurits","2019-11-26T11:00:08.073",24,2]
["Test03","Viktoria Lumi","2019-11-28T21:09:33.722",100,2]
["Test02","Lauri Vahtra","2019-11-18T21:34:57.578",54,6]
["Test03","Martin Aavik","2019-11-14T19:58:12.785",38,8]
["Test02","Paul Hein","2019-11-02T09:01:59.802",32,9]
["Test03","Artur Piiri","2019-11-13T15:27:30.617",25,9]
["Test02","Paul Hein","2019-11-22T09:47:07.259",25,4]
["Test03","Emili Loorits","2019-11-29T16:36:40.042",23,1]
["Test01","Anna Koel","2019-11-17T16:50:33.327",37,1]
["Test04","Karin Saar","2019-11-13T09:47:09.718",51,5]
["Test02","Kertu Heinsoo","2019-11-05T15:58:33.898",70,8]
["Test01","Getlin Allas","2019-11-15T16:06:55.761",97,5]
["Test03","Hanna Laid","2019-11-14T19:48:47.910",23,3]
["Test02","Carmen Sõrmus","2019-11-24T17:25:43.387",54,2]
["Test01","Brita Kaljula","2019-11-26T20:02:32.650",81,3]
["Test03","Reimo Kala","2019-11-01T17:50:16.330",71,6]
["Test03","Sander Kell","2019-11-13T13:36:17.585",93,3]
["Test01","Hans Kukk","2019-11-03T11:45:09.162",89,8]
["Test04","Reimo Kala","2019-11-30T11:29:00.525",92,1]
["Test03","Anette Lepp","2019-11-09T21:09:12.499",52,9]
["Test01","Jana Kiisk","2019-11-29T22:48:26.564",41,1]
["Test01","Joonas Haljas","2019-11-03T13:15:09.163",20,11]
["Test03","Kertu Heinsoo","2019-11-20T14:10:49.346",58,7]
["Test04","Erik Pärn","2019-11-01T13:56:54.718",83,8]
["Test01","Katrin Laurits","2019-11-17T12:49:51.852",29,3]
["Test02","Getlin Allas","2019-11-12T15:49:40.885",44,7]
["Test02","Viktoria Lumi","2019-11-26T09:15:21.281",28,1]
["Test04","Jaagup Kivi","2019-11-15T22:45:39.706",35,5]
["Test02","Urmas Lõhmus","2019-11-22T08:20:19.946",61,5]
["Test01","Brita Kaljula","2019-11-12T13:36:14.599",20,6]
["Test04","Martin Aavik","2019-11-14T21:06:36.421",78,5]
["Test04","Kristina Merila","2019-11-08T08:59:49.990",48,8]
["Test04","Martin Aavik","2019-11-13T17:25:26.004",41,6]
["Test02","Diana Taal","2019-11-16T22:01:56.331",88,5]
["Test02","Kristina Merila","2019-11-28T11:37:49.747",53,3]
["Test04","Mihkel Kulp","2019-11-07T09:25:55.584",44,6]
["Test01","Sander Kell","2019-11-28T21:53:13.018",46,1]
["Test02","Mihkel Kulp","2019-11-05T10:04:00.377",90,10]
["Test01","Hanna Laid","2019-11-24T12:35:27.589",85,{"$f":"COUNTIFS(Test,A1093,Nimi,B1093,Aeg,\">=\"&C1093)","v":2}]
["Test01","Jana Kiisk","2019-11-14T11:04:47.060",47,7]
["Test02","Egert Vint","2019-11-10T18:40:42.448",33,4]
["Test01","Erik Pärn","2019-11-29T17:33:05.968",87,1]
["Test01","Brita Kaljula","2019-11-11T21:55:15.110",54,7]
["Test03","Brita Kaljula","2019-11-03T21:07:25.328",44,11]
["Test01","Hans Kukk","2019-11-16T11:58:22.756",100,3]
["Test01","Hanna Laid","2019-11-16T17:39:12.667",85,7]
["Test01","Joonas Haljas","2019-11-22T15:38:26.465",47,4]
["Test04","Brita Kaljula","2019-11-09T21:56:28.270",97,7]
["Test03","Carmen Sõrmus","2019-11-09T22:51:02.591",67,5]
["Test04","Kaspar Raude","2019-11-18T22:57:37.132",89,2]
["Test02","Getlin Allas","2019-11-10T17:34:09.998",50,8]
["Test04","Kristina Merila","2019-11-20T14:37:20.761",20,6]
["Test03","Erik Pärn","2019-11-09T23:39:59.943",56,9]
["Test03","Brita Kaljula","2019-11-13T20:15:58.434",75,8]
["Test01","Anna Koel","2019-11-04T20:12:16.012",72,4]
["Test04","Erik Pärn","2019-11-12T14:14:44.045",45,7]
["Test02","Karin Saar","2019-11-12T09:53:30.342",51,6]
["Test04","Jaagup Kivi","2019-11-07T23:31:44.602",68,10]
["Test04","Kaspar Raude","2019-11-23T18:16:04.740",56,1]
["Test01","Kaspar Raude","2019-11-29T19:36:59.528",44,1]
["Test02","Robert Lentso","2019-11-18T10:30:44.801",40,4]
["Test02","Jana Kiisk","2019-11-25T19:47:55.510",81,3]
["Test01","Alari Suur","2019-11-23T22:47:38.292",83,3]
["Test02","Sander Kell","2019-11-27T16:43:01.406",70,2]
["Test04","Jaagup Kivi","2019-11-07T15:58:43.278",86,11]
["Test02","Armin Kaasik","2019-11-13T19:27:10.334",23,7]
["Test02","Rasmus Kroon","2019-11-02T12:16:23.131",88,7]
["Test03","Kristina Merila","2019-11-16T16:10:16.708",29,5]
["Test01","Joonas Haljas","2019-11-07T11:23:16.261",22,9]
["Test03","Katrin Laurits","2019-11-22T17:47:05.624",99,3]
["Test01","Kertu Heinsoo","2019-11-29T21:46:56.575",68,2]
["Test03","Carmen Sõrmus","2019-11-02T14:23:33.650",25,7]
["Test04","Erik Pärn","2019-11-27T19:51:07.444",98,2]
["Test02","Reimo Kala","2019-11-25T16:45:53.501",90,1]
["Test01","Rasmus Kroon","2019-11-30T10:31:53.027",67,2]
["Test03","Brita Kaljula","2019-11-20T18:45:48.949",36,5]
["Test04","Diana Taal","2019-11-12T14:52:57.026",26,4]
["Test04","Carmen Sõrmus","2019-11-18T20:16:30.626",72,2]
["Test02","Alari Suur","2019-11-16T15:07:14.419",60,2]
["Test01","Katrin Laurits","2019-11-01T09:44:23.997",86,6]
["Test01","Maarja Pihlak","2019-11-14T16:09:00.824",93,6]
["Test01","Rasmus Kroon","2019-11-26T13:54:02.176",57,3]
["Test02","Anette Lepp","2019-11-17T17:36:21.313",50,2]
["Test03","Lauri Vahtra","2019-11-25T11:04:16.049",62,2]
["Test03","Urmas Lõhmus","2019-11-25T12:46:20.455",51,2]
["Test01","Brita Kaljula","2019-11-07T23:52:13.973",71,8]
["Test02","Emili Loorits","2019-11-24T08:18:38.438",100,1]
["Test03","Anna Koel","2019-11-10T09:39:13.939",30,4]
["Test01","Diana Taal","2019-11-24T16:53:37.672",79,3]
["Test03","Katrin Laurits","2019-11-19T22:23:58.229",31,4]
["Test02","Hans Kukk","2019-11-28T20:04:12.479",89,2]
["Test03","Hans Kukk","2019-11-20T15:14:04.836",67,7]
["Test03","Armin Kaasik","2019-11-20T09:10:11.366",47,5]
["Test01","Jana Kiisk","2019-11-13T19:51:08.649",84,8]
["Test04","Kaspar Raude","2019-11-10T22:11:54.699",75,4]
["Test04","Sander Kell","2019-11-17T18:16:21.086",47,3]
["Test01","Carmen Sõrmus","2019-11-09T14:15:14.941",70,7]
["Test02","Getlin Allas","2019-11-02T23:48:46.233",20,14]
["Test03","Armin Kaasik","2019-11-23T23:10:51.553",44,4]
["Test04","Tarvo Järv","2019-11-14T17:26:18.211",90,5]
["Test03","Diana Taal","2019-11-21T11:55:44.979",63,6]
["Test03","Carmen Sõrmus","2019-11-17T17:18:00.298",20,3]
["Test01","Martin Aavik","2019-11-19T22:34:39.151",65,{"$f":"COUNTIFS(Test,A1157,Nimi,B1157,Aeg,\">=\"&C1157)","v":5}]
["Test04","Emili Loorits","2019-11-18T14:02:44.434",25,4]
["Test01","Rasmus Kroon","2019-11-15T11:13:06.513",50,9]
["Test04","Jaagup Kivi","2019-11-04T14:12:21.400",59,13]
["Test02","Erik Pärn","2019-11-10T10:51:10.361",38,10]
["Test03","Carmen Sõrmus","2019-11-10T11:42:21.071",20,4]
["Test03","Hans Kukk","2019-11-30T09:26:40.889",69,2]
["Test04","Armin Kaasik","2019-11-06T11:49:58.143",42,8]
["Test04","Karin Saar","2019-11-16T22:18:37.425",98,3]
["Test04","Kristina Merila","2019-11-07T08:54:40.790",94,9]
["Test02","Tarvo Järv","2019-11-04T19:50:49.206",86,12]
["Test03","Martin Aavik","2019-11-30T19:23:16.883",51,1]
["Test02","Emili Loorits","2019-11-20T13:07:51.520",73,3]
["Test03","Erik Pärn","2019-11-24T10:24:24.044",44,4]
["Test02","Emili Loorits","2019-11-12T21:31:26.691",47,6]
["Test02","Mihkel Kulp","2019-11-28T12:41:37.976",82,3]
["Test03","Karin Saar","2019-11-30T15:13:23.961",89,1]

{"sheet":"testid (2)","index":3,"n_rows":1173,"n_cols":13,"rows_kept":1173,"cut":false,"hidden":true,"merged":[]}
[null,null,null,null,null,"08:00:00","23:55:00",null,null,"Test01","Test02","Test03","Test04"]
[null,null,null,null,null,"2019-11-01","2019-11-30",null,"Katrin Laurits",{"$f":"COUNTIFS($A:$A,J$1,$B:$B,$I2)","v":11},{"$f":"COUNTIFS($A:$A,K$1,$B:$B,$I2)","v":10},10,6]
[null,null,null,null,null,null,null,null,"Anette Lepp",{"$f":"COUNTIFS($A:$A,J$1,$B:$B,$I3)","v":10},7,7,6]
["Test","Nimi","Aeg","Tulemus",null,null,"Test01",null,"Reimo Kala",7,6,7,7]
[{"$f":"INDEX($G$4:$G$7,RANDBETWEEN(1,4))","v":"Test02"},{"$f":"INDEX($I$2:$I$36,RANDBETWEEN(1,35))","v":"Hanna Laid"},{"$f":"RANDBETWEEN($F$2,$G$2)+$F$1+RAND()*($G$1-$F$1)","v":"2019-11-09T11:36:06.044"},{"$f":"RANDBETWEEN(20,100)","v":52},null,null,"Test02",null,"Egert Vint",12,10,12,9]
[{"$f":"INDEX($G$4:$G$7,RANDBETWEEN(1,4))","v":"Test02"},{"$f":"INDEX($I$2:$I$36,RANDBETWEEN(1,35))","v":"Maarja Pihlak"},{"$f":"RANDBETWEEN($F$2,$G$2)+$F$1+RAND()*($G$1-$F$1)","v":"2019-11-05T14:51:59.631"},{"$f":"RANDBETWEEN(20,100)","v":26},null,null,"Test03",null,"Carmen Sõrmus",13,6,11,6]
["Test04","Karin Saar","2019-11-20T15:29:01.869",42,null,null,"Test04",null,"Armin Kaasik",8,4,5,15]
["Test04","Sander Kell","2019-11-22T11:01:37.137",33,null,null,null,null,"Jana Kiisk",6,8,10,10]
["Test02","Karin Saar","2019-11-11T08:21:34.761",94,null,null,null,null,"Kaspar Raude",13,11,7,5]
["Test02","Kristina Merila","2019-11-24T22:33:00.681",74,null,35,null,null,"Karin Saar",5,13,9,6]
["Test01","Markus Niidas","2019-11-18T14:32:44.072",50,null,4,null,null,"Hanna Laid",8,9,13,11]
["Test03","Reimo Kala","2019-11-02T09:49:52.963",50,null,5,null,null,"Mihkel Kulp",9,9,8,13]
["Test01","Brita Kaljula","2019-11-29T18:35:59.135",54,null,{"$f":"F10*F11*F12","v":700},null,null,"Markus Niidas",7,13,8,7]
["Test01","Kristina Merila","2019-11-06T10:12:51.374",23,null,null,null,null,"Alari Suur",7,5,10,5]
["Test04","Sander Kell","2019-11-05T15:33:11.839",69,null,null,null,null,"Erik Pärn",5,3,6,7]
["Test01","Rasmus Kroon","2019-11-16T13:40:01.995",78,null,null,null,null,"Martin Aavik",6,7,11,9]
["Test01","Brita Kaljula","2019-11-01T22:05:31.511",64,null,null,null,null,"Maarja Pihlak",15,11,7,11]
["Test01","Kristina Merila","2019-11-01T13:21:11.933",36,null,null,null,null,"Urmas Lõhmus",7,8,8,5]
["Test01","Joonas Haljas","2019-11-08T22:56:14.945",51,null,null,null,null,"Lauri Vahtra",5,7,3,9]
["Test03","Urmas Lõhmus","2019-11-28T19:20:37.936",40,null,null,null,null,"Emili Loorits",8,9,8,13]
["Test02","Anette Lepp","2019-11-03T16:59:26.419",61,null,null,null,null,"Jaagup Kivi",8,6,5,11]
["Test01","Anette Lepp","2019-11-17T12:20:14.283",47,null,null,null,null,"Joonas Haljas",14,8,13,9]
["Test03","Rasmus Kroon","2019-11-21T15:22:30.934",55,null,null,null,null,"Robert Lentso",9,5,10,4]
["Test02","Maarja Pihlak","2019-11-13T15:51:59.139",76,null,null,null,null,"Viktoria Lumi",10,3,10,11]
["Test03","Rasmus Kroon","2019-11-23T21:25:28.491",34,null,null,null,null,"Sander Kell",8,4,6,9]
["Test04","Katrin Laurits","2019-11-08T08:52:00.456",85,null,null,null,null,"Hans Kukk",8,9,10,7]
["Test04","Armin Kaasik","2019-11-02T16:43:30.022",86,null,null,null,null,"Diana Taal",8,12,7,9]
["Test03","Maarja Pihlak","2019-11-13T12:46:14.964",38,null,null,null,null,"Kertu Heinsoo",11,8,8,7]
["Test04","Jana Kiisk","2019-11-13T11:49:12.121",83,null,null,null,null,"Tarvo Järv",12,7,5,11]
["Test01","Hanna Laid","2019-11-21T09:00:04.512",58,null,null,null,null,"Paul Hein",8,8,4,8]
["Test01","Hanna Laid","2019-11-09T20:45:11.197",23,null,null,null,null,"Artur Piiri",4,8,15,3]
["Test03","Maarja Pihlak","2019-11-14T13:33:08.010",20,null,null,null,null,"Getlin Allas",7,4,7,5]
["Test02","Karin Saar","2019-11-07T11:27:56.730",77,null,null,null,null,"Brita Kaljula",7,5,6,9]
["Test04","Jaagup Kivi","2019-11-28T13:17:17.068",40,null,null,null,null,"Anna Koel",13,7,5,12]
["Test02","Sander Kell","2019-11-03T20:03:23.714",70,null,null,null,null,"Kristina Merila",14,9,12,10]
["Test01","Viktoria Lumi","2019-11-21T10:00:42.885",46,null,null,null,null,"Rasmus Kroon",9,14,8,8]
["Test01","Carmen Sõrmus","2019-11-14T14:02:50.651",20]
["Test03","Carmen Sõrmus","2019-11-06T15:11:20.339",24]
["Test04","Anna Koel","2019-11-16T08:01:47.861",76]
["Test04","Egert Vint","2019-11-16T20:44:56.102",73]
["Test01","Diana Taal","2019-11-19T16:07:40.140",80]
["Test04","Anette Lepp","2019-11-19T17:05:29.946",57]
["Test04","Anna Koel","2019-11-12T20:38:19.759",86]
["Test04","Martin Aavik","2019-11-16T19:11:28.083",100]
["Test03","Hanna Laid","2019-11-19T21:02:13.423",54]
["Test04","Jaagup Kivi","2019-11-18T18:58:58.627",78]
["Test01","Kertu Heinsoo","2019-11-03T21:57:10.736",98]
["Test02","Karin Saar","2019-11-24T20:07:50.294",34]
["Test02","Martin Aavik","2019-11-22T09:29:50.237",96]
["Test02","Joonas Haljas","2019-11-03T19:27:42.944",39]
["Test04","Egert Vint","2019-11-22T19:17:49.610",53]
["Test02","Armin Kaasik","2019-11-07T14:04:14.608",72]
["Test03","Joonas Haljas","2019-11-02T21:12:12.683",43]
["Test01","Mihkel Kulp","2019-11-13T08:30:30.563",84]
["Test02","Getlin Allas","2019-11-15T14:17:43.692",64]
["Test02","Hanna Laid","2019-11-22T08:07:35.599",97]
["Test03","Katrin Laurits","2019-11-02T09:34:41.850",69]
["Test03","Kaspar Raude","2019-11-03T11:23:16.818",35]
["Test01","Kaspar Raude","2019-11-18T20:40:08.117",22]
["Test04","Tarvo Järv","2019-11-23T16:12:25.890",93]
["Test03","Kaspar Raude","2019-11-18T20:46:26.220",41]
["Test03","Hanna Laid","2019-11-16T11:24:13.607",95]
["Test03","Kristina Merila","2019-11-29T08:44:44.651",44]
["Test04","Jana Kiisk","2019-11-17T12:30:42.727",70]
["Test04","Armin Kaasik","2019-11-02T12:37:54.741",40]
["Test04","Armin Kaasik","2019-11-28T22:26:19.347",43]
["Test02","Alari Suur","2019-11-07T23:04:15.461",95]
["Test02","Anna Koel","2019-11-15T10:21:05.563",28]
["Test03","Mihkel Kulp","2019-11-09T16:44:39.327",72]
[{"$f":"INDEX($G$4:$G$7,RANDBETWEEN(1,4))","v":"Test03"},{"$f":"INDEX($I$2:$I$36,RANDBETWEEN(1,35))","v":"Robert Lentso"},{"$f":"RANDBETWEEN($F$2,$G$2)+$F$1+RAND()*($G$1-$F$1)","v":"2019-11-25T17:00:14.356"},{"$f":"RANDBETWEEN(20,100)","v":35}]
["Test03","Egert Vint","2019-11-04T18:01:35.199",75]
["Test01","Hanna Laid","2019-11-25T08:12:10.224",20]
["Test04","Katrin Laurits","2019-11-26T15:07:49.900",25]
["Test03","Tarvo Järv","2019-11-30T21:25:32.235",47]
["Test03","Brita Kaljula","2019-11-18T09:25:30.706",67]
["Test01","Sander Kell","2019-11-27T18:13:23.344",41]
["Test01","Maarja Pihlak","2019-11-06T23:07:08.591",74]
["Test03","Emili Loorits","2019-11-26T21:47:56.109",33]
["Test02","Artur Piiri","2019-11-07T20:50:17.932",69]
["Test04","Kristina Merila","2019-11-15T21:12:02.453",23]
["Test01","Jaagup Kivi","2019-11-06T11:05:43.074",51]
["Test03","Martin Aavik","2019-11-10T11:16:10.117",56]
["Test04","Robert Lentso","2019-11-03T08:24:48.710",35]
["Test03","Carmen Sõrmus","2019-11-14T17:13:09.185",70]
["Test01","Anna Koel","2019-11-05T17:21:02.006",73]
["Test04","Hanna Laid","2019-11-16T11:52:57.035",35]
["Test01","Martin Aavik","2019-11-04T10:45:06.935",36]
["Test02","Kristina Merila","2019-11-09T18:23:18.297",36]
["Test03","Jana Kiisk","2019-11-16T16:03:59.523",40]
["Test02","Urmas Lõhmus","2019-11-25T18:04:11.706",74]
["Test02","Diana Taal","2019-11-02T17:31:31.406",70]
["Test02","Armin Kaasik","2019-11-29T08:03:31.054",51]
["Test03","Emili Loorits","2019-11-21T21:41:06.498",94]
["Test04","Martin Aavik","2019-11-10T17:24:42.795",33]
["Test02","Jaagup Kivi","2019-11-13T17:30:59.081",66]
["Test01","Urmas Lõhmus","2019-11-25T19:57:06.881",77]
["Test02","Kaspar Raude","2019-11-19T22:54:08.305",41]
["Test01","Emili Loorits","2019-11-06T20:19:07.201",20]
["Test03","Kristina Merila","2019-11-27T16:29:16.765",36]
["Test04","Urmas Lõhmus","2019-11-21T12:43:50.460",95]
["Test02","Martin Aavik","2019-11-14T12:44:12.385",77]
["Test01","Martin Aavik","2019-11-10T13:53:02.010",66]
["Test03","Anette Lepp","2019-11-21T09:21:23.204",59]
["Test01","Katrin Laurits","2019-11-15T10:59:15.269",24]
["Test01","Kertu Heinsoo","2019-11-20T18:17:54.392",21]
["Test03","Robert Lentso","2019-11-22T09:11:12.625",35]
["Test04","Karin Saar","2019-11-17T22:04:48.500",53]
["Test04","Anette Lepp","2019-11-08T14:13:50.459",54]
["Test03","Artur Piiri","2019-11-14T18:55:30.205",45]
["Test03","Hans Kukk","2019-11-17T23:18:20.691",59]
["Test02","Mihkel Kulp","2019-11-24T19:59:41.784",73]
["Test02","Diana Taal","2019-11-09T13:37:09.847",91]
["Test03","Hans Kukk","2019-11-15T16:43:43.311",82]
["Test02","Brita Kaljula","2019-11-18T09:19:26.922",30]
["Test01","Paul Hein","2019-11-06T18:07:00.305",82]
["Test04","Sander Kell","2019-11-16T14:13:28.654",95]
["Test02","Paul Hein","2019-11-12T13:42:29.676",33]
["Test03","Getlin Allas","2019-11-20T14:15:35.721",79]
["Test03","Rasmus Kroon","2019-11-02T12:55:19.738",96]
["Test02","Alari Suur","2019-11-22T16:21:13.889",72]
["Test04","Kristina Merila","2019-11-14T15:10:42.105",91]
["Test04","Martin Aavik","2019-11-28T13:34:28.368",74]
["Test01","Viktoria Lumi","2019-11-04T22:59:20.992",56]
["Test01","Joonas Haljas","2019-11-18T08:25:40.142",24]
["Test04","Hanna Laid","2019-11-24T23:13:52.570",50]
["Test01","Kristina Merila","2019-11-02T15:35:56.669",98]
["Test04","Markus Niidas","2019-11-28T11:00:46.773",58]
["Test03","Egert Vint","2019-11-12T12:57:50.737",53]
["Test01","Joonas Haljas","2019-11-26T23:35:11.322",46]
["Test01","Egert Vint","2019-11-27T10:18:33.085",100]
["Test02","Joonas Haljas","2019-11-20T18:13:40.879",81]
["Test03","Viktoria Lumi","2019-11-14T09:09:23.190",27]
["Test04","Urmas Lõhmus","2019-11-01T18:49:21.886",30]
[{"$f":"INDEX($G$4:$G$7,RANDBETWEEN(1,4))","v":"Test02"},{"$f":"INDEX($I$2:$I$36,RANDBETWEEN(1,35))","v":"Jaagup Kivi"},{"$f":"RANDBETWEEN($F$2,$G$2)+$F$1+RAND()*($G$1-$F$1)","v":"2019-11-27T17:55:00.486"},{"$f":"RANDBETWEEN(20,100)","v":24}]
["Test01","Rasmus Kroon","2019-11-05T16:52:51.230",34]
["Test01","Diana Taal","2019-11-04T16:29:52.778",46]
["Test03","Joonas Haljas","2019-11-15T22:40:54.038",28]
["Test04","Viktoria Lumi","2019-11-18T21:14:16.818",23]
["Test02","Mihkel Kulp","2019-11-29T22:00:29.988",79]
["Test04","Jana Kiisk","2019-11-06T17:37:17.021",95]
["Test02","Reimo Kala","2019-11-06T20:18:03.689",69]
["Test02","Maarja Pihlak","2019-11-01T22:48:35.710",41]
["Test02","Anna Koel","2019-11-04T19:53:12.512",67]
["Test03","Getlin Allas","2019-11-01T22:13:49.595",38]
["Test03","Rasmus Kroon","2019-11-15T14:34:53.405",86]
["Test01","Mihkel Kulp","2019-11-09T17:30:05.180",73]
["Test01","Paul Hein","2019-11-20T10:34:16.064",74]
["Test04","Mihkel Kulp","2019-11-22T08:08:40.578",37]
["Test03","Kristina Merila","2019-11-13T14:21:52.958",55]
["Test04","Anna Koel","2019-11-29T09:40:42.717",25]
["Test01","Robert Lentso","2019-11-22T15:04:35.554",68]
["Test01","Kertu Heinsoo","2019-11-15T13:55:19.344",98]
["Test03","Brita Kaljula","2019-11-08T20:50:19.245",91]
["Test01","Joonas Haljas","2019-11-06T15:29:05.551",36]
["Test04","Diana Taal","2019-11-19T14:30:03.207",98]
["Test04","Reimo Kala","2019-11-29T08:52:36.136",97]
["Test02","Kristina Merila","2019-11-15T09:38:14.013",29]
["Test04","Jana Kiisk","2019-11-15T23:45:13.514",100]
["Test01","Viktoria Lumi","2019-11-06T19:03:04.172",78]
["Test01","Lauri Vahtra","2019-11-22T15:53:32.742",31]
["Test03","Robert Lentso","2019-11-16T08:05:04.167",37]
["Test01","Urmas Lõhmus","2019-11-17T08:28:21.334",40]
["Test03","Karin Saar","2019-11-29T13:14:29.362",84]
["Test03","Kertu Heinsoo","2019-11-21T11:53:23.631",59]
["Test04","Rasmus Kroon","2019-11-03T10:50:57.525",36]
["Test04","Maarja Pihlak","2019-11-04T13:38:46.035",63]
["Test03","Diana Taal","2019-11-01T22:19:06.101",47]
["Test04","Alari Suur","2019-11-18T20:48:45.823",44]
["Test04","Egert Vint","2019-11-28T18:35:26.921",81]
["Test04","Hans Kukk","2019-11-01T18:57:18.812",31]
["Test03","Kaspar Raude","2019-11-08T15:38:03.309",22]
["Test01","Sander Kell","2019-11-04T14:48:00.089",25]
["Test04","Markus Niidas","2019-11-01T10:57:58.907",64]
["Test02","Reimo Kala","2019-11-06T18:12:09.840",24]
["Test03","Kaspar Raude","2019-11-15T16:29:25.235",74]
["Test02","Urmas Lõhmus","2019-11-28T14:16:52.486",94]
["Test02","Tarvo Järv","2019-11-15T14:38:41.010",76]
["Test01","Anette Lepp","2019-11-25T21:32:06.402",27]
["Test04","Joonas Haljas","2019-11-09T20:25:07.373",93]
["Test03","Jaagup Kivi","2019-11-07T08:11:27.028",92]
["Test01","Maarja Pihlak","2019-11-15T13:56:51.752",23]
["Test03","Markus Niidas","2019-11-05T17:30:06.282",37]
["Test03","Carmen Sõrmus","2019-11-23T22:44:33.807",73]
["Test02","Reimo Kala","2019-11-18T17:55:07.371",74]
["Test01","Kristina Merila","2019-11-26T22:55:38.845",60]
["Test02","Anna Koel","2019-11-03T19:09:22.485",30]
["Test02","Urmas Lõhmus","2019-11-05T18:53:28.822",48]
["Test04","Brita Kaljula","2019-11-02T22:38:57.262",41]
["Test04","Hanna Laid","2019-11-05T23:01:41.820",43]
["Test02","Armin Kaasik","2019-11-26T14:04:23.663",26]
["Test01","Jaagup Kivi","2019-11-03T10:30:58.507",32]
["Test01","Emili Loorits","2019-11-26T10:04:06.344",56]
["Test04","Lauri Vahtra","2019-11-25T14:01:58.758",47]
["Test03","Getlin Allas","2019-11-29T17:57:43.549",94]
["Test02","Karin Saar","2019-11-28T20:52:45.865",58]
["Test03","Hanna Laid","2019-11-28T17:38:44.142",54]
["Test04","Carmen Sõrmus","2019-11-05T14:13:15.372",87]
[{"$f":"INDEX($G$4:$G$7,RANDBETWEEN(1,4))","v":"Test02"},{"$f":"INDEX($I$2:$I$36,RANDBETWEEN(1,35))","v":"Hanna Laid"},{"$f":"RANDBETWEEN($F$2,$G$2)+$F$1+RAND()*($G$1-$F$1)","v":"2019-11-27T15:04:49.081"},{"$f":"RANDBETWEEN(20,100)","v":85}]
["Test04","Tarvo Järv","2019-11-27T17:12:13.058",92]
["Test01","Getlin Allas","2019-11-11T19:28:29.222",88]
["Test02","Carmen Sõrmus","2019-11-13T23:45:05.783",24]
["Test02","Rasmus Kroon","2019-11-02T10:44:10.604",70]
["Test03","Lauri Vahtra","2019-11-23T21:51:43.272",99]
["Test03","Egert Vint","2019-11-30T17:02:02.089",96]
["Test03","Anette Lepp","2019-11-02T19:41:15.268",32]
["Test03","Maarja Pihlak","2019-11-23T11:03:36.945",52]
["Test03","Kertu Heinsoo","2019-11-04T18:33:26.775",65]
["Test04","Martin Aavik","2019-11-08T10:48:11.498",63]
["Test02","Artur Piiri","2019-11-05T09:23:46.294",45]
["Test01","Jaagup Kivi","2019-11-24T22:27:07.371",75]
["Test01","Paul Hein","2019-11-06T16:35:12.494",84]
["Test01","Maarja Pihlak","2019-11-30T15:39:49.901",48]
["Test01","Markus Niidas","2019-11-01T21:20:33.533",98]
["Test04","Markus Niidas","2019-11-13T13:16:35.167",67]
["Test01","Mihkel Kulp","2019-11-22T17:36:02.131",33]
["Test02","Diana Taal","2019-11-05T14:34:22.316",98]
["Test04","Sander Kell","2019-11-03T09:10:09.738",25]
["Test04","Rasmus Kroon","2019-11-12T18:34:23.185",68]
["Test02","Reimo Kala","2019-11-22T13:07:48.661",45]
["Test04","Egert Vint","2019-11-12T10:15:18.622",21]
["Test01","Hans Kukk","2019-11-18T12:08:35.948",46]
["Test01","Tarvo Järv","2019-11-23T09:49:55.460",73]
["Test04","Maarja Pihlak","2019-11-01T15:13:12.048",58]
["Test03","Jana Kiisk","2019-11-03T22:39:59.844",99]
["Test04","Anette Lepp","2019-11-17T08:58:20.592",30]
["Test02","Emili Loorits","2019-11-23T11:33:32.896",76]
["Test01","Maarja Pihlak","2019-11-10T09:33:57.672",80]
["Test04","Kaspar Raude","2019-11-09T11:56:15.381",67]
["Test04","Hanna Laid","2019-11-04T13:12:49.501",42]
["Test03","Carmen Sõrmus","2019-11-04T09:23:56.076",41]
["Test03","Paul Hein","2019-11-18T21:13:46.531",92]
["Test01","Brita Kaljula","2019-11-12T13:44:19.550",89]
["Test03","Sander Kell","2019-11-20T20:22:30.478",38]
["Test01","Emili Loorits","2019-11-22T15:45:26.564",80]
["Test01","Alari Suur","2019-11-28T19:20:58.171",93]
["Test03","Joonas Haljas","2019-11-09T09:30:02.707",34]
["Test03","Kristina Merila","2019-11-08T12:20:39.884",36]
["Test03","Alari Suur","2019-11-14T11:36:27.607",70]
["Test04","Anna Koel","2019-11-09T08:44:37.710",45]
["Test03","Artur Piiri","2019-11-21T08:46:57.008",69]
["Test01","Jaagup Kivi","2019-11-02T18:41:15.754",63]
["Test04","Emili Loorits","2019-11-21T20:58:53.551",90]
["Test04","Hanna Laid","2019-11-18T09:13:15.398",58]
["Test04","Emili Loorits","2019-11-29T15:54:18.039",81]
["Test04","Artur Piiri","2019-11-16T21:25:00.201",53]
["Test03","Robert Lentso","2019-11-13T18:40:51.844",64]
["Test03","Egert Vint","2019-11-04T13:38:53.369",93]
["Test03","Urmas Lõhmus","2019-11-10T09:04:29.352",32]
["Test04","Maarja Pihlak","2019-11-20T20:30:21.481",46]
["Test03","Urmas Lõhmus","2019-11-23T19:20:09.484",55]
["Test02","Rasmus Kroon","2019-11-01T22:55:32.463",100]
["Test04","Tarvo Järv","2019-11-20T20:34:45.597",80]
["Test01","Kaspar Raude","2019-11-07T20:51:55.754",21]
["Test03","Viktoria Lumi","2019-11-29T13:43:38.800",68]
["Test04","Egert Vint","2019-11-17T09:12:51.448",46]
["Test04","Paul Hein","2019-11-23T21:37:09.165",38]
["Test03","Mihkel Kulp","2019-11-12T19:02:18.121",68]
["Test01","Kaspar Raude","2019-11-24T19:21:51.406",52]
["Test04","Viktoria Lumi","2019-11-06T13:15:37.904",33]
["Test01","Kertu Heinsoo","2019-11-24T12:26:04.431",85]
["Test01","Jana Kiisk","2019-11-10T09:47:59.883",90]
[{"$f":"INDEX($G$4:$G$7,RANDBETWEEN(1,4))","v":"Test01"},{"$f":"INDEX($I$2:$I$36,RANDBETWEEN(1,35))","v":"Kertu Heinsoo"},{"$f":"RANDBETWEEN($F$2,$G$2)+$F$1+RAND()*($G$1-$F$1)","v":"2019-11-24T15:25:24.773"},{"$f":"RANDBETWEEN(20,100)","v":76}]
["Test02","Markus Niidas","2019-11-06T12:50:32.399",37]
["Test02","Kaspar Raude","2019-11-21T22:39:39.387",46]
["Test02","Jana Kiisk","2019-11-25T13:10:00.738",20]
["Test04","Diana Taal","2019-11-04T17:25:24.238",91]
["Test03","Artur Piiri","2019-11-02T18:20:45.010",38]
["Test03","Mihkel Kulp","2019-11-27T08:48:20.206",54]
["Test03","Reimo Kala","2019-11-21T19:25:05.130",35]
["Test03","Kertu Heinsoo","2019-11-18T16:10:16.382",87]
["Test01","Jana Kiisk","2019-11-02T15:44:07.072",75]
["Test04","Urmas Lõhmus","2019-11-01T14:13:33.323",90]
["Test04","Martin Aavik","2019-11-22T11:39:25.006",51]
["Test03","Diana Taal","2019-11-12T16:14:33.980",40]
["Test03","Artur Piiri","2019-11-01T12:03:07.273",74]
["Test04","Sander Kell","2019-11-08T16:00:40.353",80]
["Test04","Paul Hein","2019-11-17T15:09:02.958",82]
["Test02","Mihkel Kulp","2019-11-06T09:38:47.695",71]
["Test02","Maarja Pihlak","2019-11-18T10:01:06.836",57]
["Test03","Egert Vint","2019-11-10T19:48:17.485",33]
["Test03","Carmen Sõrmus","2019-11-30T17:50:08.966",84]
["Test01","Kaspar Raude","2019-11-04T11:36:21.604",51]
["Test01","Maarja Pihlak","2019-11-26T23:42:04.019",23]
["Test01","Egert Vint","2019-11-30T22:36:43.838",87]
["Test04","Diana Taal","2019-11-26T10:03:38.783",72]
["Test03","Hanna Laid","2019-11-02T21:23:25.251",36]
["Test02","Martin Aavik","2019-11-11T16:00:32.298",40]
["Test04","Joonas Haljas","2019-11-22T20:02:07.645",54]
["Test01","Paul Hein","2019-11-24T18:51:54.926",43]
["Test01","Kertu Heinsoo","2019-11-07T22:27:51.603",65]
["Test03","Armin Kaasik","2019-11-17T16:53:03.489",49]
["Test03","Hans Kukk","2019-11-23T22:29:25.425",71]
["Test01","Brita Kaljula","2019-11-19T14:41:03.647",52]
["Test01","Armin Kaasik","2019-11-21T20:27:24.059",85]
["Test02","Hans Kukk","2019-11-29T17:21:05.444",79]
["Test04","Joonas Haljas","2019-11-08T10:30:57.882",60]
["Test03","Jaagup Kivi","2019-11-03T14:29:40.730",59]
["Test02","Rasmus Kroon","2019-11-02T17:00:32.754",39]
["Test04","Kristina Merila","2019-11-18T17:56:32.634",91]
["Test04","Martin Aavik","2019-11-30T20:27:00.895",98]
["Test04","Diana Taal","2019-11-23T09:25:19.036",74]
["Test02","Katrin Laurits","2019-11-02T17:59:54.080",48]
["Test03","Markus Niidas","2019-11-28T22:50:52.969",31]
["Test03","Alari Suur","2019-11-29T12:26:23.918",91]
["Test03","Egert Vint","2019-11-07T08:57:42.961",39]
["Test02","Paul Hein","2019-11-08T11:28:41.678",62]
["Test02","Katrin Laurits","2019-11-13T11:39:22.675",39]
["Test02","Emili Loorits","2019-11-24T14:35:15.598",57]
["Test04","Mihkel Kulp","2019-11-23T09:13:03.264",68]
["Test01","Hanna Laid","2019-11-07T13:15:49.672",100]
["Test02","Emili Loorits","2019-11-10T19:15:47.937",98]
["Test04","Mihkel Kulp","2019-11-15T17:58:55.797",61]
["Test04","Armin Kaasik","2019-11-03T23:07:22.677",68]
["Test04","Mihkel Kulp","2019-11-03T19:26:12.917",62]
["Test02","Martin Aavik","2019-11-13T20:40:59.025",69]
["Test01","Urmas Lõhmus","2019-11-03T21:41:56.073",79]
["Test01","Viktoria Lumi","2019-11-27T22:53:14.824",88]
["Test02","Rasmus Kroon","2019-11-27T16:38:09.643",55]
["Test02","Carmen Sõrmus","2019-11-15T11:09:17.229",67]
["Test02","Kertu Heinsoo","2019-11-08T14:01:21.840",20]
["Test01","Mihkel Kulp","2019-11-22T09:57:52.711",99]
["Test01","Anna Koel","2019-11-13T08:06:09.142",51]
["Test03","Kristina Merila","2019-11-16T21:52:51.945",80]
["Test02","Kertu Heinsoo","2019-11-30T23:22:49.740",74]
["Test02","Maarja Pihlak","2019-11-29T23:41:24.853",100]
[{"$f":"INDEX($G$4:$G$7,RANDBETWEEN(1,4))","v":"Test04"},{"$f":"INDEX($I$2:$I$36,RANDBETWEEN(1,35))","v":"Armin Kaasik"},{"$f":"RANDBETWEEN($F$2,$G$2)+$F$1+RAND()*($G$1-$F$1)","v":"2019-11-23T19:00:59.168"},{"$f":"RANDBETWEEN(20,100)","v":86}]
["Test03","Carmen Sõrmus","2019-11-28T17:27:46.437",60]
["Test01","Lauri Vahtra","2019-11-18T14:34:13.377",60]
["Test02","Paul Hein","2019-11-22T13:36:37.069",77]
["Test02","Katrin Laurits","2019-11-10T23:27:20.333",100]
["Test02","Artur Piiri","2019-11-29T09:20:27.970",58]
["Test01","Anette Lepp","2019-11-12T13:35:50.766",89]
["Test03","Carmen Sõrmus","2019-11-03T18:47:34.184",78]
["Test02","Diana Taal","2019-11-27T19:19:39.064",52]
["Test03","Anette Lepp","2019-11-16T12:47:00.691",24]
["Test01","Armin Kaasik","2019-11-21T10:01:21.752",58]
["Test01","Egert Vint","2019-11-22T13:07:21.998",98]
["Test02","Diana Taal","2019-11-22T15:28:26.315",79]
["Test01","Sander Kell","2019-11-14T23:12:12.745",50]
["Test04","Egert Vint","2019-11-14T22:58:01.442",88]
["Test03","Artur Piiri","2019-11-05T14:26:05.310",52]
["Test01","Kristina Merila","2019-11-11T22:05:01.962",40]
["Test03","Urmas Lõhmus","2019-11-16T21:43:44.962",58]
["Test03","Reimo Kala","2019-11-09T23:20:56.484",61]
["Test03","Carmen Sõrmus","2019-11-22T09:51:37.385",76]
["Test01","Carmen Sõrmus","2019-11-10T17:04:02.363",49]
["Test04","Emili Loorits","2019-11-07T22:37:10.596",36]
["Test01","Anna Koel","2019-11-25T20:15:12.230",85]
["Test01","Sander Kell","2019-11-13T12:44:16.421",39]
["Test02","Maarja Pihlak","2019-11-26T15:39:39.956",99]
["Test01","Artur Piiri","2019-11-02T15:53:34.417",34]
["Test03","Diana Taal","2019-11-23T20:10:19.709",91]
["Test03","Jana Kiisk","2019-11-13T10:57:52.806",96]
["Test03","Joonas Haljas","2019-11-08T16:22:20.396",72]
["Test02","Rasmus Kroon","2019-11-01T09:51:52.796",47]
["Test01","Brita Kaljula","2019-11-14T09:47:49.486",37]
["Test02","Kristina Merila","2019-11-23T13:11:04.926",52]
["Test03","Maarja Pihlak","2019-11-30T08:18:10.839",93]
["Test02","Carmen Sõrmus","2019-11-03T19:28:09.506",54]
["Test03","Hans Kukk","2019-11-04T21:41:09.212",89]
["Test04","Rasmus Kroon","2019-11-08T17:52:21.897",66]
["Test03","Markus Niidas","2019-11-30T13:43:38.941",82]
["Test04","Kristina Merila","2019-11-28T16:08:17.361",67]
["Test04","Anette Lepp","2019-11-08T18:09:30.492",29]
["Test02","Egert Vint","2019-11-14T12:18:09.341",54]
["Test03","Anna Koel","2019-11-24T08:52:19.764",96]
["Test04","Diana Taal","2019-11-10T11:46:52.545",80]
["Test02","Anette Lepp","2019-11-20T15:57:29.303",71]
["Test04","Hans Kukk","2019-11-28T23:28:03.510",54]
["Test02","Jana Kiisk","2019-11-21T17:52:05.094",37]
["Test04","Hans Kukk","2019-11-20T14:35:10.463",91]
["Test02","Karin Saar","2019-11-29T13:25:37.880",73]
["Test02","Markus Niidas","2019-11-02T17:35:06.081",62]
["Test04","Paul Hein","2019-11-20T23:49:48.038",22]
["Test02","Anette Lepp","2019-11-02T11:03:00.426",47]
["Test04","Kaspar Raude","2019-11-02T23:17:11.546",78]
["Test02","Egert Vint","2019-11-02T23:07:31.447",54]
["Test04","Kaspar Raude","2019-11-08T12:17:51.771",71]
["Test03","Kaspar Raude","2019-11-13T13:52:35.075",82]
["Test04","Hanna Laid","2019-11-01T22:00:52.894",60]
["Test04","Karin Saar","2019-11-02T08:03:13.583",65]
["Test01","Viktoria Lumi","2019-11-04T22:47:32.827",83]
["Test04","Hanna Laid","2019-11-18T08:26:19.345",98]
["Test01","Alari Suur","2019-11-24T11:33:29.521",56]
["Test01","Katrin Laurits","2019-11-14T10:54:21.132",44]
["Test03","Armin Kaasik","2019-11-02T20:25:05.797",68]
["Test01","Getlin Allas","2019-11-01T20:12:30.375",62]
["Test03","Martin Aavik","2019-11-11T19:20:31.291",26]
["Test02","Markus Niidas","2019-11-14T23:04:34.257",92]
[{"$f":"INDEX($G$4:$G$7,RANDBETWEEN(1,4))","v":"Test03"},{"$f":"INDEX($I$2:$I$36,RANDBETWEEN(1,35))","v":"Egert Vint"},{"$f":"RANDBETWEEN($F$2,$G$2)+$F$1+RAND()*($G$1-$F$1)","v":"2019-11-04T15:32:41.063"},{"$f":"RANDBETWEEN(20,100)","v":74}]
["Test04","Mihkel Kulp","2019-11-05T09:34:27.509",31]
["Test03","Sander Kell","2019-11-07T11:31:23.640",20]
["Test04","Paul Hein","2019-11-13T15:29:57.699",84]
["Test02","Rasmus Kroon","2019-11-10T10:13:50.364",51]
["Test04","Markus Niidas","2019-11-21T21:51:27.185",88]
["Test02","Sander Kell","2019-11-30T12:54:14.615",36]
["Test02","Urmas Lõhmus","2019-11-19T13:08:53.204",70]
["Test01","Egert Vint","2019-11-17T18:42:05.299",61]
["Test03","Robert Lentso","2019-11-03T13:46:06.304",23]
["Test02","Markus Niidas","2019-11-21T16:12:45.819",75]
["Test04","Emili Loorits","2019-11-09T18:46:52.169",23]
["Test04","Kaspar Raude","2019-11-26T22:12:28.645",72]
["Test04","Rasmus Kroon","2019-11-03T16:35:42.856",30]
["Test02","Karin Saar","2019-11-21T12:55:53.572",94]
["Test02","Hans Kukk","2019-11-07T11:22:48.683",38]
["Test04","Tarvo Järv","2019-11-01T12:46:23.768",45]
["Test01","Diana Taal","2019-11-17T10:11:18.524",93]
["Test04","Joonas Haljas","2019-11-14T17:29:27.992",86]
["Test04","Karin Saar","2019-11-07T09:37:08.032",33]
["Test03","Urmas Lõhmus","2019-11-19T12:23:50.401",70]
["Test02","Artur Piiri","2019-11-24T13:30:34.231",82]
["Test04","Kertu Heinsoo","2019-11-14T09:02:18.103",54]
["Test02","Hanna Laid","2019-11-12T14:28:39.243",39]
["Test04","Kertu Heinsoo","2019-11-14T15:51:55.222",62]
["Test04","Hanna Laid","2019-11-23T16:13:54.311",20]
["Test03","Hanna Laid","2019-11-12T16:20:46.789",95]
["Test04","Reimo Kala","2019-11-07T23:52:49.412",92]
["Test01","Tarvo Järv","2019-11-08T17:53:43.363",75]
["Test01","Katrin Laurits","2019-11-24T17:35:28.649",37]
["Test04","Alari Suur","2019-11-27T16:42:09.161",27]
["Test03","Mihkel Kulp","2019-11-17T18:47:09.192",32]
["Test02","Markus Niidas","2019-11-01T10:14:59.647",96]
["Test02","Kaspar Raude","2019-11-01T13:19:17.783",86]
["Test03","Kertu Heinsoo","2019-11-26T13:46:36.213",42]
["Test01","Joonas Haljas","2019-11-25T18:36:41.426",72]
["Test04","Robert Lentso","2019-11-11T16:20:37.411",66]
["Test03","Maarja Pihlak","2019-11-23T18:00:23.881",95]
["Test02","Brita Kaljula","2019-11-29T10:59:10.011",38]
["Test02","Mihkel Kulp","2019-11-28T16:27:23.404",45]
["Test04","Sander Kell","2019-11-27T10:00:50.160",29]
["Test03","Emili Loorits","2019-11-03T22:03:33.028",24]
["Test01","Rasmus Kroon","2019-11-23T14:36:09.770",95]
["Test01","Viktoria Lumi","2019-11-02T18:00:42.615",25]
["Test03","Viktoria Lumi","2019-11-28T16:19:54.688",62]
["Test04","Maarja Pihlak","2019-11-02T22:47:18.741",90]
["Test03","Robert Lentso","2019-11-23T21:03:15.592",69]
["Test02","Maarja Pihlak","2019-11-21T21:19:57.554",46]
["Test03","Martin Aavik","2019-11-11T13:04:41.724",90]
["Test01","Anna Koel","2019-11-13T11:44:39.774",96]
["Test01","Kristina Merila","2019-11-16T14:43:21.259",85]
["Test03","Robert Lentso","2019-11-07T08:47:27.631",85]
["Test03","Hanna Laid","2019-11-17T13:20:43.016",69]
["Test02","Egert Vint","2019-11-28T10:24:58.029",42]
["Test03","Diana Taal","2019-11-24T15:51:57.276",94]
["Test04","Hans Kukk","2019-11-10T16:48:34.398",28]
["Test03","Hans Kukk","2019-11-09T11:14:05.655",34]
["Test01","Karin Saar","2019-11-23T13:46:59.418",41]
["Test02","Diana Taal","2019-11-11T23:39:18.841",74]
["Test04","Lauri Vahtra","2019-11-21T22:13:43.149",90]
["Test02","Carmen Sõrmus","2019-11-02T14:21:57.867",70]
["Test04","Emili Loorits","2019-11-04T18:56:35.093",77]
["Test02","Kaspar Raude","2019-11-14T08:26:31.107",68]
["Test01","Hans Kukk","2019-11-27T23:44:45.348",86]
[{"$f":"INDEX($G$4:$G$7,RANDBETWEEN(1,4))","v":"Test02"},{"$f":"INDEX($I$2:$I$36,RANDBETWEEN(1,35))","v":"Robert Lentso"},{"$f":"RANDBETWEEN($F$2,$G$2)+$F$1+RAND()*($G$1-$F$1)","v":"2019-11-07T15:07:34.168"},{"$f":"RANDBETWEEN(20,100)","v":38}]
["Test02","Mihkel Kulp","2019-11-10T18:44:14.897",45]
["Test02","Jana Kiisk","2019-11-23T09:11:39.214",76]
["Test03","Karin Saar","2019-11-22T19:02:37.074",52]
["Test04","Armin Kaasik","2019-11-10T13:11:09.924",65]
["Test02","Egert Vint","2019-11-12T23:17:07.448",64]
["Test02","Kaspar Raude","2019-11-18T15:44:59.978",88]
["Test01","Markus Niidas","2019-11-13T10:52:21.115",63]
["Test02","Markus Niidas","2019-11-30T16:10:03.681",21]
["Test04","Katrin Laurits","2019-11-02T20:21:12.859",27]
["Test04","Reimo Kala","2019-11-24T10:58:58.595",65]
["Test01","Kaspar Raude","2019-11-06T09:31:09.012",50]
["Test03","Jana Kiisk","2019-11-27T23:36:50.770",55]
["Test03","Egert Vint","2019-11-24T15:30:11.727",53]
["Test04","Jaagup Kivi","2019-11-15T11:56:00.780",27]
["Test04","Emili Loorits","2019-11-06T14:05:38.404",95]
["Test04","Anna Koel","2019-11-30T22:01:33.433",86]
["Test02","Jana Kiisk","2019-11-12T12:37:02.160",78]
["Test02","Rasmus Kroon","2019-11-20T11:27:11.405",86]
["Test02","Kaspar Raude","2019-11-03T08:41:08.522",51]
["Test02","Erik Pärn","2019-11-09T18:04:32.811",39]
["Test02","Rasmus Kroon","2019-11-16T15:52:14.357",61]
["Test03","Mihkel Kulp","2019-11-20T19:28:13.518",50]
["Test01","Kaspar Raude","2019-11-16T16:37:00.444",63]
["Test03","Alari Suur","2019-11-19T13:08:09.974",78]
["Test02","Maarja Pihlak","2019-11-10T19:29:26.465",71]
["Test02","Armin Kaasik","2019-11-19T17:53:15.145",85]
["Test01","Lauri Vahtra","2019-11-05T14:00:11.854",75]
["Test01","Armin Kaasik","2019-11-06T21:38:41.822",23]
["Test04","Joonas Haljas","2019-11-10T21:17:24.510",85]
["Test02","Artur Piiri","2019-11-28T09:01:12.006",27]
["Test02","Emili Loorits","2019-11-12T19:16:03.595",98]
["Test01","Getlin Allas","2019-11-30T12:00:14.264",88]
["Test03","Katrin Laurits","2019-11-14T10:16:28.183",50]
["Test03","Viktoria Lumi","2019-11-10T20:38:50.484",29]
["Test04","Diana Taal","2019-11-03T23:18:44.694",44]
["Test01","Markus Niidas","2019-11-22T19:43:47.761",77]
["Test03","Robert Lentso","2019-11-21T17:08:37.878",69]
["Test01","Egert Vint","2019-11-24T16:09:21.110",95]
["Test04","Jana Kiisk","2019-11-14T09:03:20.241",50]
["Test03","Anette Lepp","2019-11-09T15:55:41.518",45]
["Test01","Viktoria Lumi","2019-11-15T09:21:12.131",63]
["Test02","Kaspar Raude","2019-11-18T14:45:35.119",77]
["Test04","Egert Vint","2019-11-23T08:26:13.430",70]
["Test01","Kaspar Raude","2019-11-21T13:25:00.321",63]
["Test01","Erik Pärn","2019-11-19T21:30:42.884",47]
["Test04","Katrin Laurits","2019-11-04T09:06:53.036",67]
["Test01","Maarja Pihlak","2019-11-17T19:02:59.769",45]
["Test01","Maarja Pihlak","2019-11-01T09:31:20.705",42]
["Test04","Armin Kaasik","2019-11-21T18:16:02.459",60]
["Test02","Alari Suur","2019-11-11T13:24:47.567",62]
["Test01","Anette Lepp","2019-11-05T17:26:06.687",82]
["Test03","Kristina Merila","2019-11-25T10:23:16.172",92]
["Test04","Katrin Laurits","2019-11-10T14:41:42.340",76]
["Test04","Lauri Vahtra","2019-11-08T20:14:42.438",32]
["Test02","Mihkel Kulp","2019-11-13T14:57:49.768",41]
["Test04","Tarvo Järv","2019-11-03T09:34:51.330",24]
["Test04","Mihkel Kulp","2019-11-26T21:33:28.355",62]
["Test02","Artur Piiri","2019-11-11T13:38:00.749",62]
["Test01","Carmen Sõrmus","2019-11-23T15:13:12.527",26]
["Test02","Rasmus Kroon","2019-11-12T09:06:05.716",81]
["Test02","Katrin Laurits","2019-11-19T18:01:53.400",90]
["Test01","Egert Vint","2019-11-21T20:52:38.472",39]
["Test04","Joonas Haljas","2019-11-07T11:55:04.990",38]
[{"$f":"INDEX($G$4:$G$7,RANDBETWEEN(1,4))","v":"Test01"},{"$f":"INDEX($I$2:$I$36,RANDBETWEEN(1,35))","v":"Artur Piiri"},{"$f":"RANDBETWEEN($F$2,$G$2)+$F$1+RAND()*($G$1-$F$1)","v":"2019-11-28T21:25:10.206"},{"$f":"RANDBETWEEN(20,100)","v":85}]
["Test03","Anette Lepp","2019-11-16T23:45:26.618",82]
["Test02","Markus Niidas","2019-11-17T11:14:34.568",81]
["Test01","Egert Vint","2019-11-17T18:27:57.500",87]
["Test02","Karin Saar","2019-11-05T13:31:24.744",29]
["Test01","Hans Kukk","2019-11-13T18:50:16.157",88]
["Test02","Lauri Vahtra","2019-11-06T08:27:11.922",83]
["Test03","Paul Hein","2019-11-23T08:35:25.963",36]
["Test01","Anette Lepp","2019-11-27T14:37:19.739",53]
["Test03","Viktoria Lumi","2019-11-23T11:40:56.711",64]
["Test03","Joonas Haljas","2019-11-06T17:24:49.629",93]
["Test02","Paul Hein","2019-11-15T18:14:35.157",20]
["Test02","Lauri Vahtra","2019-11-03T21:48:33.434",26]
["Test03","Alari Suur","2019-11-11T19:20:10.203",61]
["Test01","Anette Lepp","2019-11-11T17:59:00.601",78]
["Test01","Artur Piiri","2019-11-02T23:11:43.851",47]
["Test02","Markus Niidas","2019-11-17T10:41:46.992",71]
["Test02","Maarja Pihlak","2019-11-18T23:49:15.844",23]
["Test01","Rasmus Kroon","2019-11-20T08:19:42.931",53]
["Test02","Robert Lentso","2019-11-17T19:13:05.423",23]
["Test04","Mihkel Kulp","2019-11-07T08:40:23.385",99]
["Test04","Getlin Allas","2019-11-25T17:21:40.983",23]
["Test04","Diana Taal","2019-11-24T21:43:30.127",34]
["Test04","Paul Hein","2019-11-27T08:03:34.211",93]
["Test04","Sander Kell","2019-11-11T13:57:39.670",75]
["Test01","Karin Saar","2019-11-23T08:15:32.513",72]
["Test04","Emili Loorits","2019-11-26T19:38:22.968",98]
["Test01","Anna Koel","2019-11-23T16:32:25.947",25]
["Test01","Erik Pärn","2019-11-09T15:17:09.155",62]
["Test02","Robert Lentso","2019-11-30T09:41:35.448",77]
["Test03","Emili Loorits","2019-11-24T14:15:24.125",74]
["Test02","Artur Piiri","2019-11-12T10:43:11.601",20]
["Test02","Hans Kukk","2019-11-21T21:58:33.166",60]
["Test04","Emili Loorits","2019-11-28T12:05:57.108",74]
["Test03","Martin Aavik","2019-11-03T10:11:56.426",50]
["Test04","Mihkel Kulp","2019-11-07T16:09:22.256",60]
["Test01","Carmen Sõrmus","2019-11-08T08:37:31.203",30]
["Test02","Jaagup Kivi","2019-11-01T13:35:47.754",66]
["Test04","Erik Pärn","2019-11-12T15:44:25.517",38]
["Test02","Egert Vint","2019-11-19T11:07:27.353",56]
["Test02","Sander Kell","2019-11-06T23:19:08.157",93]
["Test04","Armin Kaasik","2019-11-23T15:33:42.370",96]
["Test03","Hans Kukk","2019-11-24T18:59:01.115",28]
["Test02","Rasmus Kroon","2019-11-13T19:56:42.073",48]
["Test01","Alari Suur","2019-11-16T21:36:08.255",85]
["Test01","Emili Loorits","2019-11-02T22:25:26.132",41]
["Test04","Robert Lentso","2019-11-16T16:07:08.110",76]
["Test01","Getlin Allas","2019-11-06T23:07:07.342",76]
["Test03","Artur Piiri","2019-11-07T16:25:44.752",21]
["Test03","Kristina Merila","2019-11-25T08:51:31.023",50]
["Test02","Markus Niidas","2019-11-05T11:50:08.949",75]
["Test03","Joonas Haljas","2019-11-25T19:45:28.072",52]
["Test04","Armin Kaasik","2019-11-15T21:19:20.103",46]
["Test01","Robert Lentso","2019-11-23T15:49:45.875",59]
["Test01","Carmen Sõrmus","2019-11-21T18:34:46.816",64]
["Test02","Getlin Allas","2019-11-01T15:04:23.037",81]
["Test02","Anna Koel","2019-11-08T15:12:34.535",46]
["Test03","Martin Aavik","2019-11-17T23:44:27.375",33]
["Test03","Joonas Haljas","2019-11-05T16:35:01.620",68]
["Test01","Maarja Pihlak","2019-11-10T17:04:39.740",57]
["Test04","Tarvo Järv","2019-11-12T16:28:36.701",41]
["Test01","Armin Kaasik","2019-11-21T23:03:23.178",53]
["Test02","Hans Kukk","2019-11-29T19:12:32.357",96]
["Test03","Karin Saar","2019-11-21T15:21:04.478",46]
[{"$f":"INDEX($G$4:$G$7,RANDBETWEEN(1,4))","v":"Test01"},{"$f":"INDEX($I$2:$I$36,RANDBETWEEN(1,35))","v":"Hanna Laid"},{"$f":"RANDBETWEEN($F$2,$G$2)+$F$1+RAND()*($G$1-$F$1)","v":"2019-11-25T17:15:09.736"},{"$f":"RANDBETWEEN(20,100)","v":52}]
["Test01","Hans Kukk","2019-11-21T22:15:47.487",93]
["Test02","Markus Niidas","2019-11-16T09:29:22.228",66]
["Test01","Paul Hein","2019-11-29T11:41:02.118",99]
["Test03","Jana Kiisk","2019-11-14T10:08:57.803",48]
["Test01","Karin Saar","2019-11-05T16:54:55.627",72]
["Test02","Getlin Allas","2019-11-12T12:37:02.423",49]
["Test01","Paul Hein","2019-11-16T20:15:24.878",59]
["Test03","Katrin Laurits","2019-11-14T17:13:02.409",100]
["Test02","Hans Kukk","2019-11-23T22:54:51.664",77]
["Test03","Viktoria Lumi","2019-11-20T08:35:35.208",35]
["Test04","Diana Taal","2019-11-29T21:22:05.121",50]
["Test04","Erik Pärn","2019-11-19T09:21:51.662",42]
["Test03","Markus Niidas","2019-11-03T16:36:57.575",49]
["Test03","Hanna Laid","2019-11-06T08:07:35.894",90]
["Test01","Joonas Haljas","2019-11-17T13:11:43.132",29]
["Test02","Kaspar Raude","2019-11-24T11:11:35.977",88]
["Test01","Getlin Allas","2019-11-27T22:33:38.963",78]
["Test03","Artur Piiri","2019-11-05T10:17:45.763",85]
["Test04","Rasmus Kroon","2019-11-27T10:02:35.196",20]
["Test02","Rasmus Kroon","2019-11-04T18:07:03.483",73]
["Test01","Erik Pärn","2019-11-16T18:23:52.231",26]
["Test04","Emili Loorits","2019-11-15T14:48:44.279",56]
["Test02","Tarvo Järv","2019-11-11T20:19:16.722",21]
["Test01","Anna Koel","2019-11-25T14:04:37.301",57]
["Test01","Urmas Lõhmus","2019-11-13T17:42:53.206",57]
["Test01","Carmen Sõrmus","2019-11-26T17:03:07.301",43]
["Test01","Mihkel Kulp","2019-11-05T11:41:59.473",28]
["Test01","Robert Lentso","2019-11-07T16:46:02.382",94]
["Test01","Anna Koel","2019-11-27T23:08:40.755",69]
["Test03","Erik Pärn","2019-11-13T19:58:36.884",22]
["Test04","Joonas Haljas","2019-11-09T11:59:30.210",36]
["Test02","Katrin Laurits","2019-11-07T14:52:05.822",84]
["Test04","Karin Saar","2019-11-27T13:47:44.548",86]
["Test02","Jana Kiisk","2019-11-03T14:55:54.898",79]
["Test02","Paul Hein","2019-11-26T23:17:46.113",61]
["Test03","Joonas Haljas","2019-11-01T09:31:01.642",70]
["Test03","Carmen Sõrmus","2019-11-05T19:28:36.872",49]
["Test03","Egert Vint","2019-11-26T10:55:21.424",36]
["Test02","Urmas Lõhmus","2019-11-09T17:18:47.879",48]
["Test01","Rasmus Kroon","2019-11-04T14:49:43.254",69]
["Test04","Carmen Sõrmus","2019-11-04T09:12:59.051",42]
["Test02","Paul Hein","2019-11-02T22:44:29.260",75]
["Test01","Robert Lentso","2019-11-21T12:55:20.087",88]
["Test04","Maarja Pihlak","2019-11-25T16:34:02.606",70]
["Test02","Tarvo Järv","2019-11-17T16:49:09.653",76]
["Test01","Hanna Laid","2019-11-21T19:30:31.908",21]
["Test04","Viktoria Lumi","2019-11-16T14:29:43.081",54]
["Test04","Carmen Sõrmus","2019-11-27T23:50:24.534",82]
["Test04","Jana Kiisk","2019-11-07T14:05:43.793",37]
["Test01","Carmen Sõrmus","2019-11-24T16:58:51.275",30]
["Test02","Viktoria Lumi","2019-11-24T17:31:48.562",68]
["Test01","Joonas Haljas","2019-11-21T21:37:43.557",70]
["Test01","Paul Hein","2019-11-28T15:45:37.884",25]
["Test04","Anna Koel","2019-11-20T21:21:03.278",52]
["Test01","Diana Taal","2019-11-08T22:28:14.115",96]
["Test04","Hans Kukk","2019-11-27T08:31:28.251",52]
["Test01","Maarja Pihlak","2019-11-08T16:32:54.030",33]
["Test03","Urmas Lõhmus","2019-11-25T13:52:09.632",34]
["Test01","Reimo Kala","2019-11-26T08:27:59.573",24]
["Test04","Lauri Vahtra","2019-11-26T09:17:07.661",58]
["Test04","Joonas Haljas","2019-11-30T11:19:44.573",81]
["Test03","Katrin Laurits","2019-11-27T09:27:48.065",28]
["Test04","Viktoria Lumi","2019-11-01T11:08:40.964",65]
[{"$f":"INDEX($G$4:$G$7,RANDBETWEEN(1,4))","v":"Test02"},{"$f":"INDEX($I$2:$I$36,RANDBETWEEN(1,35))","v":"Diana Taal"},{"$f":"RANDBETWEEN($F$2,$G$2)+$F$1+RAND()*($G$1-$F$1)","v":"2019-11-20T14:46:09.316"},{"$f":"RANDBETWEEN(20,100)","v":43}]
["Test03","Anna Koel","2019-11-13T16:30:58.564",93]
["Test02","Maarja Pihlak","2019-11-12T13:16:24.198",68]
["Test03","Alari Suur","2019-11-10T22:21:20.102",56]
["Test03","Hanna Laid","2019-11-09T08:26:33.285",69]
["Test03","Katrin Laurits","2019-11-24T17:44:20.240",43]
["Test04","Maarja Pihlak","2019-11-26T08:45:58.354",34]
["Test02","Anette Lepp","2019-11-23T18:46:06.607",96]
["Test02","Tarvo Järv","2019-11-11T13:30:52.832",46]
["Test01","Maarja Pihlak","2019-11-06T18:24:20.020",23]
["Test04","Brita Kaljula","2019-11-11T10:39:54.902",33]
["Test02","Lauri Vahtra","2019-11-17T11:02:47.798",52]
["Test03","Hans Kukk","2019-11-01T22:50:07.863",80]
["Test04","Reimo Kala","2019-11-01T12:01:23.524",22]
["Test04","Markus Niidas","2019-11-05T08:35:26.452",42]
["Test04","Lauri Vahtra","2019-11-12T19:58:14.705",68]
["Test01","Sander Kell","2019-11-16T09:25:47.900",77]
["Test01","Kaspar Raude","2019-11-20T14:18:09.120",31]
["Test01","Egert Vint","2019-11-30T12:51:15.700",35]
["Test03","Martin Aavik","2019-11-20T21:29:47.278",71]
["Test01","Karin Saar","2019-11-12T09:07:30.390",51]
["Test01","Tarvo Järv","2019-11-05T21:33:15.835",61]
["Test01","Jaagup Kivi","2019-11-18T13:29:19.267",84]
["Test02","Rasmus Kroon","2019-11-03T10:57:17.804",50]
["Test01","Sander Kell","2019-11-07T19:33:59.736",77]
["Test01","Joonas Haljas","2019-11-14T20:31:49.247",52]
["Test02","Jana Kiisk","2019-11-08T21:48:17.104",36]
["Test04","Reimo Kala","2019-11-04T22:35:00.836",97]
["Test01","Carmen Sõrmus","2019-11-21T23:45:23.493",23]
["Test01","Kaspar Raude","2019-11-16T22:46:28.657",21]
["Test03","Egert Vint","2019-11-15T12:09:14.588",90]
["Test02","Sander Kell","2019-11-07T16:57:46.970",44]
["Test03","Emili Loorits","2019-11-11T22:12:17.496",47]
["Test02","Viktoria Lumi","2019-11-30T11:42:38.006",98]
["Test01","Anette Lepp","2019-11-02T11:13:34.127",100]
["Test04","Erik Pärn","2019-11-10T08:41:06.197",24]
["Test02","Kertu Heinsoo","2019-11-11T15:26:34.284",92]
["Test01","Hans Kukk","2019-11-22T21:33:31.107",26]
["Test01","Kertu Heinsoo","2019-11-28T19:39:39.006",27]
["Test04","Jaagup Kivi","2019-11-18T17:14:00.452",44]
["Test01","Rasmus Kroon","2019-11-02T09:24:18.144",67]
["Test04","Carmen Sõrmus","2019-11-16T15:10:19.729",86]
["Test04","Jaagup Kivi","2019-11-09T20:12:58.711",36]
["Test01","Kristina Merila","2019-11-25T17:11:06.174",45]
["Test03","Kristina Merila","2019-11-19T21:32:45.199",74]
["Test03","Reimo Kala","2019-11-09T15:16:37.827",89]
["Test03","Alari Suur","2019-11-15T12:13:54.348",36]
["Test03","Kertu Heinsoo","2019-11-11T11:31:22.584",37]
["Test02","Brita Kaljula","2019-11-15T20:09:32.899",52]
["Test04","Brita Kaljula","2019-11-20T09:36:53.119",29]
["Test01","Markus Niidas","2019-11-19T17:47:12.456",68]
["Test04","Kristina Merila","2019-11-18T21:54:04.165",68]
["Test04","Emili Loorits","2019-11-29T21:48:19.637",38]
["Test03","Armin Kaasik","2019-11-29T23:18:39.687",26]
["Test01","Tarvo Järv","2019-11-04T19:28:04.114",99]
["Test03","Alari Suur","2019-11-27T12:24:13.796",25]
["Test04","Urmas Lõhmus","2019-11-01T21:33:52.686",93]
["Test03","Katrin Laurits","2019-11-16T21:07:23.043",82]
["Test04","Erik Pärn","2019-11-06T18:04:56.132",59]
["Test02","Kertu Heinsoo","2019-11-27T22:28:36.230",56]
["Test01","Anna Koel","2019-11-15T13:10:43.497",69]
["Test03","Jaagup Kivi","2019-11-24T12:42:54.685",60]
["Test04","Erik Pärn","2019-11-14T13:22:47.577",44]
["Test02","Joonas Haljas","2019-11-06T13:23:57.169",85]
[{"$f":"INDEX($G$4:$G$7,RANDBETWEEN(1,4))","v":"Test01"},{"$f":"INDEX($I$2:$I$36,RANDBETWEEN(1,35))","v":"Reimo Kala"},{"$f":"RANDBETWEEN($F$2,$G$2)+$F$1+RAND()*($G$1-$F$1)","v":"2019-11-19T15:53:42.442"},{"$f":"RANDBETWEEN(20,100)","v":46}]
["Test03","Brita Kaljula","2019-11-26T16:02:34.471",38]
["Test04","Brita Kaljula","2019-11-24T14:27:45.915",24]
["Test03","Egert Vint","2019-11-16T15:48:37.589",65]
["Test04","Maarja Pihlak","2019-11-21T21:43:23.821",37]
["Test04","Armin Kaasik","2019-11-25T14:47:46.380",78]
["Test02","Kertu Heinsoo","2019-11-09T16:18:49.543",74]
["Test02","Martin Aavik","2019-11-05T20:25:22.039",54]
["Test01","Armin Kaasik","2019-11-23T12:35:46.761",50]
["Test01","Anette Lepp","2019-11-27T22:07:36.777",41]
["Test02","Anna Koel","2019-11-26T14:51:46.694",73]
["Test03","Rasmus Kroon","2019-11-13T18:50:57.822",99]
["Test04","Anette Lepp","2019-11-18T15:26:10.122",52]
["Test02","Kristina Merila","2019-11-11T23:35:33.760",99]
["Test02","Emili Loorits","2019-11-08T10:36:35.495",79]
["Test01","Katrin Laurits","2019-11-21T11:43:30.486",69]
["Test03","Jana Kiisk","2019-11-20T12:07:53.024",61]
["Test01","Anette Lepp","2019-11-26T15:25:41.643",38]
["Test01","Jaagup Kivi","2019-11-02T23:13:02.731",64]
["Test04","Armin Kaasik","2019-11-17T15:55:04.856",97]
["Test01","Maarja Pihlak","2019-11-03T08:22:22.500",79]
["Test04","Brita Kaljula","2019-11-07T17:26:55.687",32]
["Test03","Sander Kell","2019-11-23T12:14:50.336",56]
["Test01","Maarja Pihlak","2019-11-10T19:40:43.354",30]
["Test03","Viktoria Lumi","2019-11-09T09:42:17.075",100]
["Test03","Hans Kukk","2019-11-02T12:07:05.760",32]
["Test01","Katrin Laurits","2019-11-17T23:48:06.679",67]
["Test03","Reimo Kala","2019-11-25T21:30:46.598",99]
["Test03","Artur Piiri","2019-11-09T08:58:34.522",20]
["Test03","Sander Kell","2019-11-21T23:05:47.493",73]
["Test03","Viktoria Lumi","2019-11-23T12:44:47.186",26]
["Test03","Reimo Kala","2019-11-17T16:16:02.124",42]
["Test03","Tarvo Järv","2019-11-18T11:01:18.638",25]
["Test02","Hanna Laid","2019-11-30T13:47:56.641",28]
["Test01","Carmen Sõrmus","2019-11-02T15:16:39.823",76]
["Test04","Joonas Haljas","2019-11-09T12:22:15.270",71]
["Test03","Hanna Laid","2019-11-07T09:31:41.799",38]
["Test01","Kristina Merila","2019-11-08T09:03:00.651",60]
["Test01","Kaspar Raude","2019-11-22T14:26:38.029",87]
["Test01","Joonas Haljas","2019-11-15T17:38:44.603",36]
["Test02","Emili Loorits","2019-11-19T11:42:38.498",36]
["Test01","Hans Kukk","2019-11-24T16:26:46.740",32]
["Test01","Diana Taal","2019-11-21T09:06:24.621",43]
["Test03","Karin Saar","2019-11-27T14:46:22.885",66]
["Test03","Kertu Heinsoo","2019-11-04T18:22:57.249",36]
["Test04","Hans Kukk","2019-11-17T08:46:26.899",50]
["Test03","Katrin Laurits","2019-11-27T09:51:49.132",62]
["Test03","Anette Lepp","2019-11-07T17:11:25.197",30]
["Test01","Armin Kaasik","2019-11-01T20:15:17.011",29]
["Test01","Egert Vint","2019-11-03T14:56:38.528",83]
["Test01","Katrin Laurits","2019-11-11T08:54:19.720",49]
["Test04","Maarja Pihlak","2019-11-21T10:51:49.418",26]
["Test01","Jaagup Kivi","2019-11-10T17:35:21.100",100]
["Test04","Tarvo Järv","2019-11-11T21:57:45.737",36]
["Test02","Robert Lentso","2019-11-10T16:28:15.734",29]
["Test02","Egert Vint","2019-11-01T18:50:16.202",92]
["Test03","Karin Saar","2019-11-03T18:40:14.032",71]
["Test04","Mihkel Kulp","2019-11-26T21:05:33.497",53]
["Test01","Kaspar Raude","2019-11-08T12:47:47.383",38]
["Test01","Paul Hein","2019-11-10T12:20:13.930",58]
["Test02","Diana Taal","2019-11-12T11:59:52.723",71]
["Test03","Kaspar Raude","2019-11-21T17:10:27.763",56]
["Test01","Jana Kiisk","2019-11-05T14:40:41.623",82]
["Test02","Lauri Vahtra","2019-11-28T17:47:23.602",52]
[{"$f":"INDEX($G$4:$G$7,RANDBETWEEN(1,4))","v":"Test01"},{"$f":"INDEX($I$2:$I$36,RANDBETWEEN(1,35))","v":"Joonas Haljas"},{"$f":"RANDBETWEEN($F$2,$G$2)+$F$1+RAND()*($G$1-$F$1)","v":"2019-11-27T09:52:47.131"},{"$f":"RANDBETWEEN(20,100)","v":62}]
["Test04","Sander Kell","2019-11-04T19:22:47.676",75]
["Test01","Tarvo Järv","2019-11-21T23:49:24.018",95]
["Test01","Getlin Allas","2019-11-05T10:56:34.406",75]
["Test02","Kaspar Raude","2019-11-20T17:31:08.867",42]
["Test01","Emili Loorits","2019-11-22T20:11:39.249",27]
["Test02","Anette Lepp","2019-11-19T20:58:12.412",22]
["Test01","Alari Suur","2019-11-10T21:04:39.897",77]
["Test04","Katrin Laurits","2019-11-16T21:12:29.605",38]
["Test02","Anette Lepp","2019-11-28T15:01:16.487",84]
["Test03","Kristina Merila","2019-11-07T09:41:39.349",53]
["Test02","Joonas Haljas","2019-11-02T18:13:40.595",51]
["Test02","Carmen Sõrmus","2019-11-26T19:33:03.868",63]
["Test03","Sander Kell","2019-11-06T11:47:38.915",43]
["Test03","Martin Aavik","2019-11-04T16:19:17.122",67]
["Test04","Brita Kaljula","2019-11-19T15:02:06.431",35]
["Test04","Mihkel Kulp","2019-11-13T08:26:18.837",28]
["Test01","Hanna Laid","2019-11-18T21:49:40.509",70]
["Test04","Armin Kaasik","2019-11-22T17:18:31.150",83]
["Test02","Egert Vint","2019-11-22T17:01:56.856",30]
["Test03","Emili Loorits","2019-11-04T10:27:15.877",91]
["Test01","Robert Lentso","2019-11-11T20:16:56.070",62]
["Test03","Kaspar Raude","2019-11-22T09:52:36.697",37]
["Test01","Egert Vint","2019-11-23T20:22:35.106",74]
["Test01","Anna Koel","2019-11-08T18:18:53.899",92]
["Test01","Alari Suur","2019-11-06T19:04:06.373",59]
["Test04","Jana Kiisk","2019-11-30T21:26:48.240",89]
["Test04","Jana Kiisk","2019-11-30T19:32:25.765",28]
["Test04","Kristina Merila","2019-11-02T12:40:35.249",88]
["Test03","Joonas Haljas","2019-11-14T10:46:51.994",21]
["Test02","Egert Vint","2019-11-26T16:01:31.342",62]
["Test02","Jana Kiisk","2019-11-07T14:20:03.171",34]
["Test04","Markus Niidas","2019-11-07T17:45:04.538",91]
["Test04","Viktoria Lumi","2019-11-01T22:14:59.425",92]
["Test03","Jana Kiisk","2019-11-03T21:00:12.646",95]
["Test04","Lauri Vahtra","2019-11-28T09:29:52.017",22]
["Test03","Brita Kaljula","2019-11-15T09:13:40.907",83]
["Test02","Diana Taal","2019-11-03T11:27:30.858",96]
["Test04","Getlin Allas","2019-11-09T10:12:54.945",65]
["Test04","Brita Kaljula","2019-11-17T16:30:25.704",64]
["Test04","Maarja Pihlak","2019-11-18T13:19:23.828",27]
["Test04","Kertu Heinsoo","2019-11-01T23:44:23.730",44]
["Test03","Rasmus Kroon","2019-11-15T21:48:29.370",79]
["Test04","Kertu Heinsoo","2019-11-12T12:00:48.049",34]
["Test02","Urmas Lõhmus","2019-11-07T12:43:03.513",52]
["Test01","Kaspar Raude","2019-11-15T11:21:59.279",21]
["Test03","Katrin Laurits","2019-11-13T14:36:53.294",100]
["Test03","Tarvo Järv","2019-11-21T20:54:06.858",52]
["Test03","Tarvo Järv","2019-11-07T09:51:49.164",83]
["Test02","Paul Hein","2019-11-03T21:16:14.767",27]
["Test04","Tarvo Järv","2019-11-08T18:33:33.710",75]
["Test01","Brita Kaljula","2019-11-14T22:41:40.253",25]
["Test01","Martin Aavik","2019-11-12T11:42:58.990",32]
["Test03","Karin Saar","2019-11-11T21:22:08.097",98]
["Test03","Brita Kaljula","2019-11-22T18:56:24.593",45]
["Test02","Diana Taal","2019-11-28T09:11:20.852",37]
["Test03","Alari Suur","2019-11-09T12:05:02.015",95]
["Test04","Tarvo Järv","2019-11-25T10:25:03.426",70]
["Test01","Rasmus Kroon","2019-11-22T21:19:11.657",95]
["Test01","Carmen Sõrmus","2019-11-29T16:21:12.608",72]
["Test04","Alari Suur","2019-11-02T12:47:04.824",67]
["Test02","Kristina Merila","2019-11-17T08:28:32.925",80]
["Test01","Urmas Lõhmus","2019-11-08T10:03:43.837",40]
["Test02","Tarvo Järv","2019-11-11T14:20:36.417",25]
[{"$f":"INDEX($G$4:$G$7,RANDBETWEEN(1,4))","v":"Test03"},{"$f":"INDEX($I$2:$I$36,RANDBETWEEN(1,35))","v":"Erik Pärn"},{"$f":"RANDBETWEEN($F$2,$G$2)+$F$1+RAND()*($G$1-$F$1)","v":"2019-11-11T12:38:31.579"},{"$f":"RANDBETWEEN(20,100)","v":79}]
["Test02","Katrin Laurits","2019-11-01T22:19:19.314",65]
["Test01","Anna Koel","2019-11-21T08:32:27.604",37]
["Test03","Jaagup Kivi","2019-11-02T09:05:22.003",72]
["Test01","Alari Suur","2019-11-26T15:04:25.449",96]
["Test02","Anna Koel","2019-11-05T09:29:08.174",99]
["Test02","Urmas Lõhmus","2019-11-18T11:41:53.311",34]
["Test01","Emili Loorits","2019-11-15T11:02:05.881",31]
["Test01","Getlin Allas","2019-11-27T10:29:48.854",23]
["Test01","Sander Kell","2019-11-27T08:28:22.248",75]
["Test04","Tarvo Järv","2019-11-12T14:09:00.528",100]
["Test04","Brita Kaljula","2019-11-15T23:41:16.702",26]
["Test03","Tarvo Järv","2019-11-20T22:56:32.268",89]
["Test01","Robert Lentso","2019-11-19T11:55:11.152",42]
["Test01","Kristina Merila","2019-11-24T09:40:02.143",83]
["Test01","Armin Kaasik","2019-11-30T09:44:45",99]
["Test03","Joonas Haljas","2019-11-18T14:02:07.172",29]
["Test04","Paul Hein","2019-11-28T16:41:53.209",70]
["Test04","Sander Kell","2019-11-25T18:56:36.811",37]
["Test02","Brita Kaljula","2019-11-22T14:54:28.892",96]
["Test04","Jaagup Kivi","2019-11-25T23:18:05.490",67]
["Test04","Kaspar Raude","2019-11-09T18:22:12.599",37]
["Test02","Diana Taal","2019-11-12T20:15:15.461",100]
["Test03","Katrin Laurits","2019-11-09T16:32:02.526",78]
["Test04","Anna Koel","2019-11-09T17:35:38.479",78]
["Test01","Reimo Kala","2019-11-28T15:43:57.254",58]
["Test02","Kertu Heinsoo","2019-11-25T17:26:23.395",80]
["Test04","Paul Hein","2019-11-08T20:36:51.212",90]
["Test04","Rasmus Kroon","2019-11-15T14:32:45.497",63]
["Test01","Reimo Kala","2019-11-08T18:31:38.829",38]
["Test03","Diana Taal","2019-11-30T14:08:17.263",87]
["Test04","Hanna Laid","2019-11-26T23:08:30.675",95]
["Test02","Anette Lepp","2019-11-30T16:50:22.498",62]
["Test01","Reimo Kala","2019-11-06T20:34:08.795",86]
["Test02","Kristina Merila","2019-11-21T15:55:24.342",95]
["Test02","Egert Vint","2019-11-16T10:12:48.630",47]
["Test01","Erik Pärn","2019-11-25T15:48:19.115",100]
["Test03","Getlin Allas","2019-11-10T15:49:40.905",37]
["Test03","Martin Aavik","2019-11-11T22:14:22.081",95]
["Test03","Paul Hein","2019-11-18T13:10:38.919",99]
["Test04","Anna Koel","2019-11-08T12:38:55.525",99]
["Test01","Diana Taal","2019-11-09T19:31:35.210",64]
["Test04","Armin Kaasik","2019-11-24T09:04:39.566",73]
["Test03","Getlin Allas","2019-11-24T11:49:21.936",41]
["Test03","Martin Aavik","2019-11-06T08:25:57.146",64]
["Test04","Kertu Heinsoo","2019-11-04T15:46:42.082",95]
["Test02","Maarja Pihlak","2019-11-20T18:20:06.305",51]
["Test02","Kristina Merila","2019-11-29T18:33:23.011",30]
["Test04","Martin Aavik","2019-11-28T16:03:01.884",68]
["Test03","Joonas Haljas","2019-11-26T11:56:47.091",33]
["Test01","Viktoria Lumi","2019-11-17T14:47:03.911",68]
["Test01","Alari Suur","2019-11-09T23:23:13.186",52]
["Test01","Lauri Vahtra","2019-11-10T21:00:25.817",98]
["Test01","Kertu Heinsoo","2019-11-02T13:20:01.834",75]
["Test03","Jana Kiisk","2019-11-05T23:15:38.374",82]
["Test04","Emili Loorits","2019-11-11T16:36:33.291",64]
["Test04","Martin Aavik","2019-11-20T21:45:22.314",77]
["Test03","Artur Piiri","2019-11-12T13:06:51.865",96]
["Test03","Erik Pärn","2019-11-11T23:50:55.640",68]
["Test03","Hanna Laid","2019-11-11T17:47:11.203",98]
["Test04","Kertu Heinsoo","2019-11-15T13:55:07.550",99]
["Test04","Alari Suur","2019-11-13T16:12:14.347",68]
["Test02","Markus Niidas","2019-11-22T08:38:13.242",42]
["Test03","Sander Kell","2019-11-08T19:36:05.394",81]
[{"$f":"INDEX($G$4:$G$7,RANDBETWEEN(1,4))","v":"Test02"},{"$f":"INDEX($I$2:$I$36,RANDBETWEEN(1,35))","v":"Kertu Heinsoo"},{"$f":"RANDBETWEEN($F$2,$G$2)+$F$1+RAND()*($G$1-$F$1)","v":"2019-11-22T11:18:14.055"},{"$f":"RANDBETWEEN(20,100)","v":90}]
["Test03","Anna Koel","2019-11-04T15:08:20.442",45]
["Test01","Kertu Heinsoo","2019-11-24T18:51:40.565",70]
["Test01","Mihkel Kulp","2019-11-15T09:38:53.521",57]
["Test04","Viktoria Lumi","2019-11-22T18:44:45.527",100]
["Test04","Hanna Laid","2019-11-07T18:49:21.286",70]
["Test02","Artur Piiri","2019-11-08T13:04:34.888",64]
["Test01","Tarvo Järv","2019-11-25T15:52:31.001",29]
["Test01","Markus Niidas","2019-11-04T15:03:23.492",89]
["Test01","Kristina Merila","2019-11-25T13:48:52.765",51]
["Test02","Karin Saar","2019-11-12T22:25:16.810",31]
["Test01","Hans Kukk","2019-11-26T23:12:15.289",56]
["Test03","Joonas Haljas","2019-11-28T10:35:17.150",68]
["Test03","Brita Kaljula","2019-11-24T22:13:59.727",68]
["Test01","Emili Loorits","2019-11-05T17:44:20.137",79]
["Test04","Hanna Laid","2019-11-10T17:58:19.816",24]
["Test01","Carmen Sõrmus","2019-11-04T18:28:24.855",24]
["Test04","Kristina Merila","2019-11-11T22:40:32.216",34]
["Test04","Emili Loorits","2019-11-04T17:59:05.656",75]
["Test01","Rasmus Kroon","2019-11-10T13:58:46.520",91]
["Test03","Carmen Sõrmus","2019-11-05T10:36:40.129",86]
["Test03","Katrin Laurits","2019-11-17T16:57:46.808",22]
["Test02","Karin Saar","2019-11-20T12:11:36.107",90]
["Test01","Artur Piiri","2019-11-17T21:10:59.644",25]
["Test01","Viktoria Lumi","2019-11-17T12:13:56.853",97]
["Test03","Anna Koel","2019-11-16T15:10:01.573",39]
["Test02","Erik Pärn","2019-11-09T11:56:16.751",59]
["Test02","Karin Saar","2019-11-07T09:29:16.112",93]
["Test02","Markus Niidas","2019-11-22T19:01:10.815",82]
["Test03","Karin Saar","2019-11-10T19:08:28.740",45]
["Test04","Viktoria Lumi","2019-11-13T11:18:27.144",57]
["Test02","Lauri Vahtra","2019-11-22T08:17:22.895",71]
["Test01","Jana Kiisk","2019-11-27T21:24:40.508",82]
["Test01","Robert Lentso","2019-11-25T09:05:43.783",27]
["Test01","Sander Kell","2019-11-29T15:23:53.588",37]
["Test02","Joonas Haljas","2019-11-13T08:51:01.873",32]
["Test02","Mihkel Kulp","2019-11-01T11:10:04.606",32]
["Test04","Robert Lentso","2019-11-23T22:12:30.169",81]
["Test01","Emili Loorits","2019-11-19T18:25:36.416",76]
["Test04","Maarja Pihlak","2019-11-03T21:38:19.598",69]
["Test04","Erik Pärn","2019-11-05T16:51:40.141",84]
["Test01","Mihkel Kulp","2019-11-25T10:25:19.177",89]
["Test02","Katrin Laurits","2019-11-03T15:32:04.005",35]
["Test03","Viktoria Lumi","2019-11-09T12:51:02.838",64]
["Test03","Rasmus Kroon","2019-11-11T16:00:08.077",88]
["Test04","Viktoria Lumi","2019-11-14T17:33:31.499",89]
["Test01","Joonas Haljas","2019-11-29T11:13:58.791",47]
["Test03","Lauri Vahtra","2019-11-25T17:27:06.045",85]
["Test03","Markus Niidas","2019-11-01T19:10:47.368",56]
["Test01","Maarja Pihlak","2019-11-04T17:59:04.082",79]
["Test02","Katrin Laurits","2019-11-11T20:02:09.764",66]
["Test04","Viktoria Lumi","2019-11-18T22:45:24.514",93]
["Test04","Anette Lepp","2019-11-21T10:23:08.505",74]
["Test01","Joonas Haljas","2019-11-03T09:26:16.956",91]
["Test02","Emili Loorits","2019-11-04T21:16:48.635",49]
["Test01","Erik Pärn","2019-11-18T09:48:57.599",71]
["Test03","Artur Piiri","2019-11-26T10:51:32.372",99]
["Test04","Jaagup Kivi","2019-11-01T12:59:16.713",80]
["Test04","Rasmus Kroon","2019-11-04T14:57:51.787",61]
["Test01","Kristina Merila","2019-11-01T23:39:36.926",76]
["Test01","Lauri Vahtra","2019-11-30T20:40:08.277",58]
["Test03","Anna Koel","2019-11-19T22:37:41.639",38]
["Test03","Artur Piiri","2019-11-10T14:41:00.262",21]
["Test03","Robert Lentso","2019-11-26T10:44:50.407",22]
[{"$f":"INDEX($G$4:$G$7,RANDBETWEEN(1,4))","v":"Test02"},{"$f":"INDEX($I$2:$I$36,RANDBETWEEN(1,35))","v":"Martin Aavik"},{"$f":"RANDBETWEEN($F$2,$G$2)+$F$1+RAND()*($G$1-$F$1)","v":"2019-11-09T09:32:54.040"},{"$f":"RANDBETWEEN(20,100)","v":50}]
["Test02","Mihkel Kulp","2019-11-09T08:02:16.701",85]
["Test03","Viktoria Lumi","2019-11-24T10:01:27.464",34]
["Test01","Tarvo Järv","2019-11-10T15:22:50.101",91]
["Test04","Mihkel Kulp","2019-11-08T14:59:37.446",61]
["Test03","Karin Saar","2019-11-28T23:17:38.103",96]
["Test01","Diana Taal","2019-11-11T21:01:18.564",47]
["Test03","Mihkel Kulp","2019-11-28T14:54:34.328",37]
["Test01","Mihkel Kulp","2019-11-25T08:27:49.052",66]
["Test04","Carmen Sõrmus","2019-11-01T13:57:21.994",99]
["Test03","Kertu Heinsoo","2019-11-12T08:19:19.427",51]
["Test04","Getlin Allas","2019-11-06T23:11:53.073",35]
["Test04","Hans Kukk","2019-11-07T16:06:11.110",80]
["Test01","Tarvo Järv","2019-11-24T09:23:20.199",36]
["Test02","Lauri Vahtra","2019-11-04T13:52:57.082",99]
["Test01","Martin Aavik","2019-11-03T10:43:55.501",34]
["Test02","Mihkel Kulp","2019-11-21T20:43:02.093",54]
["Test01","Martin Aavik","2019-11-18T08:43:55.180",88]
["Test01","Kaspar Raude","2019-11-06T22:20:54.876",48]
["Test02","Katrin Laurits","2019-11-19T08:31:06.573",50]
["Test04","Markus Niidas","2019-11-24T14:30:41.997",52]
["Test02","Reimo Kala","2019-11-07T14:06:03.816",88]
["Test03","Jana Kiisk","2019-11-10T13:46:53.165",82]
["Test01","Hans Kukk","2019-11-04T23:03:44.915",41]
["Test03","Robert Lentso","2019-11-26T14:11:07.112",52]
["Test04","Paul Hein","2019-11-12T23:21:35.807",32]
["Test04","Artur Piiri","2019-11-17T09:09:15.556",91]
["Test01","Urmas Lõhmus","2019-11-25T15:37:29.023",88]
["Test03","Carmen Sõrmus","2019-11-19T18:31:05.318",55]
["Test03","Hanna Laid","2019-11-21T12:36:06.037",35]
["Test04","Lauri Vahtra","2019-11-14T20:58:39.440",38]
["Test04","Jana Kiisk","2019-11-17T09:22:59.028",93]
["Test01","Diana Taal","2019-11-19T10:57:06.575",83]
["Test02","Kaspar Raude","2019-11-24T23:41:36.676",92]
["Test04","Jaagup Kivi","2019-11-29T11:33:59.391",98]
["Test04","Tarvo Järv","2019-11-12T13:37:09.583",25]
["Test02","Getlin Allas","2019-11-23T10:35:15.818",67]
["Test01","Tarvo Järv","2019-11-30T16:58:06.487",77]
["Test04","Urmas Lõhmus","2019-11-18T19:17:18.453",100]
["Test04","Carmen Sõrmus","2019-11-18T17:00:52.023",80]
["Test01","Kristina Merila","2019-11-11T15:29:48.135",39]
["Test01","Tarvo Järv","2019-11-27T12:08:00.611",43]
["Test01","Katrin Laurits","2019-11-12T08:36:31.873",48]
["Test03","Erik Pärn","2019-11-27T18:54:59.058",27]
["Test03","Armin Kaasik","2019-11-19T13:25:44.650",77]
["Test04","Jaagup Kivi","2019-11-22T11:45:27.338",89]
["Test04","Kertu Heinsoo","2019-11-09T13:43:37.376",39]
["Test04","Kristina Merila","2019-11-28T08:44:46.038",30]
["Test01","Joonas Haljas","2019-11-04T23:02:23.986",63]
["Test02","Hanna Laid","2019-11-19T18:42:10.402",90]
["Test02","Emili Loorits","2019-11-18T09:36:44.318",97]
["Test03","Artur Piiri","2019-11-20T08:26:07.334",82]
["Test02","Rasmus Kroon","2019-11-02T23:13:58.015",94]
["Test04","Kristina Merila","2019-11-28T12:26:01.488",35]
["Test01","Katrin Laurits","2019-11-28T11:51:14.802",74]
["Test01","Brita Kaljula","2019-11-29T14:34:26.072",31]
["Test02","Erik Pärn","2019-11-22T17:52:11.933",30]
["Test02","Tarvo Järv","2019-11-13T12:22:54.104",51]
["Test04","Viktoria Lumi","2019-11-20T08:44:57.534",81]
["Test03","Mihkel Kulp","2019-11-30T13:54:41.483",70]
["Test04","Lauri Vahtra","2019-11-04T19:15:26.340",79]
["Test02","Jaagup Kivi","2019-11-05T20:52:37.356",90]
["Test02","Diana Taal","2019-11-01T20:14:46.702",49]
["Test02","Karin Saar","2019-11-25T19:58:06.970",55]
[{"$f":"INDEX($G$4:$G$7,RANDBETWEEN(1,4))","v":"Test04"},{"$f":"INDEX($I$2:$I$36,RANDBETWEEN(1,35))","v":"Lauri Vahtra"},{"$f":"RANDBETWEEN($F$2,$G$2)+$F$1+RAND()*($G$1-$F$1)","v":"2019-11-24T23:53:39.486"},{"$f":"RANDBETWEEN(20,100)","v":64}]
["Test01","Reimo Kala","2019-11-22T09:46:28.463",83]
["Test04","Rasmus Kroon","2019-11-24T13:58:48.614",96]
["Test03","Maarja Pihlak","2019-11-10T20:56:09.166",66]
["Test02","Carmen Sõrmus","2019-11-11T12:26:32.109",65]
["Test04","Getlin Allas","2019-11-03T10:12:38.774",75]
["Test04","Getlin Allas","2019-11-06T12:15:00.417",83]
["Test02","Hans Kukk","2019-11-12T18:47:15.053",72]
["Test04","Egert Vint","2019-11-19T08:44:32.246",25]
["Test02","Hanna Laid","2019-11-04T13:10:11.921",97]
["Test02","Robert Lentso","2019-11-30T15:30:25.732",96]
["Test02","Hanna Laid","2019-11-26T20:53:33.246",59]
["Test02","Karin Saar","2019-11-24T12:19:30.555",29]
["Test01","Mihkel Kulp","2019-11-13T09:00:02.692",77]
["Test03","Artur Piiri","2019-11-05T11:15:59.516",66]
["Test03","Erik Pärn","2019-11-17T23:07:08.746",32]
["Test03","Jana Kiisk","2019-11-17T08:39:20.741",51]
["Test01","Rasmus Kroon","2019-11-03T14:18:23.416",68]
["Test02","Kristina Merila","2019-11-29T15:43:26.278",40]
["Test04","Reimo Kala","2019-11-01T12:58:24.654",100]
["Test01","Anna Koel","2019-11-23T22:37:01.952",82]
["Test02","Paul Hein","2019-11-23T14:34:11.393",39]
["Test01","Jaagup Kivi","2019-11-23T18:36:32.948",50]
["Test02","Hans Kukk","2019-11-28T08:40:39.029",71]
["Test03","Emili Loorits","2019-11-21T12:48:24.005",81]
["Test01","Carmen Sõrmus","2019-11-05T20:02:00.541",53]
["Test03","Urmas Lõhmus","2019-11-15T14:12:02.168",94]
["Test03","Emili Loorits","2019-11-10T21:52:53.449",38]
["Test03","Getlin Allas","2019-11-25T13:01:28.794",63]
["Test04","Maarja Pihlak","2019-11-08T19:14:11.065",98]
["Test04","Erik Pärn","2019-11-29T22:17:23.699",69]
["Test03","Joonas Haljas","2019-11-21T20:36:00.751",93]
["Test01","Katrin Laurits","2019-11-29T11:06:15.686",79]
["Test04","Emili Loorits","2019-11-29T11:38:47.832",78]
["Test01","Kristina Merila","2019-11-05T08:58:09.032",100]
["Test03","Erik Pärn","2019-11-13T15:00:12.223",47]
["Test02","Kaspar Raude","2019-11-14T16:50:56.144",66]
["Test01","Kertu Heinsoo","2019-11-05T22:25:13.236",50]
["Test04","Jaagup Kivi","2019-11-17T21:38:56.995",98]
["Test04","Reimo Kala","2019-11-18T20:22:38.531",87]
["Test02","Reimo Kala","2019-11-30T10:39:14.358",91]
["Test03","Rasmus Kroon","2019-11-26T18:06:22.198",25]
["Test03","Reimo Kala","2019-11-12T09:00:44.155",35]
["Test01","Markus Niidas","2019-11-14T12:58:51.913",90]
["Test01","Robert Lentso","2019-11-21T11:05:23.388",58]
["Test03","Karin Saar","2019-11-17T23:00:56.752",53]
["Test01","Carmen Sõrmus","2019-11-15T14:49:08.148",62]
["Test02","Hans Kukk","2019-11-14T11:17:40.087",52]
["Test02","Kertu Heinsoo","2019-11-02T23:44:19.602",28]
["Test01","Armin Kaasik","2019-11-25T14:36:31.625",66]
["Test04","Karin Saar","2019-11-19T16:55:36.555",22]
["Test03","Mihkel Kulp","2019-11-20T17:57:30.168",88]
["Test04","Anna Koel","2019-11-12T14:55:02.304",94]
["Test02","Joonas Haljas","2019-11-18T16:23:47.404",50]
["Test03","Paul Hein","2019-11-18T13:43:02.061",22]
["Test02","Tarvo Järv","2019-11-18T09:08:06.276",44]
["Test02","Karin Saar","2019-11-28T22:20:00.382",24]
["Test03","Alari Suur","2019-11-29T17:27:30.145",68]
["Test01","Robert Lentso","2019-11-16T17:10:12.520",67]
["Test02","Brita Kaljula","2019-11-29T19:11:12.790",83]
["Test04","Anna Koel","2019-11-27T09:04:51.720",32]
["Test02","Egert Vint","2019-11-08T17:01:41.098",50]
["Test02","Jaagup Kivi","2019-11-22T12:22:47.681",53]
["Test02","Martin Aavik","2019-11-12T14:42:47.583",36]
[{"$f":"INDEX($G$4:$G$7,RANDBETWEEN(1,4))","v":"Test01"},{"$f":"INDEX($I$2:$I$36,RANDBETWEEN(1,35))","v":"Joonas Haljas"},{"$f":"RANDBETWEEN($F$2,$G$2)+$F$1+RAND()*($G$1-$F$1)","v":"2019-11-26T09:26:07.122"},{"$f":"RANDBETWEEN(20,100)","v":93}]
["Test02","Urmas Lõhmus","2019-11-24T23:41:08.894",78]
["Test01","Kertu Heinsoo","2019-11-11T21:44:54.399",35]
["Test03","Markus Niidas","2019-11-22T15:30:48.109",33]
["Test03","Anette Lepp","2019-11-13T20:08:11.190",74]
["Test02","Rasmus Kroon","2019-11-20T14:49:58.738",68]
["Test01","Anna Koel","2019-11-01T10:05:22.525",66]
["Test02","Emili Loorits","2019-11-04T16:26:35.109",42]
["Test03","Lauri Vahtra","2019-11-25T15:11:00.414",81]
["Test01","Tarvo Järv","2019-11-17T16:23:14.864",40]
["Test01","Hanna Laid","2019-11-30T10:01:18.413",29]
["Test04","Jaagup Kivi","2019-11-30T14:45:08.197",74]
["Test02","Alari Suur","2019-11-08T11:36:51.112",24]
["Test01","Anna Koel","2019-11-19T19:01:02.333",47]
["Test01","Martin Aavik","2019-11-06T20:25:50.175",37]
["Test02","Jana Kiisk","2019-11-25T21:29:06.587",74]
["Test04","Diana Taal","2019-11-25T08:11:29.419",65]
["Test04","Egert Vint","2019-11-02T23:14:27.615",66]
["Test01","Tarvo Järv","2019-11-03T21:15:31.871",40]
["Test01","Katrin Laurits","2019-11-22T17:13:30.172",89]
["Test04","Mihkel Kulp","2019-11-20T12:36:02.261",92]
["Test03","Artur Piiri","2019-11-17T17:38:44.257",54]
["Test03","Jaagup Kivi","2019-11-03T14:25:29.628",31]
["Test03","Kristina Merila","2019-11-05T19:36:56.062",42]
["Test01","Viktoria Lumi","2019-11-27T10:51:26.130",83]
["Test02","Alari Suur","2019-11-06T17:16:33.830",41]
["Test02","Katrin Laurits","2019-11-03T09:34:44.052",36]
["Test04","Anna Koel","2019-11-09T08:24:00.803",97]
["Test01","Egert Vint","2019-11-04T11:44:15.021",72]
["Test01","Maarja Pihlak","2019-11-15T09:57:24.528",53]
["Test04","Kristina Merila","2019-11-20T17:08:41.488",82]
["Test02","Hans Kukk","2019-11-16T12:19:56.698",92]
["Test01","Egert Vint","2019-11-08T18:32:54.722",38]
["Test02","Joonas Haljas","2019-11-07T23:51:43.350",61]
["Test02","Markus Niidas","2019-11-16T08:06:13.711",46]
["Test03","Maarja Pihlak","2019-11-29T22:28:52.823",85]
["Test01","Reimo Kala","2019-11-14T16:05:59.549",55]
["Test02","Viktoria Lumi","2019-11-05T10:47:36.353",65]
["Test04","Mihkel Kulp","2019-11-03T19:38:45.325",58]
["Test03","Kristina Merila","2019-11-26T08:07:02.230",43]
["Test03","Alari Suur","2019-11-04T10:26:09.982",69]
["Test04","Viktoria Lumi","2019-11-27T22:19:11.355",82]
["Test01","Maarja Pihlak","2019-11-28T16:01:36.633",76]
["Test03","Martin Aavik","2019-11-05T14:08:43.601",63]
["Test03","Markus Niidas","2019-11-28T10:49:38.568",64]
["Test03","Hans Kukk","2019-11-12T11:59:57.729",42]
["Test02","Joonas Haljas","2019-11-20T23:03:53.432",46]
["Test01","Karin Saar","2019-11-03T19:01:09.475",76]
["Test03","Diana Taal","2019-11-14T23:29:23.584",94]
["Test04","Anna Koel","2019-11-18T17:46:10.156",59]
["Test04","Jana Kiisk","2019-11-25T11:04:44.027",90]
["Test02","Lauri Vahtra","2019-11-28T10:12:41.015",84]
["Test01","Jana Kiisk","2019-11-02T22:37:00.072",100]
["Test04","Martin Aavik","2019-11-13T23:25:51.984",30]
["Test01","Urmas Lõhmus","2019-11-12T10:26:13.994",31]
["Test04","Artur Piiri","2019-11-28T11:11:38.097",89]
["Test02","Anna Koel","2019-11-04T09:37:04.083",70]
["Test02","Hanna Laid","2019-11-17T12:40:33.691",62]
["Test02","Jaagup Kivi","2019-11-29T09:35:58.831",81]
["Test03","Getlin Allas","2019-11-24T21:51:04.461",21]
["Test04","Armin Kaasik","2019-11-04T16:54:54.479",26]
["Test04","Brita Kaljula","2019-11-27T12:38:46.885",95]
["Test01","Kristina Merila","2019-11-18T22:30:41.402",45]
["Test04","Armin Kaasik","2019-11-13T20:15:21.473",78]
[{"$f":"INDEX($G$4:$G$7,RANDBETWEEN(1,4))","v":"Test03"},{"$f":"INDEX($I$2:$I$36,RANDBETWEEN(1,35))","v":"Martin Aavik"},{"$f":"RANDBETWEEN($F$2,$G$2)+$F$1+RAND()*($G$1-$F$1)","v":"2019-11-16T08:37:55.959"},{"$f":"RANDBETWEEN(20,100)","v":69}]
["Test03","Kertu Heinsoo","2019-11-28T15:21:39.366",63]
["Test03","Diana Taal","2019-11-28T11:22:05.783",70]
["Test03","Hanna Laid","2019-11-16T08:50:41.774",55]
["Test03","Hans Kukk","2019-11-30T13:44:46.438",87]
["Test03","Artur Piiri","2019-11-07T14:39:20.066",78]
["Test04","Alari Suur","2019-11-10T18:21:51.032",66]
["Test03","Markus Niidas","2019-11-09T12:17:32.163",62]
["Test01","Jana Kiisk","2019-11-20T12:49:57.125",80]
["Test03","Kristina Merila","2019-11-28T18:01:30.200",93]
["Test01","Anette Lepp","2019-11-29T19:08:45.841",44]
["Test03","Hanna Laid","2019-11-30T12:39:55.829",83]
["Test03","Urmas Lõhmus","2019-11-08T20:05:30.545",77]
["Test01","Katrin Laurits","2019-11-23T11:24:50.586",67]
["Test03","Egert Vint","2019-11-03T11:45:58.948",50]
["Test03","Armin Kaasik","2019-11-02T11:22:11.397",62]