{"text_format":"1","workbook":"xlsx","n_sheets":3,"sheets":["GDP","Chart1","klassid"],"not_rendered":{"charts":2,"images":2,"macros":1,"external_links":0,"defined_names":14,"comments":0,"pivot_tables":0},"unopened":[{"sheet":"Chart1","index":1,"reason":"not_a_worksheet"}],"bounds":{"document_bytes":16777216,"sheet_cells":100000,"rows_first":2000,"rows_last":500,"rows_between":2000,"halvings":0,"cell_chars":16384,"cell_head_chars":4096},"cells_cut":0,"cells_raw":0,"read":"whole","date_system":"1900"}

{"sheet":"GDP","index":0,"n_rows":61,"n_cols":24,"rows_kept":61,"cut":false,"hidden":false,"merged":[]}
["Gross domestic product at market prices"]
["At current prices",null,null,null,null,null,null,null,null,null,null,null,null,null,null,null,null,null,null,null,null,null,null,"Albania"]
["Current prices, euro per capita",null,null,null,null,null,null,null,null,null,null,null,null,null,null,null,"Riik1","Riik2",null,null,null,null,null,"Austria"]
[null,null,null,null,null,null,null,null,null,null,null,null,null,null,null,null,"Hungary","Germany",null,null,null,null,null,"Belgium"]
[null,null,null,null,null,null,null,null,null,null,null,null,null,null,null,"2007",{"$f":"VLOOKUP(Riik1,SKP,MATCH($P5,$A$13:$M$13,0),0)","v":10170},{"$f":"VLOOKUP(Riik2,SKP,MATCH($P5,$A$13:$M$13,0),0)","v":30860},null,null,null,null,null,"Bulgaria"]
[null,null,null,null,null,null,null,null,null,null,null,null,null,null,null,"2008",10780,31530,null,null,null,null,null,"Croatia"]
[null,null,null,null,null,null,null,null,null,null,null,null,null,null,null,"2009",9420,30390,null,null,null,null,null,"Czechia"]
[null,null,null,null,null,null,null,null,null,null,null,null,null,null,null,"2010",9900,31940,null,null,null,null,null,"Cyprus"]
[null,null,null,null,null,null,null,null,null,null,null,null,null,null,null,"2011",10180,33550,null,null,null,null,null,"Denmark"]
[null,null,null,null,null,null,null,null,null,null,null,null,null,null,null,"2012",10050,34130,null,null,null,null,null,"Estonia"]
[null,null,null,null,null,null,null,null,null,null,null,null,null,null,null,"2013",10310,34860,null,null,null,null,null,"Finland"]
[null,null,null,null,null,null,null,null,null,null,null,null,null,null,null,"2014",10730,36150,null,null,null,null,null,"France"]
["geo\\time","2007","2008","2009","2010","2011","2012","2013","2014","2015","2016","2017","2018",null,null,"2015",11400,37090,null,null,null,null,null,"Germany"]
["EU (28 countries)",26070,26130,24530,25500,26220,26680,26850,27720,29140,29300,30070,30960,null,null,"2016",11740,38060,null,null,null,null,null,"Greece"]
["Euro area (changing composition)",29060,29540,28140,28850,29480,29500,29710,30230,31030,31800,32850,33830,null,null,"2017",12830,39260,null,null,null,null,null,"Hungary"]
["Euro area (19 countries)",28330,28890,27760,28470,29190,29220,29450,30070,31030,31800,32850,33830,null,null,"2018",13690,40340,null,null,null,null,null,"Iceland"]
["Belgium",32340,32840,32090,33330,34200,34890,35320,36050,37080,38100,39330,40320,null,null,null,null,null,null,null,null,null,null,"Ireland"]
["Bulgaria",4240,4880,4930,5050,5610,5750,5770,5940,6360,6820,7390,7980,null,null,null,null,null,null,null,null,null,null,"Italy"]
["Czechia",13400,15470,14170,14900,15630,15360,15010,14880,15980,16690,18100,19550,null,null,{"$f":"_xlfn.FORMULATEXT(Q5)","v":"=VLOOKUP(Riik1;SKP;MATCH($P5;$A$13:$M$13;0);0)"},null,null,null,null,null,null,null,"Latvia"]
["Denmark",42740,43990,41880,43840,44500,45530,46100,47090,48050,49420,50700,52010,null,null,null,null,null,null,null,null,null,null,"Liechtenstein"]
["Germany",30860,31530,30390,31940,33550,34130,34860,36150,37090,38060,39260,40340,null,null,null,null,null,null,null,null,null,null,"Lithuania"]
["Estonia",12210,12430,10640,11150,12660,13620,14420,15340,15820,16490,18070,19740,null,null,null,null,null,null,null,null,null,null,"Luxembourg"]
["Ireland",44820,41760,37470,36790,37310,38090,38890,41870,55970,57210,61870,66670,null,null,null,null,null,null,null,null,null,null,"Malta"]
["Greece",21060,21840,21390,20320,18640,17310,16480,16400,16380,16380,16760,17220,null,null,null,null,null,null,null,null,null,null,"Montenegro"]
["Spain",23780,24130,23060,23040,22760,22050,21900,22220,23220,23980,24970,25730,null,null,null,null,null,null,null,null,null,null,"Netherlands"]
["France",30330,30960,29930,30690,31510,31820,32080,32420,33020,33430,34220,34980,null,null,null,null,null,null,null,null,null,null,"North Macedonia"]
["Croatia",10200,11130,10460,10480,10440,10280,10250,10220,10560,11120,11820,12560,null,null,null,null,null,null,null,null,null,null,"Norway"]
["Italy",27470,27640,26470,26930,27450,26920,26590,26770,27260,27970,28690,29220,null,null,null,null,null,null,null,null,null,null,"Poland"]
["Cyprus",22930,24170,23110,23400,23270,22500,20880,20420,21030,22160,23320,24290,null,null,null,null,null,null,null,null,null,null,"Portugal"]
["Latvia",10300,11200,8780,8500,9820,10870,11350,11860,12350,12800,13810,15130,null,null,null,null,null,null,null,null,null,null,"Romania"]
["Lithuania",8990,10220,8520,9030,10310,11160,11830,12460,12850,13560,14940,16160,null,null,null,null,null,null,null,null,null,null,"Serbia"]
["Luxembourg",77340,77940,74220,79160,83100,83000,85270,89240,91440,93930,95170,98640,null,null,null,null,null,null,null,null,null,null,"Slovakia"]
["Hungary",10170,10780,9420,9900,10180,10050,10310,10730,11400,11740,12830,13690,null,null,null,null,null,null,null,null,null,null,"Slovenia"]
["Malta",14160,14970,14880,15920,16410,17060,17940,19560,21690,22710,24130,25560,null,null,null,null,null,null,null,null,null,null,"Spain"]
["Netherlands",37800,39350,37800,38470,38960,38970,39300,39820,40730,41590,43090,44920,null,null,null,null,null,null,null,null,null,null,"Sweden"]
["Austria",34230,35300,34530,35390,36970,37820,38210,38990,39890,40880,42100,43640,null,null,null,null,null,null,null,null,null,null,"Switzerland"]
["Poland",8230,9610,8240,9390,9870,10100,10250,10680,11190,11100,12160,12920,null,null,null,null,null,null,null,null,null,null,"Turkey"]
["Portugal",16640,16960,16600,16990,16680,16010,16300,16640,17350,18060,19020,19830,null,null,null,null,null,null,null,null,null,null,"United Kingdom"]
["Romania",6110,7140,6150,6190,6550,6640,7190,7550,8090,8650,9580,10420]
["Slovenia",17370,18760,17760,17750,18050,17630,17700,18250,18830,19550,20810,22080]
["Slovakia",10440,12230,11830,12540,13190,13590,13740,14070,14710,14920,15540,16470]
["Finland",35370,36560,34040,35080,36750,37130,37570,37880,38590,39580,40990,42500]
["Sweden",38980,38320,33730,39920,43590,45050,45850,45130,46350,47000,47690,46310]
["United Kingdom",36930,32300,27900,29750,30220,33150,32730,35760,40560,37090,35780,36410]
["Iceland",50500,34280,29530,32490,34130,35730,37260,40900,47400,55590,63130,62340]
["Liechtenstein",":",":",":",":",":",":",128400,133200,148400,146700,148200,":"]
["Norway",62260,66490,57620,66220,72350,79000,77440,73180,66970,63690,66950,69230]
["Switzerland",46210,49250,50190,56150,63700,64990,64080,65320,73970,72460,71260,70120]
["Montenegro",4370,5030,4840,5050,5270,5130,5410,5560,5870,6350,6910,7490]
["North Macedonia",2980,3310,3300,3460,3660,3680,3950,4140,4380,4660,":",":"]
["Albania",2630,2990,2960,3090,3190,3300,3320,3450,3560,3730,4020,":"]
["Serbia",4280,4860,4440,4330,4900,4680,5080,4970,5030,5200,5580,6140]
["Turkey",7000,7300,6400,7900,8000,9000,9400,9100,9900,9800,9400,8000]
[]
["Source of Data:","Eurostat"]
["Last update:","22.11.2019"]
["Date of extraction:","25 Nov 2019 13:18:23 CET"]
["Hyperlink to the table:","https://ec.europa.eu/eurostat/tgm/table.do?tab=table&init=1&plugin=1&language=en&pcode=tec00001"]
["General Disclaimer of the EC website:","https://ec.europa.eu/info/legal-notice_en"]
["Short Description:","GDP (gross domestic product) is an indicator for a nation´s economic situation. It reflects the total value of all goods and services produced less the value of goods and services used for intermediate consumption in their production. Expressing GDP in PPS (purchasing power standards) eliminates differences in price levels between countries, and calculations on a per head basis allows for the comparison of economies significantly different in absolute size."]
["Code:","tec00001"]

{"sheet":"klassid","index":2,"n_rows":242,"n_cols":23,"rows_kept":242,"cut":false,"hidden":false,"merged":[]}
["Sugu","Eesnimi","Perenimi","Pikkus","Sünniaeg","Klass"]
[]
["1. klass",null,null,null,null,{"$f":"IF(RIGHT(A3,5)=\"klass\",A3,F2)","v":"1. klass"}]
["Sugu","Eesnimi","Perenimi","Pikkus","Sünniaeg","1. klass"]
["Naine","Helina-Ly","Albu",135,"2016-11-17","1. klass"]
["Mees","Jarko","Ammermann",137,"2017-02-05","1. klass",null,"Eesnimi","Eesnimi"]
["Mees","Steven","Ammermann",120,"2016-11-07","1. klass",null,"*","<>Eesnimi"]
["Naine","Ketlin","Basmanov",147,"2017-03-18","1. klass"]
["Mees","Sten","Dooner",127,"2016-11-18","1. klass"]
["Naine","Anna","Eha",145,"2017-06-23","1. klass"]
["Naine","Kätriin","Ismael",125,"2017-09-20","1. klass",null,null,null,null,{"$f":"_xlfn.FORMULATEXT(K15)","v":"=I15&\" \"&J15"}]
["Mees","Mattis","Kangur",125,"2017-09-16","1. klass"]
["Naine","Ly Andra","Kask",139,"2017-10-07","1. klass"]
["Naine","Grete","Laht",121,"2017-08-09","1. klass",null,"Sugu","Eesnimi","Perenimi","Nimi","Pikkus","Pikkus2","Sünnipäev","Sünniaeg","Klass",null,null,{"$f":"_xlfn.FORMULATEXT(S17)","v":"=MINIFS(Pikkus;Klass;R17)"}]
["Naine","Mirtel","Lavrov",122,"2017-02-02","1. klass",null,"Naine","Helina-Ly","Albu",{"$f":"I15&\" \"&J15","v":"Helina-Ly Albu"},135,{"$f":"L15+ROW(L15)/100000","v":135.00014999999999},{"$f":"sunnipaev(O15)","v":"2026-11-17"},"2016-11-17","1. klass",null,null,null,{"$f":"_xlfn.FORMULATEXT(T17)","v":"{=INDEX(Nimi;MATCH(1;(Pikkus=S17)*(Klass=R17);0))}"}]
["Mees","Alan","Nael",136,"2017-07-22","1. klass",null,"Mees","Jarko","Ammermann",{"$f":"I16&\" \"&J16","v":"Jarko Ammermann"},137,{"$f":"L16+ROW(L16)/100000","v":137.00015999999999},{"$f":"sunnipaev(O16)","v":"2026-02-05"},"2017-02-05","1. klass",null,"Klass","Lühim pikkus","Lühim õpilane",null,"Lähim sünnipäev","Sünnipäevalaps"]
["Mees","Ramses","Nael",129,"2016-11-07","1. klass",null,"Mees","Steven","Ammermann","Steven Ammermann",120,120.00017,{"$f":"sunnipaev(O17)","v":"2026-11-07"},"2016-11-07","1. klass",null,"1. klass",{"$f":"_xlfn.MINIFS(Pikkus,Klass,R17)","v":120},{"$f":"INDEX(Nimi,MATCH(1,(Pikkus=S17)*(Klass=R17),0))","v":"Steven Ammermann"},null,{"$f":"_xlfn.MINIFS(Sünnipäev,Klass,R17)","v":"2026-01-21"},{"$f":"INDEX(Nimi,MATCH(1,(Sünnipäev=V17)*(Klass=R17),0))","v":"Tuuli Seli"}]
["Naine","Iiris Ehalill","Oman",122,"2016-11-11","1. klass",null,"Naine","Ketlin","Basmanov","Ketlin Basmanov",147,147.00018,{"$f":"sunnipaev(O18)","v":"2026-03-18"},"2017-03-18","1. klass",null,"2. klass",132,{"$f":"INDEX(Nimi,MATCH(1,(Pikkus=S18)*(Klass=R18),0))","v":"Stenar Saadla"},null,{"$f":"_xlfn.MINIFS(Sünnipäev,Klass,R18)","v":"2025-11-26"},{"$f":"INDEX(Nimi,MATCH(1,(Sünnipäev=V18)*(Klass=R18),0))","v":"Ian-Hugo Paulus"}]
["Mees","Asko","Orusalu",140,"2016-11-09","1. klass",null,"Mees","Sten","Dooner","Sten Dooner",127,127.00019,{"$f":"sunnipaev(O19)","v":"2026-11-18"},"2016-11-18","1. klass",null,"3. klass",133,{"$f":"INDEX(Nimi,MATCH(1,(Pikkus=S19)*(Klass=R19),0))","v":"Karl-Markus Luttvark"},null,{"$f":"_xlfn.MINIFS(Sünnipäev,Klass,R19)","v":"2025-12-10"},{"$f":"INDEX(Nimi,MATCH(1,(Sünnipäev=V19)*(Klass=R19),0))","v":"Lisette Valdmets"}]
["Naine","Nora-Miia","Rikkand",128,"2017-06-07","1. klass",null,"Naine","Anna","Eha","Anna Eha",145,145.00020000000001,{"$f":"sunnipaev(O20)","v":"2026-06-23"},"2017-06-23","1. klass",null,"4. klass",142,{"$f":"INDEX(Nimi,MATCH(1,(Pikkus=S20)*(Klass=R20),0))","v":"Angelina Vanatalu"},null,{"$f":"_xlfn.MINIFS(Sünnipäev,Klass,R20)","v":"2025-12-06"},{"$f":"INDEX(Nimi,MATCH(1,(Sünnipäev=V20)*(Klass=R20),0))","v":"Siim Skroman"}]
["Naine","Ketrin","Salu",140,"2017-06-18","1. klass",null,"Naine","Kätriin","Ismael","Kätriin Ismael",125,125.00021,{"$f":"sunnipaev(O21)","v":"2026-09-20"},"2017-09-20","1. klass",null,"5. klass",141,{"$f":"INDEX(Nimi,MATCH(1,(Pikkus=S21)*(Klass=R21),0))","v":"Robert Mattias Jõesaar"},null,{"$f":"_xlfn.MINIFS(Sünnipäev,Klass,R21)","v":"2025-12-06"},{"$f":"INDEX(Nimi,MATCH(1,(Sünnipäev=V21)*(Klass=R21),0))","v":"Kätlin Teras"}]
["Naine","Tuuli","Seli",140,"2017-01-21","1. klass",null,"Mees","Mattis","Kangur","Mattis Kangur",125,125.00022,{"$f":"sunnipaev(O22)","v":"2026-09-16"},"2017-09-16","1. klass",null,"6. klass",141,{"$f":"INDEX(Nimi,MATCH(1,(Pikkus=S22)*(Klass=R22),0))","v":"Mia Uudeväli"},null,{"$f":"_xlfn.MINIFS(Sünnipäev,Klass,R22)","v":"2025-12-22"},{"$f":"INDEX(Nimi,MATCH(1,(Sünnipäev=V22)*(Klass=R22),0))","v":"Hanna Kallas"}]
["Naine","Marie","Uudeväli",139,"2017-08-22","1. klass",null,"Naine","Ly Andra","Kask","Ly Andra Kask",139,139.00022999999999,{"$f":"sunnipaev(O23)","v":"2026-10-07"},"2017-10-07","1. klass",null,"7. klass",144,{"$f":"INDEX(Nimi,MATCH(1,(Pikkus=S23)*(Klass=R23),0))","v":"Kirke Mägi"},null,{"$f":"_xlfn.MINIFS(Sünnipäev,Klass,R23)","v":"2025-12-20"},{"$f":"INDEX(Nimi,MATCH(1,(Sünnipäev=V23)*(Klass=R23),0))","v":"Karl Erik Basmanov"}]
["Mees","Romet","Vanatalu",139,"2017-06-24","1. klass",null,"Naine","Grete","Laht","Grete Laht",121,121.00024000000001,{"$f":"sunnipaev(O24)","v":"2026-08-09"},"2017-08-09","1. klass",null,"8. klass",155,{"$f":"INDEX(Nimi,MATCH(1,(Pikkus=S24)*(Klass=R24),0))","v":"Carola Orusalu"},null,{"$f":"_xlfn.MINIFS(Sünnipäev,Klass,R24)","v":"2025-12-10"},{"$f":"INDEX(Nimi,MATCH(1,(Sünnipäev=V24)*(Klass=R24),0))","v":"Carola Orusalu"}]
[null,null,null,null,null,"1. klass",null,"Naine","Mirtel","Lavrov","Mirtel Lavrov",122,122.00024999999999,{"$f":"sunnipaev(O25)","v":"2026-02-02"},"2017-02-02","1. klass",null,"9. klass",157,{"$f":"INDEX(Nimi,MATCH(1,(Pikkus=S25)*(Klass=R25),0))","v":"Kristjan Pauklin"},null,{"$f":"_xlfn.MINIFS(Sünnipäev,Klass,R25)","v":"2025-11-26"},{"$f":"INDEX(Nimi,MATCH(1,(Sünnipäev=V25)*(Klass=R25),0))","v":"Tõnis Podpaskov"}]
["2. klass",null,null,null,null,"2. klass",null,"Mees","Alan","Nael","Alan Nael",136,136.00026,{"$f":"sunnipaev(O26)","v":"2026-07-22"},"2017-07-22","1. klass",null,"10. klass",157,{"$f":"INDEX(Nimi,MATCH(1,(Pikkus=S26)*(Klass=R26),0))","v":"Berit Sõstar"},null,{"$f":"_xlfn.MINIFS(Sünnipäev,Klass,R26)","v":"2025-12-24"},{"$f":"INDEX(Nimi,MATCH(1,(Sünnipäev=V26)*(Klass=R26),0))","v":"Jonathan Abel"}]
["Sugu","Eesnimi","Perenimi","Pikkus","Sünniaeg","2. klass",null,"Mees","Ramses","Nael","Ramses Nael",129,129.00027,{"$f":"sunnipaev(O27)","v":"2026-11-07"},"2016-11-07","1. klass",null,"11. klass",164,{"$f":"INDEX(Nimi,MATCH(1,(Pikkus=S27)*(Klass=R27),0))","v":"Johanna Uudeväli"},null,{"$f":"_xlfn.MINIFS(Sünnipäev,Klass,R27)","v":"2025-12-11"},{"$f":"INDEX(Nimi,MATCH(1,(Sünnipäev=V27)*(Klass=R27),0))","v":"Mattias Saareleht"}]
["Naine","Liisa Marie","Evert",134,"2016-09-23","2. klass",null,"Naine","Iiris Ehalill","Oman","Iiris Ehalill Oman",122,122.00028,{"$f":"sunnipaev(O28)","v":"2026-11-11"},"2016-11-11","1. klass",null,"12. klass",160,{"$f":"INDEX(Nimi,MATCH(1,(Pikkus=S28)*(Klass=R28),0))","v":"Elisabeth Valkenklau"},null,{"$f":"_xlfn.MINIFS(Sünnipäev,Klass,R28)","v":"2025-12-13"},{"$f":"INDEX(Nimi,MATCH(1,(Sünnipäev=V28)*(Klass=R28),0))","v":"Eliise Vahtrik"}]
["Mees","Marten","Gontsar",142,"2016-09-08","2. klass",null,"Mees","Asko","Orusalu","Asko Orusalu",140,140.00029000000001,{"$f":"sunnipaev(O29)","v":"2026-11-09"},"2016-11-09","1. klass"]
["Mees","Mihkel","Juudas",147,"2016-07-18","2. klass",null,"Naine","Nora-Miia","Rikkand","Nora-Miia Rikkand",128,128.00030000000001,{"$f":"sunnipaev(O30)","v":"2026-06-07"},"2017-06-07","1. klass",null,null,null,null,null,{"$f":"_xlfn.FORMULATEXT(V28)","v":"=MINIFS(Sünnipäev;Klass;R28)"}]
["Mees","Sven-Erik","Juur",148,"2016-04-09","2. klass",null,"Naine","Ketrin","Salu","Ketrin Salu",140,140.00031000000001,{"$f":"sunnipaev(O31)","v":"2026-06-18"},"2017-06-18","1. klass",null,null,null,null,null,null,{"$f":"_xlfn.FORMULATEXT(W28)","v":"=INDEX(Nimi;MATCH(1;(Sünnipäev=V28)*(Klass=R28);0))"}]
["Naine","Anette","Jõerand",146,"2016-01-20","2. klass",null,"Naine","Tuuli","Seli","Tuuli Seli",140,140.00031999999999,{"$f":"sunnipaev(O32)","v":"2026-01-21"},"2017-01-21","1. klass"]
["Naine","Gerli Ann","Kalm",135,"2016-02-17","2. klass",null,"Naine","Marie","Uudeväli","Marie Uudeväli",139,139.00032999999999,{"$f":"sunnipaev(O33)","v":"2026-08-22"},"2017-08-22","1. klass"]
["Mees","Arseni","Laal",152,"2016-09-24","2. klass",null,"Mees","Romet","Vanatalu","Romet Vanatalu",139,139.00033999999999,{"$f":"sunnipaev(O34)","v":"2026-06-24"},"2017-06-24","1. klass"]
["Mees","Egert","Lipson",135,"2016-08-10","2. klass",null,"Naine","Liisa Marie","Evert","Liisa Marie Evert",134,134.00035,{"$f":"sunnipaev(O35)","v":"2026-09-23"},"2016-09-23","2. klass"]
["Naine","Helena","Luigand",143,"2016-02-01","2. klass",null,"Mees","Marten","Gontsar","Marten Gontsar",142,142.00036,{"$f":"sunnipaev(O36)","v":"2026-09-08"},"2016-09-08","2. klass"]
["Naine","Hanna-Grete","Metsis",145,"2016-03-24","2. klass",null,"Mees","Mihkel","Juudas","Mihkel Juudas",147,147.00037,{"$f":"sunnipaev(O37)","v":"2026-07-18"},"2016-07-18","2. klass"]
["Mees","Priit","Märk",134,"2016-02-07","2. klass",null,"Mees","Sven-Erik","Juur","Sven-Erik Juur",148,148.00038000000001,{"$f":"sunnipaev(O38)","v":"2026-04-09"},"2016-04-09","2. klass"]
["Mees","Ian-Hugo","Paulus",136,"2016-11-26","2. klass",null,"Naine","Anette","Jõerand","Anette Jõerand",146,146.00039000000001,{"$f":"sunnipaev(O39)","v":"2026-01-20"},"2016-01-20","2. klass"]
["Mees","Timmu","Paulus",133,"2016-09-28","2. klass",null,"Naine","Gerli Ann","Kalm","Gerli Ann Kalm",135,135.00040000000001,{"$f":"sunnipaev(O40)","v":"2026-02-17"},"2016-02-17","2. klass"]
["Naine","Sigrid","Rääbis",144,"2016-02-02","2. klass",null,"Mees","Arseni","Laal","Arseni Laal",152,152.00040999999999,{"$f":"sunnipaev(O41)","v":"2026-09-24"},"2016-09-24","2. klass"]
["Mees","Stenar","Saadla",132,"2016-01-12","2. klass",null,"Mees","Egert","Lipson","Egert Lipson",135,135.00041999999999,{"$f":"sunnipaev(O42)","v":"2026-08-10"},"2016-08-10","2. klass"]
["Naine","Carolina","Salu",142,"2016-04-23","2. klass",null,"Naine","Helena","Luigand","Helena Luigand",143,143.00042999999999,{"$f":"sunnipaev(O43)","v":"2026-02-01"},"2016-02-01","2. klass"]
["Mees","Christoph","Umal",136,"2016-04-16","2. klass",null,"Naine","Hanna-Grete","Metsis","Hanna-Grete Metsis",145,145.00044,{"$f":"sunnipaev(O44)","v":"2026-03-24"},"2016-03-24","2. klass"]
["Mees","Edward","Vaher",133,"2015-10-10","2. klass",null,"Mees","Priit","Märk","Priit Märk",134,134.00045,{"$f":"sunnipaev(O45)","v":"2026-02-07"},"2016-02-07","2. klass"]
[null,null,null,null,null,"2. klass",null,"Mees","Ian-Hugo","Paulus","Ian-Hugo Paulus",136,136.00046,{"$f":"sunnipaev(O46)","v":"2025-11-26"},"2016-11-26","2. klass"]
["3. klass",null,null,null,null,"3. klass",null,"Mees","Timmu","Paulus","Timmu Paulus",133,133.00047000000001,{"$f":"sunnipaev(O47)","v":"2026-09-28"},"2016-09-28","2. klass"]
["Sugu","Eesnimi","Perenimi","Pikkus","Sünniaeg","3. klass",null,"Naine","Sigrid","Rääbis","Sigrid Rääbis",144,144.00048000000001,{"$f":"sunnipaev(O48)","v":"2026-02-02"},"2016-02-02","2. klass"]
["Mees","Rohan","Allik",138,"2015-10-11","3. klass",null,"Mees","Stenar","Saadla","Stenar Saadla",132,132.00049000000001,{"$f":"sunnipaev(O49)","v":"2026-01-12"},"2016-01-12","2. klass"]
["Mees","Henri","Allikas",160,"2015-09-11","3. klass",null,"Naine","Carolina","Salu","Carolina Salu",142,142.00049999999999,{"$f":"sunnipaev(O50)","v":"2026-04-23"},"2016-04-23","2. klass"]
["Naine","Lisete-Anett","Jensen",134,"2015-05-17","3. klass",null,"Mees","Christoph","Umal","Christoph Umal",136,136.00050999999999,{"$f":"sunnipaev(O51)","v":"2026-04-16"},"2016-04-16","2. klass"]
["Mees","Allan","Kikkas",152,"2014-11-19","3. klass",null,"Mees","Edward","Vaher","Edward Vaher",133,133.00051999999999,{"$f":"sunnipaev(O52)","v":"2026-10-10"},"2015-10-10","2. klass"]
["Mees","Karl Joosep","Lutter",143,"2015-04-06","3. klass",null,"Mees","Rohan","Allik","Rohan Allik",138,138.00053,{"$f":"sunnipaev(O53)","v":"2026-10-11"},"2015-10-11","3. klass"]
["Mees","Karl-Markus","Luttvark",133,"2014-11-02","3. klass",null,"Mees","Henri","Allikas","Henri Allikas",160,160.00054,{"$f":"sunnipaev(O54)","v":"2026-09-11"},"2015-09-11","3. klass"]
["Mees","Glenn","Mägi",143,"2014-12-26","3. klass",null,"Naine","Lisete-Anett","Jensen","Lisete-Anett Jensen",134,134.00055,{"$f":"sunnipaev(O55)","v":"2026-05-17"},"2015-05-17","3. klass"]
["Mees","Christofer","Nõgisto",163,"2014-11-07","3. klass",null,"Mees","Allan","Kikkas","Allan Kikkas",152,152.00056000000001,{"$f":"sunnipaev(O56)","v":"2026-11-19"},"2014-11-19","3. klass"]
["Naine","Mathias","Paldrok",158,"2015-04-27","3. klass",null,"Mees","Karl Joosep","Lutter","Karl Joosep Lutter",143,143.00057000000001,{"$f":"sunnipaev(O57)","v":"2026-04-06"},"2015-04-06","3. klass"]
["Naine","Fiia","Rebane",142,"2015-09-24","3. klass",null,"Mees","Karl-Markus","Luttvark","Karl-Markus Luttvark",133,133.00058000000001,{"$f":"sunnipaev(O58)","v":"2026-11-02"},"2014-11-02","3. klass"]
["Naine","Kaisa","Roos",143,"2015-02-06","3. klass",null,"Mees","Glenn","Mägi","Glenn Mägi",143,143.00058999999999,{"$f":"sunnipaev(O59)","v":"2025-12-26"},"2014-12-26","3. klass"]
["Naine","Vanessa","Salujõe",135,"2015-01-14","3. klass",null,"Mees","Christofer","Nõgisto","Christofer Nõgisto",163,163.00059999999999,{"$f":"sunnipaev(O60)","v":"2026-11-07"},"2014-11-07","3. klass"]
["Naine","Heliis","Sõstar",142,"2015-04-15","3. klass",null,"Naine","Mathias","Paldrok","Mathias Paldrok",158,158.00060999999999,{"$f":"sunnipaev(O61)","v":"2026-04-27"},"2015-04-27","3. klass"]
["Naine","Sander","Usin",149,"2015-09-04","3. klass",null,"Naine","Fiia","Rebane","Fiia Rebane",142,142.00062,{"$f":"sunnipaev(O62)","v":"2026-09-24"},"2015-09-24","3. klass"]
["Naine","Lisette","Valdmets",160,"2014-12-10","3. klass",null,"Naine","Kaisa","Roos","Kaisa Roos",143,143.00063,{"$f":"sunnipaev(O63)","v":"2026-02-06"},"2015-02-06","3. klass"]
["Mees","Oliver","Veelmann",145,"2015-09-25","3. klass",null,"Naine","Vanessa","Salujõe","Vanessa Salujõe",135,135.00064,{"$f":"sunnipaev(O64)","v":"2026-01-14"},"2015-01-14","3. klass"]
[null,null,null,null,null,"3. klass",null,"Naine","Heliis","Sõstar","Heliis Sõstar",142,142.00065000000001,{"$f":"sunnipaev(O65)","v":"2026-04-15"},"2015-04-15","3. klass"]
["4. klass",null,null,null,null,"4. klass",null,"Naine","Sander","Usin","Sander Usin",149,149.00066000000001,{"$f":"sunnipaev(O66)","v":"2026-09-04"},"2015-09-04","3. klass"]
["Sugu","Eesnimi","Perenimi","Pikkus","Sünniaeg",{"$f":"IF(RIGHT(A67,5)=\"klass\",A67,F66)","v":"4. klass"},null,"Naine","Lisette","Valdmets","Lisette Valdmets",160,160.00067000000001,{"$f":"sunnipaev(O67)","v":"2025-12-10"},"2014-12-10","3. klass"]
["Mees","Martin","Dooner",161,"2014-05-08","4. klass",null,"Mees","Oliver","Veelmann","Oliver Veelmann",145,145.00067999999999,{"$f":"sunnipaev(O68)","v":"2026-09-25"},"2015-09-25","3. klass"]
["Mees","Karl-Gunnar","Kägo",146,"2014-01-01","4. klass",null,"Mees","Martin","Dooner","Martin Dooner",161,161.00068999999999,{"$f":"sunnipaev(O69)","v":"2026-05-08"},"2014-05-08","4. klass"]
["Mees","Marcus","Luigand",148,"2013-10-25","4. klass",null,"Mees","Karl-Gunnar","Kägo","Karl-Gunnar Kägo",146,146.00069999999999,{"$f":"sunnipaev(O70)","v":"2026-01-01"},"2014-01-01","4. klass"]
["Mees","Mart","Morozov",149,"2014-09-07","4. klass",null,"Mees","Marcus","Luigand","Marcus Luigand",148,148.00071,{"$f":"sunnipaev(O71)","v":"2026-10-25"},"2013-10-25","4. klass"]
["Mees","Kaur","Preegel",144,"2014-05-30","4. klass",null,"Mees","Mart","Morozov","Mart Morozov",149,149.00072,{"$f":"sunnipaev(O72)","v":"2026-09-07"},"2014-09-07","4. klass"]
["Mees","Armo","Rannu",159,"2014-07-15","4. klass",null,"Mees","Kaur","Preegel","Kaur Preegel",144,144.00073,{"$f":"sunnipaev(O73)","v":"2026-05-30"},"2014-05-30","4. klass"]
["Naine","Franka","Rannu",155,"2014-07-21","4. klass",null,"Mees","Armo","Rannu","Armo Rannu",159,159.00074000000001,{"$f":"sunnipaev(O74)","v":"2026-07-15"},"2014-07-15","4. klass"]
["Mees","Robert","Reilent",155,"2013-11-07","4. klass",null,"Naine","Franka","Rannu","Franka Rannu",155,155.00075000000001,{"$f":"sunnipaev(O75)","v":"2026-07-21"},"2014-07-21","4. klass"]
["Mees","Taavi","Rääbis",166,"2014-07-19","4. klass",null,"Mees","Robert","Reilent","Robert Reilent",155,155.00076000000001,{"$f":"sunnipaev(O76)","v":"2026-11-07"},"2013-11-07","4. klass"]
["Naine","Stella Anete","Saareleht",153,"2014-03-27","4. klass",null,"Mees","Taavi","Rääbis","Taavi Rääbis",166,166.00076999999999,{"$f":"sunnipaev(O77)","v":"2026-07-19"},"2014-07-19","4. klass"]
["Mees","Siim","Skroman",161,"2014-12-06","4. klass",null,"Naine","Stella Anete","Saareleht","Stella Anete Saareleht",153,153.00077999999999,{"$f":"sunnipaev(O78)","v":"2026-03-27"},"2014-03-27","4. klass"]
["Mees","Tanel","Sõstar",158,"2014-05-02","4. klass",null,"Mees","Siim","Skroman","Siim Skroman",161,161.00078999999999,{"$f":"sunnipaev(O79)","v":"2025-12-06"},"2014-12-06","4. klass"]
["Naine","Angelina","Vanatalu",142,"2013-09-26","4. klass",null,"Mees","Tanel","Sõstar",{"$f":"I80&\" \"&J80","v":"Tanel Sõstar"},158,{"$f":"L80+ROW(L80)/100000","v":158.0008},{"$f":"sunnipaev(O80)","v":"2026-05-02"},"2014-05-02","4. klass"]
["Naine","Amanda Maria","Viilop",156,"2014-04-21","4. klass",null,"Naine","Angelina","Vanatalu","Angelina Vanatalu",142,142.00081,{"$f":"sunnipaev(O81)","v":"2026-09-26"},"2013-09-26","4. klass"]
[null,null,null,null,null,"4. klass",null,"Naine","Amanda Maria","Viilop","Amanda Maria Viilop",156,156.00082,{"$f":"sunnipaev(O82)","v":"2026-04-21"},"2014-04-21","4. klass"]
["5. klass",null,null,null,null,"5. klass",null,"Naine","Laura","Basmanov","Laura Basmanov",159,159.00083000000001,{"$f":"sunnipaev(O83)","v":"2026-09-30"},"2013-09-30","5. klass"]
["Sugu","Eesnimi","Perenimi","Pikkus","Sünniaeg","5. klass",null,"Mees","Lisanna","Grünberg","Lisanna Grünberg",144,144.00084000000001,{"$f":"sunnipaev(O84)","v":"2026-08-11"},"2013-08-11","5. klass"]
["Naine","Laura","Basmanov",159,"2013-09-30","5. klass",null,"Mees","Karl","Jensen","Karl Jensen",161,161.00085000000001,{"$f":"sunnipaev(O85)","v":"2026-06-22"},"2013-06-22","5. klass"]
["Mees","Lisanna","Grünberg",144,"2013-08-11","5. klass",null,"Mees","Robert Mattias","Jõesaar","Robert Mattias Jõesaar",141,141.00085999999999,{"$f":"sunnipaev(O86)","v":"2026-05-08"},"2013-05-08","5. klass"]
["Mees","Karl","Jensen",161,"2013-06-22","5. klass",null,"Mees","Kristofer","Jürisoo","Kristofer Jürisoo",144,144.00086999999999,{"$f":"sunnipaev(O87)","v":"2025-12-10"},"2012-12-10","5. klass"]
["Mees","Robert Mattias","Jõesaar",141,"2013-05-08","5. klass",null,"Naine","Kaisu","Kallas","Kaisu Kallas",157,157.00088,{"$f":"sunnipaev(O88)","v":"2026-04-15"},"2013-04-15","5. klass"]
["Mees","Kristofer","Jürisoo",144,"2012-12-10","5. klass",null,"Naine","Lisanne","Liitmaa","Lisanne Liitmaa",170,170.00089,{"$f":"sunnipaev(O89)","v":"2026-06-29"},"2013-06-29","5. klass"]
["Naine","Kaisu","Kallas",157,"2013-04-15","5. klass",null,"Naine","Greete","Luhtoja","Greete Luhtoja",152,152.0009,{"$f":"sunnipaev(O90)","v":"2026-03-23"},"2013-03-23","5. klass"]
["Naine","Lisanne","Liitmaa",170,"2013-06-29","5. klass",null,"Mees","Silver","Pintsuk","Silver Pintsuk",168,168.00091,{"$f":"sunnipaev(O91)","v":"2026-08-07"},"2013-08-07","5. klass"]
["Naine","Greete","Luhtoja",152,"2013-03-23","5. klass",null,"Naine","Kätlin","Teras","Kätlin Teras",161,161.00092000000001,{"$f":"sunnipaev(O92)","v":"2025-12-06"},"2013-12-06","5. klass"]
["Mees","Silver","Pintsuk",168,"2013-08-07","5. klass",null,"Naine","Jasmine","Vahtrik","Jasmine Vahtrik",157,157.00093000000001,{"$f":"sunnipaev(O93)","v":"2026-09-01"},"2013-09-01","5. klass"]
["Naine","Kätlin","Teras",161,"2013-12-06","5. klass",null,"Mees","Rene","Vakk","Rene Vakk",165,165.00094000000001,{"$f":"sunnipaev(O94)","v":"2026-06-25"},"2013-06-25","5. klass"]
["Naine","Jasmine","Vahtrik",157,"2013-09-01","5. klass",null,"Mees","Kenori","Aksalu","Kenori Aksalu",167,167.00094999999999,{"$f":"sunnipaev(O95)","v":"2026-02-02"},"2012-02-02","6. klass"]
["Mees","Rene","Vakk",165,"2013-06-25","5. klass",null,"Mees","Henry","Juur","Henry Juur",175,175.00095999999999,{"$f":"sunnipaev(O96)","v":"2026-06-26"},"2012-06-26","6. klass"]
[null,null,null,null,null,"5. klass",null,"Mees","Ato","Jõesalu","Ato Jõesalu",168,168.00097,{"$f":"sunnipaev(O97)","v":"2026-03-09"},"2012-03-09","6. klass"]
["6. klass",null,null,null,null,"6. klass",null,"Naine","Hanna","Kallas","Hanna Kallas",154,154.00098,{"$f":"sunnipaev(O98)","v":"2025-12-22"},"2011-12-22","6. klass"]
["Sugu","Eesnimi","Perenimi","Pikkus","Sünniaeg","6. klass",null,"Mees","Gen","Kalm","Gen Kalm",159,159.00099,{"$f":"sunnipaev(O99)","v":"2026-09-02"},"2012-09-02","6. klass"]
["Mees","Kenori","Aksalu",167,"2012-02-02","6. klass",null,"Naine","Kärt","Kalm","Kärt Kalm",143,143.001,{"$f":"sunnipaev(O100)","v":"2026-09-24"},"2012-09-24","6. klass"]
["Mees","Henry","Juur",175,"2012-06-26","6. klass",null,"Naine","Reelika","Kerov","Reelika Kerov",150,150.00101000000001,{"$f":"sunnipaev(O101)","v":"2026-03-01"},"2012-03-01","6. klass"]
["Mees","Ato","Jõesalu",168,"2012-03-09","6. klass",null,"Naine","Janelle","Kesküla","Janelle Kesküla",156,156.00102000000001,{"$f":"sunnipaev(O102)","v":"2026-09-03"},"2012-09-03","6. klass"]
["Naine","Hanna","Kallas",154,"2011-12-22","6. klass",null,"Mees","Uku","Kesküla","Uku Kesküla",142,142.00102999999999,{"$f":"sunnipaev(O103)","v":"2026-06-24"},"2012-06-24","6. klass"]
["Mees","Gen","Kalm",159,"2012-09-02","6. klass",null,"Mees","Dewid","Lavrov","Dewid Lavrov",168,168.00103999999999,{"$f":"sunnipaev(O104)","v":"2026-07-27"},"2012-07-27","6. klass"]
["Naine","Kärt","Kalm",143,"2012-09-24","6. klass",null,"Naine","Krete","Liitmaa","Krete Liitmaa",143,143.00104999999999,{"$f":"sunnipaev(O105)","v":"2026-07-27"},"2012-07-27","6. klass"]
["Naine","Reelika","Kerov",150,"2012-03-01","6. klass",null,"Naine","Lagle","Luttvark","Lagle Luttvark",145,145.00106,{"$f":"sunnipaev(O106)","v":"2026-05-26"},"2012-05-26","6. klass"]
["Naine","Janelle","Kesküla",156,"2012-09-03","6. klass",null,"Mees","Lars","Mägi","Lars Mägi",170,170.00107,{"$f":"sunnipaev(O107)","v":"2025-12-23"},"2011-12-23","6. klass"]
["Mees","Uku","Kesküla",142,"2012-06-24","6. klass",null,"Mees","Gunnar","Nano","Gunnar Nano",147,147.00108,{"$f":"sunnipaev(O108)","v":"2026-05-16"},"2012-05-16","6. klass"]
["Mees","Dewid","Lavrov",168,"2012-07-27","6. klass",null,"Naine","Annabel","Sild","Annabel Sild",172,172.00109,{"$f":"sunnipaev(O109)","v":"2026-06-09"},"2012-06-09","6. klass"]
["Naine","Krete","Liitmaa",143,"2012-07-27","6. klass",null,"Naine","Doria","Skroman","Doria Skroman",160,160.00110000000001,{"$f":"sunnipaev(O110)","v":"2026-02-03"},"2013-02-03","6. klass"]
["Naine","Lagle","Luttvark",145,"2012-05-26","6. klass",null,"Naine","Mia-Marje","Teiter","Mia-Marje Teiter",167,167.00111000000001,{"$f":"sunnipaev(O111)","v":"2026-09-09"},"2012-09-09","6. klass"]
["Mees","Lars","Mägi",170,"2011-12-23","6. klass",null,"Mees","Robin","Troller","Robin Troller",155,155.00111999999999,{"$f":"sunnipaev(O112)","v":"2026-04-18"},"2012-04-18","6. klass"]
["Mees","Gunnar","Nano",147,"2012-05-16","6. klass",null,"Naine","Kerttu","Umal","Kerttu Umal",161,161.00112999999999,{"$f":"sunnipaev(O113)","v":"2026-01-14"},"2012-01-14","6. klass"]
["Naine","Annabel","Sild",172,"2012-06-09","6. klass",null,"Naine","Mia","Uudeväli","Mia Uudeväli",141,141.00113999999999,{"$f":"sunnipaev(O114)","v":"2026-11-24"},"2011-11-24","6. klass"]
["Naine","Doria","Skroman",160,"2013-02-03","6. klass",null,"Naine","Marie Helen","Valdmets","Marie Helen Valdmets",146,146.00115,{"$f":"sunnipaev(O115)","v":"2026-11-15"},"2012-11-15","6. klass"]
["Naine","Mia-Marje","Teiter",167,"2012-09-09","6. klass",null,"Mees","Richard","Viilop","Richard Viilop",170,170.00116,{"$f":"sunnipaev(O116)","v":"2026-05-16"},"2012-05-16","6. klass"]
["Mees","Robin","Troller",155,"2012-04-18","6. klass",null,"Mees","Karl Erik","Basmanov","Karl Erik Basmanov",172,172.00117,{"$f":"sunnipaev(O117)","v":"2025-12-20"},"2010-12-20","7. klass"]
["Naine","Kerttu","Umal",161,"2012-01-14","6. klass",null,"Mees","Ademar","Beres","Ademar Beres",148,148.00118000000001,{"$f":"sunnipaev(O118)","v":"2026-02-25"},"2011-02-25","7. klass"]
["Naine","Mia","Uudeväli",141,"2011-11-24","6. klass",null,"Naine","Elis","Beres","Elis Beres",169,169.00119000000001,{"$f":"sunnipaev(O119)","v":"2026-08-05"},"2011-08-05","7. klass"]
["Naine","Marie Helen","Valdmets",146,"2012-11-15","6. klass",null,"Naine","Keili","Gontsar","Keili Gontsar",167,167.00120000000001,{"$f":"sunnipaev(O120)","v":"2026-11-09"},"2010-11-09","7. klass"]
["Mees","Richard","Viilop",170,"2012-05-16","6. klass",null,"Naine","Lisett","Härm","Lisett Härm",167,167.00120999999999,{"$f":"sunnipaev(O121)","v":"2026-10-04"},"2010-10-04","7. klass"]
[null,null,null,null,null,"6. klass",null,"Mees","Tagnar","Jaam","Tagnar Jaam",147,147.00121999999999,{"$f":"sunnipaev(O122)","v":"2026-04-12"},"2011-04-12","7. klass"]
["7. klass",null,null,null,null,"7. klass",null,"Mees","Kaspar","Jensen","Kaspar Jensen",168,168.00122999999999,{"$f":"sunnipaev(O123)","v":"2026-02-25"},"2011-02-25","7. klass"]
["Sugu","Eesnimi","Perenimi","Pikkus","Sünniaeg","7. klass",null,"Naine","Eleanora","Kalm","Eleanora Kalm",165,165.00124,{"$f":"sunnipaev(O124)","v":"2026-09-18"},"2011-09-18","7. klass"]
["Mees","Karl Erik","Basmanov",172,"2010-12-20","7. klass",null,"Mees","Kenri","Kalm","Kenri Kalm",156,156.00125,{"$f":"sunnipaev(O125)","v":"2026-06-10"},"2011-06-10","7. klass"]
["Mees","Ademar","Beres",148,"2011-02-25","7. klass",null,"Naine","Jaanika","Kägo","Jaanika Kägo",158,158.00126,{"$f":"sunnipaev(O126)","v":"2026-02-15"},"2011-02-15","7. klass"]
["Naine","Elis","Beres",169,"2011-08-05","7. klass",null,"Mees","Ragnar","Leo","Ragnar Leo",156,156.00127000000001,{"$f":"sunnipaev(O127)","v":"2026-01-01"},"2011-01-01","7. klass"]
["Naine","Keili","Gontsar",167,"2010-11-09","7. klass",null,"Naine","Mailis","Manglus","Mailis Manglus",170,170.00128000000001,{"$f":"sunnipaev(O128)","v":"2025-12-25"},"2010-12-25","7. klass"]
["Naine","Lisett","Härm",167,"2010-10-04","7. klass",null,"Mees","Marec","Mumm","Marec Mumm",162,162.00129000000001,{"$f":"sunnipaev(O129)","v":"2026-10-23"},"2010-10-23","7. klass"]
["Mees","Tagnar","Jaam",147,"2011-04-12","7. klass",null,"Mees","Raiko","Must","Raiko Must",146,146.00129999999999,{"$f":"sunnipaev(O130)","v":"2026-04-10"},"2011-04-10","7. klass"]
["Mees","Kaspar","Jensen",168,"2011-02-25",{"$f":"IF(RIGHT(A131,5)=\"klass\",A131,F130)","v":"7. klass"},null,"Naine","Kirke","Mägi","Kirke Mägi",144,144.00130999999999,{"$f":"sunnipaev(O131)","v":"2026-03-24"},"2011-03-24","7. klass"]
["Naine","Eleanora","Kalm",165,"2011-09-18","7. klass",null,"Naine","Nele","Silm","Nele Silm",172,172.00131999999999,{"$f":"sunnipaev(O132)","v":"2026-09-03"},"2011-09-03","7. klass"]
["Mees","Kenri","Kalm",156,"2011-06-10","7. klass",null,"Mees","Andre","Teras","Andre Teras",175,175.00133,{"$f":"sunnipaev(O133)","v":"2025-12-28"},"2010-12-28","7. klass"]
["Naine","Jaanika","Kägo",158,"2011-02-15","7. klass",null,"Mees","Hakim","Toodo","Hakim Toodo",147,147.00134,{"$f":"sunnipaev(O134)","v":"2026-11-06"},"2010-11-06","7. klass"]
["Mees","Ragnar","Leo",156,"2011-01-01","7. klass",null,"Naine","Martha","Troller","Martha Troller",174,174.00135,{"$f":"sunnipaev(O135)","v":"2025-12-30"},"2010-12-30","7. klass"]
["Naine","Mailis","Manglus",170,"2010-12-25","7. klass",null,"Mees","Rasmus","Vagula","Rasmus Vagula",170,170.00136000000001,{"$f":"sunnipaev(O136)","v":"2026-08-16"},"2011-08-16","7. klass"]
["Mees","Marec","Mumm",162,"2010-10-23","7. klass",null,"Mees","Anton","Vakk","Anton Vakk",165,165.00137000000001,{"$f":"sunnipaev(O137)","v":"2026-06-09"},"2011-06-09","7. klass"]
["Mees","Raiko","Must",146,"2011-04-10","7. klass",null,"Mees","Joakim","Allikas","Joakim Allikas",178,178.00138000000001,{"$f":"sunnipaev(O138)","v":"2026-10-05"},"2009-10-05","8. klass"]
["Naine","Kirke","Mägi",144,"2011-03-24","7. klass",null,"Naine","Ronja","Ilves","Ronja Ilves",165,165.00138999999999,{"$f":"sunnipaev(O139)","v":"2026-04-12"},"2010-04-12","8. klass"]
["Naine","Nele","Silm",172,"2011-09-03","7. klass",null,"Mees","Alex","Jensen","Alex Jensen",173,173.00139999999999,{"$f":"sunnipaev(O140)","v":"2026-09-21"},"2009-09-21","8. klass"]
["Mees","Andre","Teras",175,"2010-12-28","7. klass",null,"Naine","Charlotte","Juudas","Charlotte Juudas",156,156.00140999999999,{"$f":"sunnipaev(O141)","v":"2026-02-05"},"2010-02-05","8. klass"]
["Mees","Hakim","Toodo",147,"2010-11-06","7. klass",null,"Mees","Gregor","Konnov","Gregor Konnov",171,171.00142,{"$f":"sunnipaev(O142)","v":"2026-05-20"},"2010-05-20","8. klass"]
["Naine","Martha","Troller",174,"2010-12-30","7. klass",null,"Naine","Sandra","Konnov","Sandra Konnov",175,175.00143,{"$f":"sunnipaev(O143)","v":"2026-10-06"},"2010-10-06","8. klass"]
["Mees","Rasmus","Vagula",170,"2011-08-16","7. klass",null,"Mees","Armin","Laast",{"$f":"I144&\" \"&J144","v":"Armin Laast"},164,{"$f":"L144+ROW(L144)/100000","v":164.00144},{"$f":"sunnipaev(O144)","v":"2026-02-14"},"2010-02-14","8. klass"]
["Mees","Anton","Vakk",165,"2011-06-09","7. klass",null,"Naine","Desiree","Laht","Desiree Laht",164,164.00145000000001,{"$f":"sunnipaev(O145)","v":"2026-06-24"},"2009-06-24","8. klass"]
[null,null,null,null,null,"7. klass",null,"Naine","Katriin","Laht","Katriin Laht",157,157.00146000000001,{"$f":"sunnipaev(O146)","v":"2026-02-23"},"2010-02-23","8. klass"]
["8. klass",null,null,null,null,"8. klass",null,"Mees","Georg","Mäepalu","Georg Mäepalu",164,164.00147000000001,{"$f":"sunnipaev(O147)","v":"2026-05-24"},"2010-05-24","8. klass"]
["Sugu","Eesnimi","Perenimi","Pikkus","Sünniaeg","8. klass",null,"Mees","Mark","Olander","Mark Olander",168,168.00147999999999,{"$f":"sunnipaev(O148)","v":"2026-10-20"},"2009-10-20","8. klass"]
["Mees","Joakim","Allikas",178,"2009-10-05","8. klass",null,"Naine","Carola","Orusalu","Carola Orusalu",155,155.00148999999999,{"$f":"sunnipaev(O149)","v":"2025-12-10"},"2009-12-10","8. klass"]
["Naine","Ronja","Ilves",165,"2010-04-12","8. klass",null,"Naine","Elenora","Paldrok","Elenora Paldrok",173,173.00149999999999,{"$f":"sunnipaev(O150)","v":"2026-05-25"},"2010-05-25","8. klass"]
["Mees","Alex","Jensen",173,"2009-09-21","8. klass",null,"Naine","Kristi","Pintsuk","Kristi Pintsuk",156,156.00151,{"$f":"sunnipaev(O151)","v":"2026-01-16"},"2010-01-16","8. klass"]
["Naine","Charlotte","Juudas",156,"2010-02-05","8. klass",null,"Mees","Gerri","Rääbis","Gerri Rääbis",177,177.00152,{"$f":"sunnipaev(O152)","v":"2026-03-05"},"2010-03-05","8. klass"]
["Mees","Gregor","Konnov",171,"2010-05-20","8. klass",null,"Mees","Ralf","Saadla","Ralf Saadla",163,163.00153,{"$f":"sunnipaev(O153)","v":"2026-06-25"},"2010-06-25","8. klass"]
["Naine","Sandra","Konnov",175,"2010-10-06","8. klass",null,"Mees","Gventin","Valkenklau","Gventin Valkenklau",158,158.00154000000001,{"$f":"sunnipaev(O154)","v":"2026-09-12"},"2010-09-12","8. klass"]
["Mees","Armin","Laast",164,"2010-02-14","8. klass",null,"Naine","Erin","Kallas","Erin Kallas",164,164.00155000000001,{"$f":"sunnipaev(O155)","v":"2025-12-19"},"2008-12-19","9. klass"]
["Naine","Desiree","Laht",164,"2009-06-24","8. klass",null,"Naine","Airis","Lepik","Airis Lepik",162,162.00156000000001,{"$f":"sunnipaev(O156)","v":"2026-03-02"},"2009-03-02","9. klass"]
["Naine","Katriin","Laht",157,"2010-02-23","8. klass",null,"Mees","Raimond","Manglus","Raimond Manglus",180,180.00156999999999,{"$f":"sunnipaev(O157)","v":"2025-12-05"},"2008-12-05","9. klass"]
["Mees","Georg","Mäepalu",164,"2010-05-24","8. klass",null,"Naine","Robin","Mihkelsoo","Robin Mihkelsoo",160,160.00157999999999,{"$f":"sunnipaev(O158)","v":"2026-05-29"},"2009-05-29","9. klass"]
["Mees","Mark","Olander",168,"2009-10-20","8. klass",null,"Mees","Kermo","Olander","Kermo Olander",173,173.00158999999999,{"$f":"sunnipaev(O159)","v":"2025-12-02"},"2008-12-02","9. klass"]
["Naine","Carola","Orusalu",155,"2009-12-10","8. klass",null,"Mees","Kristjan","Pauklin","Kristjan Pauklin",157,157.0016,{"$f":"sunnipaev(O160)","v":"2026-04-03"},"2009-04-03","9. klass"]
["Naine","Elenora","Paldrok",173,"2010-05-25","8. klass",null,"Mees","Sevastian","Podpaskov","Sevastian Podpaskov",178,178.00161,{"$f":"sunnipaev(O161)","v":"2026-01-29"},"2009-01-29","9. klass"]
["Naine","Kristi","Pintsuk",156,"2010-01-16","8. klass",null,"Mees","Tõnis","Podpaskov","Tõnis Podpaskov",175,175.00162,{"$f":"sunnipaev(O162)","v":"2025-11-26"},"2008-11-26","9. klass"]
["Mees","Gerri","Rääbis",177,"2010-03-05","8. klass",null,"Naine","Katarina","Polis","Katarina Polis",174,174.00163000000001,{"$f":"sunnipaev(O163)","v":"2026-06-15"},"2009-06-15","9. klass"]
["Mees","Ralf","Saadla",163,"2010-06-25","8. klass",null,"Naine","Isabel","Puurmann","Isabel Puurmann",168,168.00164000000001,{"$f":"sunnipaev(O164)","v":"2026-02-03"},"2009-02-03","9. klass"]
["Mees","Gventin","Valkenklau",158,"2010-09-12","8. klass",null,"Naine","Ly-Anna","Riisenberg","Ly-Anna Riisenberg",170,170.00165000000001,{"$f":"sunnipaev(O165)","v":"2026-03-31"},"2009-03-31","9. klass"]
[null,null,null,null,null,"8. klass",null,"Naine","Eliisa","Toode","Eliisa Toode",162,162.00165999999999,{"$f":"sunnipaev(O166)","v":"2026-01-23"},"2009-01-23","9. klass"]
["9. klass",null,null,null,null,"9. klass",null,"Mees","Ott","Usin","Ott Usin",172,172.00166999999999,{"$f":"sunnipaev(O167)","v":"2026-03-04"},"2009-03-04","9. klass"]
["Sugu","Eesnimi","Perenimi","Pikkus","Sünniaeg","9. klass",null,"Naine","Laura-Liisa","Veekmann","Laura-Liisa Veekmann",171,171.00167999999999,{"$f":"sunnipaev(O168)","v":"2026-08-23"},"2009-08-23","9. klass"]
["Naine","Erin","Kallas",164,"2008-12-19","9. klass",null,"Mees","Jonathan","Abel","Jonathan Abel",175,175.00169,{"$f":"sunnipaev(O169)","v":"2025-12-24"},"2007-12-24","10. klass"]
["Naine","Airis","Lepik",162,"2009-03-02","9. klass",null,"Naine","Karmen","Eha","Karmen Eha",161,161.0017,{"$f":"sunnipaev(O170)","v":"2026-05-19"},"2008-05-19","10. klass"]
["Mees","Raimond","Manglus",180,"2008-12-05","9. klass",null,"Naine","Anna Triin","Fedortšenko","Anna Triin Fedortšenko",162,162.00171,{"$f":"sunnipaev(O171)","v":"2026-04-18"},"2008-04-18","10. klass"]
["Naine","Robin","Mihkelsoo",160,"2009-05-29","9. klass",null,"Naine","Lavli","Hämäläinen","Lavli Hämäläinen",178,178.00172000000001,{"$f":"sunnipaev(O172)","v":"2026-04-23"},"2008-04-23","10. klass"]
["Mees","Kermo","Olander",173,"2008-12-02","9. klass",null,"Mees","Patrik","Jõerand","Patrik Jõerand",165,165.00173000000001,{"$f":"sunnipaev(O173)","v":"2026-09-23"},"2008-09-23","10. klass"]
["Mees","Kristjan","Pauklin",157,"2009-04-03","9. klass",null,"Mees","Samel","Kask","Samel Kask",170,170.00174000000001,{"$f":"sunnipaev(O174)","v":"2026-11-13"},"2007-11-13","10. klass"]
["Mees","Sevastian","Podpaskov",178,"2009-01-29","9. klass",null,"Naine","Merili","Krüger","Merili Krüger",158,158.00174999999999,{"$f":"sunnipaev(O175)","v":"2026-11-15"},"2007-11-15","10. klass"]
["Mees","Tõnis","Podpaskov",175,"2008-11-26","9. klass",null,"Naine","Brianna","Mesipuu","Brianna Mesipuu",168,168.00175999999999,{"$f":"sunnipaev(O176)","v":"2026-06-05"},"2008-06-05","10. klass"]
["Naine","Katarina","Polis",174,"2009-06-15","9. klass",null,"Naine","Johhanna","Nael","Johhanna Nael",168,168.00176999999999,{"$f":"sunnipaev(O177)","v":"2026-06-14"},"2008-06-14","10. klass"]
["Naine","Isabel","Puurmann",168,"2009-02-03","9. klass",null,"Naine","Liona","Olander","Liona Olander",165,165.00178,{"$f":"sunnipaev(O178)","v":"2026-05-21"},"2008-05-21","10. klass"]
["Naine","Ly-Anna","Riisenberg",170,"2009-03-31","9. klass",null,"Mees","Christon","Rannu","Christon Rannu",166,166.00179,{"$f":"sunnipaev(O179)","v":"2026-05-02"},"2008-05-02","10. klass"]
["Naine","Eliisa","Toode",162,"2009-01-23","9. klass",null,"Naine","Ketlyn","Sallo","Ketlyn Sallo",158,158.0018,{"$f":"sunnipaev(O180)","v":"2026-05-22"},"2008-05-22","10. klass"]
["Mees","Ott","Usin",172,"2009-03-04","9. klass",null,"Mees","Mathias","Silm","Mathias Silm",176,176.00181000000001,{"$f":"sunnipaev(O181)","v":"2026-03-29"},"2008-03-29","10. klass"]
["Naine","Laura-Liisa","Veekmann",171,"2009-08-23","9. klass",null,"Naine","Kristiin","Suurvarik","Kristiin Suurvarik",166,166.00182000000001,{"$f":"sunnipaev(O182)","v":"2026-10-12"},"2008-10-12","10. klass"]
[null,null,null,null,null,"9. klass",null,"Naine","Marju","Suurvarik","Marju Suurvarik",173,173.00183000000001,{"$f":"sunnipaev(O183)","v":"2026-03-12"},"2008-03-12","10. klass"]
["10. klass",null,null,null,null,"10. klass",null,"Naine","Berit","Sõstar","Berit Sõstar",157,157.00183999999999,{"$f":"sunnipaev(O184)","v":"2026-01-23"},"2008-01-23","10. klass"]
["Sugu","Eesnimi","Perenimi","Pikkus","Sünniaeg","10. klass",null,"Naine","Anett","Toode","Anett Toode",163,163.00184999999999,{"$f":"sunnipaev(O185)","v":"2026-02-13"},"2008-02-13","10. klass"]
["Mees","Jonathan","Abel",175,"2007-12-24","10. klass",null,"Mees","Mikk","Tõnissaar","Mikk Tõnissaar",175,175.00185999999999,{"$f":"sunnipaev(O186)","v":"2026-05-04"},"2008-05-04","10. klass"]
["Naine","Karmen","Eha",161,"2008-05-19","10. klass",null,"Mees","Kennet","Valdmets","Kennet Valdmets",179,179.00187,{"$f":"sunnipaev(O187)","v":"2026-07-24"},"2008-07-24","10. klass"]
["Naine","Anna Triin","Fedortšenko",162,"2008-04-18","10. klass",null,"Naine","Siiri","Aus","Siiri Aus",172,172.00188,{"$f":"sunnipaev(O188)","v":"2026-06-17"},"2007-06-17","11. klass"]
["Naine","Lavli","Hämäläinen",178,"2008-04-23","10. klass",null,"Naine","Natali","Fedortšenko","Natali Fedortšenko",179,179.00189,{"$f":"sunnipaev(O189)","v":"2026-03-15"},"2007-03-15","11. klass"]
["Mees","Patrik","Jõerand",165,"2008-09-23","10. klass",null,"Naine","Romili","Hämäläinen","Romili Hämäläinen",167,167.00190000000001,{"$f":"sunnipaev(O190)","v":"2026-05-07"},"2007-05-07","11. klass"]
["Mees","Samel","Kask",170,"2007-11-13","10. klass",null,"Mees","Kristo","Küttis","Kristo Küttis",168,168.00191000000001,{"$f":"sunnipaev(O191)","v":"2025-12-12"},"2006-12-12","11. klass"]
["Naine","Merili","Krüger",158,"2007-11-15","10. klass",null,"Naine","Margaret","Lahe","Margaret Lahe",166,166.00192000000001,{"$f":"sunnipaev(O192)","v":"2026-03-15"},"2007-03-15","11. klass"]
["Naine","Brianna","Mesipuu",168,"2008-06-05","10. klass",null,"Mees","Marten-Mark","Liibek","Marten-Mark Liibek",174,174.00192999999999,{"$f":"sunnipaev(O193)","v":"2026-07-27"},"2007-07-27","11. klass"]
["Naine","Johhanna","Nael",168,"2008-06-14","10. klass",null,"Mees","Sass","Lutter","Sass Lutter",185,185.00193999999999,{"$f":"sunnipaev(O194)","v":"2026-06-16"},"2007-06-16","11. klass"]
["Naine","Liona","Olander",165,"2008-05-21",{"$f":"IF(RIGHT(A195,5)=\"klass\",A195,F194)","v":"10. klass"},null,"Naine","Grettel","Mumm","Grettel Mumm",174,174.00194999999999,{"$f":"sunnipaev(O195)","v":"2026-11-10"},"2006-11-10","11. klass"]
["Mees","Christon","Rannu",166,"2008-05-02","10. klass",null,"Naine","Victoria","Nano","Victoria Nano",168,168.00196,{"$f":"sunnipaev(O196)","v":"2026-10-28"},"2006-10-28","11. klass"]
["Naine","Ketlyn","Sallo",158,"2008-05-22","10. klass",null,"Mees","Fred","Oraver","Fred Oraver",189,189.00197,{"$f":"sunnipaev(O197)","v":"2026-05-29"},"2007-05-29","11. klass"]
["Mees","Mathias","Silm",176,"2008-03-29","10. klass",null,"Mees","Vidrik","Reinsalu","Vidrik Reinsalu",186,186.00198,{"$f":"sunnipaev(O198)","v":"2026-05-22"},"2007-05-22","11. klass"]
["Naine","Kristiin","Suurvarik",166,"2008-10-12","10. klass",null,"Mees","Markus","Riisenberg","Markus Riisenberg",183,183.00199000000001,{"$f":"sunnipaev(O199)","v":"2026-09-02"},"2007-09-02","11. klass"]
["Naine","Marju","Suurvarik",173,"2008-03-12","10. klass",null,"Naine","Freia","Saadi","Freia Saadi",168,168.00200000000001,{"$f":"sunnipaev(O200)","v":"2026-08-27"},"2007-08-27","11. klass"]
["Naine","Berit","Sõstar",157,"2008-01-23","10. klass",null,"Mees","Mattias","Saareleht","Mattias Saareleht",173,173.00201000000001,{"$f":"sunnipaev(O201)","v":"2025-12-11"},"2006-12-11","11. klass"]
["Naine","Anett","Toode",163,"2008-02-13","10. klass",null,"Mees","Nils","Saareleht","Nils Saareleht",165,165.00201999999999,{"$f":"sunnipaev(O202)","v":"2026-04-09"},"2007-04-09","11. klass"]
["Mees","Mikk","Tõnissaar",175,"2008-05-04","10. klass",null,"Naine","Amanda","Sild","Amanda Sild",170,170.00202999999999,{"$f":"sunnipaev(O203)","v":"2026-06-06"},"2007-06-06","11. klass"]
["Mees","Kennet","Valdmets",179,"2008-07-24","10. klass",null,"Naine","Johanna","Uudeväli","Johanna Uudeväli",164,164.00203999999999,{"$f":"sunnipaev(O204)","v":"2026-03-19"},"2007-03-19","11. klass"]
[null,null,null,null,null,"10. klass",null,"Mees","Reito","Uudeväli","Reito Uudeväli",178,178.00205,{"$f":"sunnipaev(O205)","v":"2026-05-22"},"2007-05-22","11. klass"]
["11. klass",null,null,null,null,"11. klass",null,"Naine","Raina","Ammermann","Raina Ammermann",174,174.00206,{"$f":"sunnipaev(O206)","v":"2026-03-24"},"2006-03-24","12. klass"]
["Sugu","Eesnimi","Perenimi","Pikkus","Sünniaeg","11. klass",null,"Naine","Kertu","Jaam","Kertu Jaam",172,172.00207,{"$f":"sunnipaev(O207)","v":"2026-08-31"},"2006-08-31","12. klass"]
["Naine","Siiri","Aus",172,"2007-06-17","11. klass",null,"Mees","Venno","Juur",{"$f":"I208&\" \"&J208","v":"Venno Juur"},186,{"$f":"L208+ROW(L208)/100000","v":186.00208000000001},{"$f":"sunnipaev(O208)","v":"2026-08-02"},"2006-08-02","12. klass"]
["Naine","Natali","Fedortšenko",179,"2007-03-15","11. klass",null,"Mees","Mooses","Olander","Mooses Olander",189,189.00209000000001,{"$f":"sunnipaev(O209)","v":"2026-03-01"},"2006-03-01","12. klass"]
["Naine","Romili","Hämäläinen",167,"2007-05-07","11. klass",null,"Mees","Kennert","Pintsuk","Kennert Pintsuk",166,166.00210000000001,{"$f":"sunnipaev(O210)","v":"2026-04-01"},"2006-04-01","12. klass"]
["Mees","Kristo","Küttis",168,"2006-12-12","11. klass",null,"Mees","Gudving","Reilent","Gudving Reilent",171,171.00210999999999,{"$f":"sunnipaev(O211)","v":"2026-02-21"},"2006-02-21","12. klass"]
["Naine","Margaret","Lahe",166,"2007-03-15","11. klass",null,"Mees","Kevin","Reimal","Kevin Reimal",167,167.00211999999999,{"$f":"sunnipaev(O212)","v":"2026-09-29"},"2006-09-29","12. klass"]
["Mees","Marten-Mark","Liibek",174,"2007-07-27","11. klass",null,"Mees","Oskar","Teiter","Oskar Teiter",173,173.00212999999999,{"$f":"sunnipaev(O213)","v":"2026-09-24"},"2006-09-24","12. klass"]
["Mees","Sass","Lutter",185,"2007-06-16","11. klass",null,"Naine","Kristina","Toode","Kristina Toode",164,164.00214,{"$f":"sunnipaev(O214)","v":"2026-11-18"},"2005-11-18","12. klass"]
["Naine","Grettel","Mumm",174,"2006-11-10","11. klass",null,"Naine","Eliise","Vahtrik","Eliise Vahtrik",166,166.00215,{"$f":"sunnipaev(O215)","v":"2025-12-13"},"2005-12-13","12. klass"]
["Naine","Victoria","Nano",168,"2006-10-28","11. klass",null,"Mees","Janno","Vakk","Janno Vakk",185,185.00216,{"$f":"sunnipaev(O216)","v":"2026-09-02"},"2006-09-02","12. klass"]
["Mees","Fred","Oraver",189,"2007-05-29","11. klass",null,"Naine","Elisabeth","Valkenklau","Elisabeth Valkenklau",160,160.00217000000001,{"$f":"sunnipaev(O217)","v":"2026-04-25"},"2006-04-25","12. klass"]
["Mees","Vidrik","Reinsalu",186,"2007-05-22","11. klass",null,"Naine","Emily","Valkenklau","Emily Valkenklau",168,168.00218000000001,{"$f":"sunnipaev(O218)","v":"2026-04-25"},"2006-04-25","12. klass"]
["Mees","Markus","Riisenberg",183,"2007-09-02","11. klass",null,"Naine","Karoliina","Valkenklau","Karoliina Valkenklau",173,173.00219000000001,{"$f":"sunnipaev(O219)","v":"2026-04-25"},"2006-04-25","12. klass"]
["Naine","Freia","Saadi",168,"2007-08-27","11. klass"]
["Mees","Mattias","Saareleht",173,"2006-12-11","11. klass"]
["Mees","Nils","Saareleht",165,"2007-04-09","11. klass"]
["Naine","Amanda","Sild",170,"2007-06-06","11. klass"]
["Naine","Johanna","Uudeväli",164,"2007-03-19","11. klass"]
["Mees","Reito","Uudeväli",178,"2007-05-22","11. klass"]
[null,null,null,null,null,"11. klass"]
["12. klass",null,null,null,null,"12. klass"]
["Sugu","Eesnimi","Perenimi","Pikkus","Sünniaeg","12. klass"]
["Naine","Raina","Ammermann",174,"2006-03-24","12. klass"]
["Naine","Kertu","Jaam",172,"2006-08-31","12. klass"]
["Mees","Venno","Juur",186,"2006-08-02","12. klass"]
["Mees","Mooses","Olander",189,"2006-03-01","12. klass"]
["Mees","Kennert","Pintsuk",166,"2006-04-01","12. klass"]
["Mees","Gudving","Reilent",171,"2006-02-21","12. klass"]
["Mees","Kevin","Reimal",167,"2006-09-29","12. klass"]
["Mees","Oskar","Teiter",173,"2006-09-24","12. klass"]
["Naine","Kristina","Toode",164,"2005-11-18","12. klass"]
["Naine","Eliise","Vahtrik",166,"2005-12-13","12. klass"]
["Mees","Janno","Vakk",185,"2006-09-02","12. klass"]
["Naine","Elisabeth","Valkenklau",160,"2006-04-25","12. klass"]
["Naine","Emily","Valkenklau",168,"2006-04-25","12. klass"]
["Naine","Karoliina","Valkenklau",173,"2006-04-25","12. klass"]