{"text_format":"1","workbook":"xlsx","n_sheets":19,"sheets":["Start","Sisukord","Loendid","A_müügid","Töötajad","Rist_koond","Filter_AT","P_Müügid","Sort","Päringud","Filter","Aren_Filter","Filter_PM_D","Kokku","Vahekokku","Risttabelid","SumIF","D_Fumkts","P_abi"],"not_rendered":{"charts":0,"images":12,"macros":1,"external_links":0,"defined_names":119,"comments":12,"pivot_tables":3},"unopened":[],"bounds":{"document_bytes":16777216,"sheet_cells":100000,"rows_first":2000,"rows_last":500,"rows_between":2000,"halvings":0,"cell_chars":16384,"cell_head_chars":4096},"cells_cut":0,"cells_raw":0,"read":"whole","date_system":"1900"}

{"sheet":"Start","index":0,"n_rows":15,"n_cols":4,"rows_kept":15,"cut":false,"hidden":false,"merged":[]}
[]
[]
[]
[]
[]
[]
[]
[]
[]
[]
[null,null,null,"Tabelid 2"]
[]
[null,null,null,"Andmeloendid. Andmeanalüüs ja andmete korrastamine"]
[]
[null,null,null,"Sorteerimine, filtreerimine, kokkuvõtted, koondid jm"]

{"sheet":"Sisukord","index":1,"n_rows":17,"n_cols":2,"rows_kept":17,"cut":false,"hidden":false,"merged":[]}
[]
[]
[]
[null,"Andmeloendite  põhiomadused ja põhitegevused nendega"]
[null,"Arvutite müükide arvestus"]
[null,"Töötajate nimekiri"]
[null,"Puidu müükide tabel"]
[null,"Tabeli kirjete sorteerimine ja grupeerimine"]
[null,"Päringud ja filtreerimine"]
[null,"Autofilter"]
[null,"Arendatud filter"]
[null,"Makro kasutamine arendatud filtriga "]
[null," Kokkuvõtted, koondid jmt"]
[null,"Vahekokkuvõtted - Subtotals"]
[null,"Risttabelid - Pivot Table Report"]
[null,"Funktsioonid COUNTIF ja SUMIF "]
[null,"Andmebaaside funktsioonid"]

{"sheet":"Loendid","index":2,"n_rows":19,"n_cols":15,"rows_kept":19,"cut":false,"hidden":false,"merged":[]}
[null,null,null,null,"veeb","klipp Andmeloendid"]
[]
["Andmeloendite  põhiomadused ja põhitegevused nendega"]
[null,null,null,null,null,null,null,"Arvutid"]
[]
[null,null,null,null,null,null,null,"Mark","Protsessori\ntüüp","Takt-\nsagedus","Põhimälu\nmaht","Kõvaketta\nmaht","Hind"]
[null,null,null,null,null,null,null,"Aragorn","AMD Athlon64",3,512,160,499,null,"Kauri ema "]
[null,null,null,null,null,null,null,"Arven","Intel Core 2",2.6,256,200,369]
[null,null,null,null,null,null,null,"Balrog","Intel Celeron",2.8,256,80,419]
[null,null,null,null,null,null,null,"Eldar","Intel Xeon",3,512,160,465]
[null,null,null,null,null,null,null,"Elend","Intel Celeron",4,2048,400,920]
[null,null,null,null,null,null,null,"Faram","AMD Athlon64",3,512,210,599]
[null,null,null,null,null,null,null,"Frodo","AMD Athlon64",3,4072,500,870]
[null,"Põhitegevused",null,null,null,null,null,"Gandalf","Intel Xeon",3.2,512,160,849]
[null,null,null,null,null,null,null,"Grimbold","Intel Core 2",3.8,1024,320,1149]
[null,null,null,null,null,null,null,"Kalvar","Intel Xeon",3,512,160,699]
[null,null,null,null,null,null,null,"Marvin","Intel Celeron",3,512,160,370]
[null,null,null,null,null,null,null,"Rohan","AMD Athlon64",3.5,512,160,340]
[null,null,null,null,null,null,null,"Sauron","Intel Xeon",2.5,256,180,339]

{"sheet":"A_müügid","index":3,"n_rows":41,"n_cols":7,"rows_kept":41,"cut":false,"hidden":false,"merged":[]}
[]
[]
[null,"Arvutite müükide arvestus",null,null,null,"arvutid"]
[]
[null,null,null,"Kokku",{"$f":"SUM(Arv)","v":90},null,{"$f":"SUM(Maksumus)","v":55522}]
[]
[null,"Kuupäev","Linn","Arvuti","Arv","Hind","Maksumus"]
[null,"2013-01-02","Tallinn","Frodo",2,{"$f":"VLOOKUP(Arvuti, Arvutid, 6, 0)","v":870},{"$f":"Hind * Arv","v":1740}]
[null,"2013-01-02","Valga","Balrog",1,{"$f":"VLOOKUP(Arvuti, Arvutid, 6, 0)","v":419},419]
[null,"2013-01-03","Võru","Gandalf",2,849,1698]
[null,"2013-01-03","Tallinn","Balrog",3,419,1257]
[null,"2013-01-03","Tallinn","Aragorn",2,499,998]
[null,"2013-01-04","Tartu","Balrog",5,419,2095]
[null,"2013-01-04","Tallinn","Eldar",3,465,1395]
[null,"2013-01-07","Valga","Balrog",6,419,2514]
[null,"2013-01-07","Pärnu","Eldar",3,465,1395]
[null,"2013-01-07","Valga","Frodo",1,870,870]
[null,"2013-01-07","Tallinn","Faram",1,599,599]
[null,"2013-01-09","Tallinn","Grimbold",6,1149,6894]
[null,"2013-01-10","Pärnu","Rohan",4,340,1360]
[null,"2013-01-10","Pärnu","Elend",1,920,920]
[null,"2013-01-10","Tartu","Sauron",2,339,678]
[null,"2013-01-11","Tartu","Balrog",2,419,838]
[null,"2013-01-11","Tallinn","Marvin",1,370,370]
[null,"2013-01-11","Valga","Aragorn",1,499,499]
[null,"2013-01-14","Tartu","Frodo",4,870,3480]
[null,"2013-01-14","Pärnu","Gandalf",3,849,2547]
[null,"2013-01-14","Valga","Kalvar",2,699,1398]
[null,"2013-01-16","Tallinn","Arven",5,369,1845]
[null,"2013-01-17","Tallinn","Kalvar",7,699,4893]
[null,"2013-01-17","Tartu","Aragorn",3,499,1497]
[null,"2013-01-18","Tallinn","Aragorn",1,499,499]
[null,"2013-01-18","Pärnu","Eldar",1,465,465]
[null,"2013-01-19","Võru","Elend",5,920,4600]
[null,"2013-01-19","Tallinn","Faram",3,599,1797]
[null,"2013-01-19","Tartu","Kalvar",1,699,699]
[null,"2013-01-20","Tallinn","Elend",2,920,1840]
[null,"2013-01-20","Võru","Sauron",3,339,1017]
[null,"2013-01-21","Pärnu","Arven",1,369,369]
[null,"2013-01-25","Võru","Sauron",1,339,339]
[null,"2013-01-26","Pärnu","Gandalf",2,849,1698]

{"sheet":"Töötajad","index":4,"n_rows":105,"n_cols":17,"rows_kept":105,"cut":false,"hidden":false,"merged":[]}
[]
[null,null,null,null,null,null,null,null,null,null,null,"Amet","Sugu",null,"Sugu","Vanus","Palk"]
[null,"Töötajad",null,null,null,null,null,null,null,null,null,"juhataja","naine",null,"mees",">50","<1000"]
[null,"sortimine","autofilter","arend. filter","vahekokkuv.","risttabel"]
[null,null,null,null,null,null,null,null,null,null,null,null,null,null,"Osakond","Sugu"]
[null,"Isikukood","Eesnimi","Perenimi","Sugu","Sünniaeg","Vanus","Osakond","Amet","Palk",null,"Amet","Arv",null,"ladu","naine"]
[null,"37303030624","Aarne","Mikson","mees",{"$f":"DATE(MID(B7,2,2),MID(B7,4,2),MID(B7,6,2))","v":"1973-03-03"},{"$f":"INT((TODAY()-F7)/365.25)","v":46},"Ost","juhataja",1970,null,"tööline",{"$f":"COUNTIF(Amet,L7)","v":32},null,"ost","naine"]
[null,"46605150941","Maarja","Ambros","naine",{"$f":"DATE(MID(B8,2,2),MID(B8,4,2),MID(B8,6,2))","v":"1966-05-15"},{"$f":"INT((TODAY()-F8)/365.25)","v":53},"Ost","sekretär",950,null,"sekretär",13]
[null,"45903030319","Valve","Mäesalu","naine",{"$f":"DATE(MID(B9,2,2),MID(B9,4,2),MID(B9,6,2))","v":"1959-03-03"},{"$f":"INT((TODAY()-F9)/365.25)","v":60},"Ost","sekretär",750,null,"autojuht",11,null,"Amet","Osakond"]
[null,"46809210954","Aigi","Härm","naine",{"$f":"DATE(MID(B10,2,2),MID(B10,4,2),MID(B10,6,2))","v":"1968-09-21"},{"$f":"INT((TODAY()-F10)/365.25)","v":51},"Ost","sekretär",720,null,"juhataja",6,null,"juhataja","müük"]
[null,"44311130888","Sirje","Härm","naine",{"$f":"DATE(MID(B11,2,2),MID(B11,4,2),MID(B11,6,2))","v":"1943-11-13"},{"$f":"INT((TODAY()-F11)/365.25)","v":75},"Ost","sekretär",570,null,"raamatupidaja",5,null,"juhataja","ost"]
[null,47302150417,"Mare","Eesmaa","naine",{"$f":"DATE(MID(B12,2,2),MID(B12,4,2),MID(B12,6,2))","v":"1973-02-15"},{"$f":"INT((TODAY()-F12)/365.25)","v":46},"Majandus","juhataja",1690,null,"dispetser",4,null,"sekretär","ost"]
[null,"44203130136","Mirja","Bergmann","naine",{"$f":"DATE(MID(B13,2,2),MID(B13,4,2),MID(B13,6,2))","v":"1942-03-13"},{"$f":"INT((TODAY()-F13)/365.25)","v":77},"Majandus","koristaja",1270,null,"diiler",4]
[null,"45902200391","Evelin","Põld","naine",{"$f":"DATE(MID(B14,2,2),MID(B14,4,2),MID(B14,6,2))","v":"1959-02-20"},{"$f":"INT((TODAY()-F14)/365.25)","v":60},"Majandus","sekretär",640,null,"treial",4,null,"Amet","Vanus","Palk"]
[null,"48305030944","Laine","Eek","naine",{"$f":"DATE(MID(B15,2,2),MID(B15,4,2),MID(B15,6,2))","v":"1983-05-03"},{"$f":"INT((TODAY()-F15)/365.25)","v":36},"Majandus","sekretär",510]
[null,"48105090295","Annika","Paju","naine",{"$f":"DATE(MID(B16,2,2),MID(B16,4,2),MID(B16,6,2))","v":"1981-05-09"},{"$f":"INT((TODAY()-F16)/365.25)","v":38},"Majandus","sekretär",510,null,"koristaja",3,null,"müügijuht",">=50",">=1200"]
[null,"44012150956","Aasa","Randla","naine",{"$f":"DATE(MID(B17,2,2),MID(B17,4,2),MID(B17,6,2))","v":"1940-12-15"},{"$f":"INT((TODAY()-F17)/365.25)","v":78},"Majandus","koristaja",480,null,"müügijuht",3,null,"jurist",">=50",">=1200"]
[null,"44601210234","Tiina","Toomsalu","naine",{"$f":"DATE(MID(B18,2,2),MID(B18,4,2),MID(B18,6,2))","v":"1946-01-21"},{"$f":"INT((TODAY()-F18)/365.25)","v":73},"Majandus","koristaja",430,null,"meister",3]
[null,"34112180084","Anton","Meister","mees",{"$f":"DATE(MID(B19,2,2),MID(B19,4,2),MID(B19,6,2))","v":"1941-12-18"},{"$f":"INT((TODAY()-F19)/365.25)","v":77},"Ladu","juhataja",1510,null,"kompekteerija",2]
[null,"45710100356","Airi","Põld","naine",{"$f":"DATE(MID(B20,2,2),MID(B20,4,2),MID(B20,6,2))","v":"1957-10-10"},{"$f":"INT((TODAY()-F20)/365.25)","v":62},"Ladu","kompekteerija",770,null,"referent",1]
[null,"46709190988","Selma","Parre","naine",{"$f":"DATE(MID(B21,2,2),MID(B21,4,2),MID(B21,6,2))","v":"1967-09-19"},{"$f":"INT((TODAY()-F21)/365.25)","v":52},"Ladu","tööline",710,null,"valvur",1]
[null,"34708140585","Erki","Arsenov","mees",{"$f":"DATE(MID(B22,2,2),MID(B22,4,2),MID(B22,6,2))","v":"1947-08-14"},{"$f":"INT((TODAY()-F22)/365.25)","v":72},"Ladu","kompekteerija",690]
[null,"34810190405","Karl","Salu","mees",{"$f":"DATE(MID(B23,2,2),MID(B23,4,2),MID(B23,6,2))","v":"1948-10-19"},{"$f":"INT((TODAY()-F23)/365.25)","v":71},"Ladu","dispetser",660,null,"Märts",null,"L pere",null,"Teisipäev"]
[null,"34506190557","Reijo","Meigas","mees",{"$f":"DATE(MID(B24,2,2),MID(B24,4,2),MID(B24,6,2))","v":"1945-06-19"},{"$f":"INT((TODAY()-F24)/365.25)","v":74},"Ladu","tööline",640,null,{"$f":"MONTH(F7)=3","v":true},null,{"$f":"LEFT(D7,1)=\"L\"","v":false},null,{"$f":"WEEKDAY(F7,2)=2","v":false}]
[null,"38301080820","Meelis","Kalju","mees",{"$f":"DATE(MID(B25,2,2),MID(B25,4,2),MID(B25,6,2))","v":"1983-01-08"},{"$f":"INT((TODAY()-F25)/365.25)","v":36},"Ladu","tööline",510]
[null,"34404190222","Kaivo","Berk","mees",{"$f":"DATE(MID(B26,2,2),MID(B26,4,2),MID(B26,6,2))","v":"1944-04-19"},{"$f":"INT((TODAY()-F26)/365.25)","v":75},"Ladu","tööline",510,null,"Osakond"]
[null,"48208230166","Tiina","Markus","naine",{"$f":"DATE(MID(B27,2,2),MID(B27,4,2),MID(B27,6,2))","v":"1982-08-23"},{"$f":"INT((TODAY()-F27)/365.25)","v":37},"Ladu","tööline",500,null,"Ost"]
[null,36008130050,"Einar","Laanepõld","mees",{"$f":"DATE(MID(B28,2,2),MID(B28,4,2),MID(B28,6,2))","v":"1960-08-13"},{"$f":"INT((TODAY()-F28)/365.25)","v":59},"Ladu","tööline",500,null,"Majandus"]
[null,46908050804,"Malle","Kivioja","naine",{"$f":"DATE(MID(B29,2,2),MID(B29,4,2),MID(B29,6,2))","v":"1969-08-05"},{"$f":"INT((TODAY()-F29)/365.25)","v":50},"Finants","juhataja",2430,null,"Ladu"]
[null,"47010010868","Faina","Lepp","naine",{"$f":"DATE(MID(B30,2,2),MID(B30,4,2),MID(B30,6,2))","v":"1970-10-01"},{"$f":"INT((TODAY()-F30)/365.25)","v":49},"Finants","jurist",1570,null,"Finants"]
[null,"45604030496","Malle","Ligi","naine",{"$f":"DATE(MID(B31,2,2),MID(B31,4,2),MID(B31,6,2))","v":"1956-04-03"},{"$f":"INT((TODAY()-F31)/365.25)","v":63},"Finants","jurist",1510,null,"Transport"]
[null,"37803090504","Jaan","Laubre","mees",{"$f":"DATE(MID(B32,2,2),MID(B32,4,2),MID(B32,6,2))","v":"1978-03-09"},{"$f":"INT((TODAY()-F32)/365.25)","v":41},"Finants","raamatupidaja",850,null,"Müük"]
[null,"45711080030","Kristel","Astok","naine",{"$f":"DATE(MID(B33,2,2),MID(B33,4,2),MID(B33,6,2))","v":"1957-11-08"},{"$f":"INT((TODAY()-F33)/365.25)","v":61},"Finants","raamatupidaja",850,null,"Tootmine"]
[null,"44607080463","Evi","Sarapik","naine",{"$f":"DATE(MID(B34,2,2),MID(B34,4,2),MID(B34,6,2))","v":"1946-07-08"},{"$f":"INT((TODAY()-F34)/365.25)","v":73},"Finants","raamatupidaja",850]
[null,47311270496,"Vilma","Eesmaa","naine",{"$f":"DATE(MID(B35,2,2),MID(B35,4,2),MID(B35,6,2))","v":"1973-11-27"},{"$f":"INT((TODAY()-F35)/365.25)","v":45},"Finants","raamatupidaja",770]
[null,47102200902,"Ene","Burmeister","naine",{"$f":"DATE(MID(B36,2,2),MID(B36,4,2),MID(B36,6,2))","v":"1971-02-20"},{"$f":"INT((TODAY()-F36)/365.25)","v":48},"Finants","raamatupidaja",710]
[null,"46404170054","Katy","Veesimaa","naine",{"$f":"DATE(MID(B37,2,2),MID(B37,4,2),MID(B37,6,2))","v":"1964-04-17"},{"$f":"INT((TODAY()-F37)/365.25)","v":55},"Finants","referent",650]
[null,"37111200348","Margus","Roosimägi","mees",{"$f":"DATE(MID(B38,2,2),MID(B38,4,2),MID(B38,6,2))","v":"1971-11-20"},{"$f":"INT((TODAY()-F38)/365.25)","v":47},"Transport","autojuht",910]
[null,"36802240722","Ahto","Danilov","mees",{"$f":"DATE(MID(B39,2,2),MID(B39,4,2),MID(B39,6,2))","v":"1968-02-24"},{"$f":"INT((TODAY()-F39)/365.25)","v":51},"Transport","autojuht",910]
[null,"35809050610","Aadu","Malva","mees",{"$f":"DATE(MID(B40,2,2),MID(B40,4,2),MID(B40,6,2))","v":"1958-09-05"},{"$f":"INT((TODAY()-F40)/365.25)","v":61},"Transport","autojuht",790]
[null,38302070214,"Priit","Burmeister","mees",{"$f":"DATE(MID(B41,2,2),MID(B41,4,2),MID(B41,6,2))","v":"1983-02-07"},{"$f":"INT((TODAY()-F41)/365.25)","v":36},"Transport","autojuht",770]
[null,"37708220891","Ando","Nõmmik","mees",{"$f":"DATE(MID(B42,2,2),MID(B42,4,2),MID(B42,6,2))","v":"1977-08-22"},{"$f":"INT((TODAY()-F42)/365.25)","v":42},"Transport","autojuht",770]
[null,"34906210936","Jaan","Kaasik","mees",{"$f":"DATE(MID(B43,2,2),MID(B43,4,2),MID(B43,6,2))","v":"1949-06-21"},{"$f":"INT((TODAY()-F43)/365.25)","v":70},"Transport","autojuht",730]
[null,"47111150090","Tiina","Rajamäe","naine",{"$f":"DATE(MID(B44,2,2),MID(B44,4,2),MID(B44,6,2))","v":"1971-11-15"},{"$f":"INT((TODAY()-F44)/365.25)","v":47},"Transport","dispetser",710]
[null,"36907260696","Hanno","Pedak","mees",{"$f":"DATE(MID(B45,2,2),MID(B45,4,2),MID(B45,6,2))","v":"1969-07-26"},{"$f":"INT((TODAY()-F45)/365.25)","v":50},"Transport","autojuht",710]
[null,"36512210549","Paul","Naaber","mees",{"$f":"DATE(MID(B46,2,2),MID(B46,4,2),MID(B46,6,2))","v":"1965-12-21"},{"$f":"INT((TODAY()-F46)/365.25)","v":53},"Transport","autojuht",700]
[null,"35001130124","Aarne","Oks","mees",{"$f":"DATE(MID(B47,2,2),MID(B47,4,2),MID(B47,6,2))","v":"1950-01-13"},{"$f":"INT((TODAY()-F47)/365.25)","v":69},"Transport","autojuht",700]
[null,"37509120658","Boris","Küünemäe","mees",{"$f":"DATE(MID(B48,2,2),MID(B48,4,2),MID(B48,6,2))","v":"1975-09-12"},{"$f":"INT((TODAY()-F48)/365.25)","v":44},"Transport","autojuht",650]
[null,"47110060467","Elvi","Berk","naine",{"$f":"DATE(MID(B49,2,2),MID(B49,4,2),MID(B49,6,2))","v":"1971-10-06"},{"$f":"INT((TODAY()-F49)/365.25)","v":48},"Transport","dispetser",640]
[null,"45809140289","Kristiina","Oks","naine",{"$f":"DATE(MID(B50,2,2),MID(B50,4,2),MID(B50,6,2))","v":"1958-09-14"},{"$f":"INT((TODAY()-F50)/365.25)","v":61},"Transport","dispetser",630]
[null,"35408240148","Arnold","Merilaid","mees",{"$f":"DATE(MID(B51,2,2),MID(B51,4,2),MID(B51,6,2))","v":"1954-08-24"},{"$f":"INT((TODAY()-F51)/365.25)","v":65},"Transport","autojuht",630]
[null,"34204170615","Aadu","Pulk","mees",{"$f":"DATE(MID(B52,2,2),MID(B52,4,2),MID(B52,6,2))","v":"1942-04-17"},{"$f":"INT((TODAY()-F52)/365.25)","v":77},"Transport","valvur",430]
[null,"37006180544","Erno","Salumets","mees",{"$f":"DATE(MID(B53,2,2),MID(B53,4,2),MID(B53,6,2))","v":"1970-06-18"},{"$f":"INT((TODAY()-F53)/365.25)","v":49},"Müük","juhataja",2430]
[null,"36709040675","Tarmo","Müller","mees",{"$f":"DATE(MID(B54,2,2),MID(B54,4,2),MID(B54,6,2))","v":"1967-09-04"},{"$f":"INT((TODAY()-F54)/365.25)","v":52},"Müük","müügijuht",1390]
[null,47110070151,"Erika","Bachmann","naine",{"$f":"DATE(MID(B55,2,2),MID(B55,4,2),MID(B55,6,2))","v":"1971-10-07"},{"$f":"INT((TODAY()-F55)/365.25)","v":48},"Müük","müügijuht",900]
[null,"47110240441","Ene","Elmik","naine",{"$f":"DATE(MID(B56,2,2),MID(B56,4,2),MID(B56,6,2))","v":"1971-10-24"},{"$f":"INT((TODAY()-F56)/365.25)","v":48},"Müük","müügijuht",850]
[null,"38303010526","Jaan","Noormets","mees",{"$f":"DATE(MID(B57,2,2),MID(B57,4,2),MID(B57,6,2))","v":"1983-03-01"},{"$f":"INT((TODAY()-F57)/365.25)","v":36},"Müük","diiler",770]
[null,"37906080465","Kristjan","Mägi","mees",{"$f":"DATE(MID(B58,2,2),MID(B58,4,2),MID(B58,6,2))","v":"1979-06-08"},{"$f":"INT((TODAY()-F58)/365.25)","v":40},"Müük","diiler",730]
[null,"38104220473","Aare","Raudsepp","mees",{"$f":"DATE(MID(B59,2,2),MID(B59,4,2),MID(B59,6,2))","v":"1981-04-22"},{"$f":"INT((TODAY()-F59)/365.25)","v":38},"Müük","diiler",700]
[null,48801180808,"Erika","Kasemets","naine",{"$f":"DATE(MID(B60,2,2),MID(B60,4,2),MID(B60,6,2))","v":"1988-01-18"},{"$f":"INT((TODAY()-F60)/365.25)","v":31},"Müük","sekretär",650]
[null,"38206070961","Reijo","Okspuu","mees",{"$f":"DATE(MID(B61,2,2),MID(B61,4,2),MID(B61,6,2))","v":"1982-06-07"},{"$f":"INT((TODAY()-F61)/365.25)","v":37},"Müük","diiler",650]
[null,"47605040659","Hilja","Raid","naine",{"$f":"DATE(MID(B62,2,2),MID(B62,4,2),MID(B62,6,2))","v":"1976-05-04"},{"$f":"INT((TODAY()-F62)/365.25)","v":43},"Müük","sekretär",640]
[null,"48210210529","Faina","Kukk","naine",{"$f":"DATE(MID(B63,2,2),MID(B63,4,2),MID(B63,6,2))","v":"1982-10-21"},{"$f":"INT((TODAY()-F63)/365.25)","v":37},"Müük","sekretär",580]
[null,48704250911,"Helen","Aigro","naine",{"$f":"DATE(MID(B64,2,2),MID(B64,4,2),MID(B64,6,2))","v":"1987-04-25"},{"$f":"INT((TODAY()-F64)/365.25)","v":32},"Müük","sekretär",570]
[null,"46809170171","Jana","Kaal","naine",{"$f":"DATE(MID(B65,2,2),MID(B65,4,2),MID(B65,6,2))","v":"1968-09-17"},{"$f":"INT((TODAY()-F65)/365.25)","v":51},"Müük","sekretär",570]
[null,"45209010485","Juulia","Tubin","naine",{"$f":"DATE(MID(B66,2,2),MID(B66,4,2),MID(B66,6,2))","v":"1952-09-01"},{"$f":"INT((TODAY()-F66)/365.25)","v":67},"Müük","sekretär",570]
[null,"34107110230","Hendrik","Kanter","mees",{"$f":"DATE(MID(B67,2,2),MID(B67,4,2),MID(B67,6,2))","v":"1941-07-11"},{"$f":"INT((TODAY()-F67)/365.25)","v":78},"Tootmine","juhataja",2180]
[null,"36405130719","Erki","Ainsaar","mees",{"$f":"DATE(MID(B68,2,2),MID(B68,4,2),MID(B68,6,2))","v":"1964-05-13"},{"$f":"INT((TODAY()-F68)/365.25)","v":55},"Tootmine","lukksepp",1200]
[null,"44406270104","Sirje","Kreen","naine",{"$f":"DATE(MID(B69,2,2),MID(B69,4,2),MID(B69,6,2))","v":"1944-06-27"},{"$f":"INT((TODAY()-F69)/365.25)","v":75},"Tootmine","tööline",975]
[null,"34408020335","Aare","Marmor","mees",{"$f":"DATE(MID(B70,2,2),MID(B70,4,2),MID(B70,6,2))","v":"1944-08-02"},{"$f":"INT((TODAY()-F70)/365.25)","v":75},"Tootmine","meister",950]
[null,"36203030988","Kaivo","Mets","mees",{"$f":"DATE(MID(B71,2,2),MID(B71,4,2),MID(B71,6,2))","v":"1962-03-03"},{"$f":"INT((TODAY()-F71)/365.25)","v":57},"Tootmine","meister",920]
[null,"34110060017","Marko","Erikson","mees",{"$f":"DATE(MID(B72,2,2),MID(B72,4,2),MID(B72,6,2))","v":"1941-10-06"},{"$f":"INT((TODAY()-F72)/365.25)","v":78},"Tootmine","meister",920]
[null,"35901050084","Ahti","Tubin","mees",{"$f":"DATE(MID(B73,2,2),MID(B73,4,2),MID(B73,6,2))","v":"1959-01-05"},{"$f":"INT((TODAY()-F73)/365.25)","v":60},"Tootmine","treial",900]
[null,38502110722,"Karl","Agur","mees",{"$f":"DATE(MID(B74,2,2),MID(B74,4,2),MID(B74,6,2))","v":"1985-02-11"},{"$f":"INT((TODAY()-F74)/365.25)","v":34},"Tootmine","tööline",870]
[null,"37612170754","Eevald","Parts","mees",{"$f":"DATE(MID(B75,2,2),MID(B75,4,2),MID(B75,6,2))","v":"1976-12-17"},{"$f":"INT((TODAY()-F75)/365.25)","v":42},"Tootmine","lukksepp",860]
[null,"37002030149","Kristjan","Jürimäe","mees",{"$f":"DATE(MID(B76,2,2),MID(B76,4,2),MID(B76,6,2))","v":"1970-02-03"},{"$f":"INT((TODAY()-F76)/365.25)","v":49},"Tootmine","lukksepp",850]
[null,"37005020007","Erki","Lepiksoo","mees",{"$f":"DATE(MID(B77,2,2),MID(B77,4,2),MID(B77,6,2))","v":"1970-05-02"},{"$f":"INT((TODAY()-F77)/365.25)","v":49},"Tootmine","treial",790]
[null,"37003260243","Reijo","Muld","mees",{"$f":"DATE(MID(B78,2,2),MID(B78,4,2),MID(B78,6,2))","v":"1970-03-26"},{"$f":"INT((TODAY()-F78)/365.25)","v":49},"Tootmine","tööline",790]
[null,"37105220288","Kustav","Salu","mees",{"$f":"DATE(MID(B79,2,2),MID(B79,4,2),MID(B79,6,2))","v":"1971-05-22"},{"$f":"INT((TODAY()-F79)/365.25)","v":48},"Tootmine","tööline",770]
[null,36009040214,"Andrus","Koort","mees",{"$f":"DATE(MID(B80,2,2),MID(B80,4,2),MID(B80,6,2))","v":"1960-09-04"},{"$f":"INT((TODAY()-F80)/365.25)","v":59},"Tootmine","treial",770]
[null,"35104120460","Reijo","Müürsepp","mees",{"$f":"DATE(MID(B81,2,2),MID(B81,4,2),MID(B81,6,2))","v":"1951-04-12"},{"$f":"INT((TODAY()-F81)/365.25)","v":68},"Tootmine","lukksepp",770]
[null,"34811280456","Argo","Salu","mees",{"$f":"DATE(MID(B82,2,2),MID(B82,4,2),MID(B82,6,2))","v":"1948-11-28"},{"$f":"INT((TODAY()-F82)/365.25)","v":70},"Tootmine","tööline",770]
[null,"38005180669","Hanno","Pajusaar","mees",{"$f":"DATE(MID(B83,2,2),MID(B83,4,2),MID(B83,6,2))","v":"1980-05-18"},{"$f":"INT((TODAY()-F83)/365.25)","v":39},"Tootmine","tööline",760]
[null,"37308230939","Madis","Paulus","mees",{"$f":"DATE(MID(B84,2,2),MID(B84,4,2),MID(B84,6,2))","v":"1973-08-23"},{"$f":"INT((TODAY()-F84)/365.25)","v":46},"Tootmine","tööline",750]
[null,"36110090988","Aadu","Elson","mees",{"$f":"DATE(MID(B85,2,2),MID(B85,4,2),MID(B85,6,2))","v":"1961-10-09"},{"$f":"INT((TODAY()-F85)/365.25)","v":58},"Tootmine","tööline",750]
[null,"34309100049","Madis","Maasalu","mees",{"$f":"DATE(MID(B86,2,2),MID(B86,4,2),MID(B86,6,2))","v":"1943-09-10"},{"$f":"INT((TODAY()-F86)/365.25)","v":76},"Tootmine","tööline",720]
[null,"38008200347","Arnold","Norak","mees",{"$f":"DATE(MID(B87,2,2),MID(B87,4,2),MID(B87,6,2))","v":"1980-08-20"},{"$f":"INT((TODAY()-F87)/365.25)","v":39},"Tootmine","tööline",710]
[null,"35009030894","Margus","Maasalu","mees",{"$f":"DATE(MID(B88,2,2),MID(B88,4,2),MID(B88,6,2))","v":"1950-09-03"},{"$f":"INT((TODAY()-F88)/365.25)","v":69},"Tootmine","tööline",710]
[null,"47508150058","Irma","Piirsalu","naine",{"$f":"DATE(MID(B89,2,2),MID(B89,4,2),MID(B89,6,2))","v":"1975-08-15"},{"$f":"INT((TODAY()-F89)/365.25)","v":44},"Tootmine","tööline",700]
[null,"35404050446","Reijo","Bauman","mees",{"$f":"DATE(MID(B90,2,2),MID(B90,4,2),MID(B90,6,2))","v":"1954-04-05"},{"$f":"INT((TODAY()-F90)/365.25)","v":65},"Tootmine","tööline",700]
[null,"33907250511","Riho","Kuusk","mees",{"$f":"DATE(MID(B91,2,2),MID(B91,4,2),MID(B91,6,2))","v":"1939-07-25"},{"$f":"INT((TODAY()-F91)/365.25)","v":80},"Tootmine","tööline",690]
[null,"34103030178","Einar","Ehala","mees",{"$f":"DATE(MID(B92,2,2),MID(B92,4,2),MID(B92,6,2))","v":"1941-03-03"},{"$f":"INT((TODAY()-F92)/365.25)","v":78},"Tootmine","treial",680]
[null,"38201060031","Raivo","Lokk","mees",{"$f":"DATE(MID(B93,2,2),MID(B93,4,2),MID(B93,6,2))","v":"1982-01-06"},{"$f":"INT((TODAY()-F93)/365.25)","v":37},"Tootmine","tööline",650]
[null,"46307080393","Malle","Põldmaa","naine",{"$f":"DATE(MID(B94,2,2),MID(B94,4,2),MID(B94,6,2))","v":"1963-07-08"},{"$f":"INT((TODAY()-F94)/365.25)","v":56},"Tootmine","tööline",650]
[null,"44111240925","Leida","Jaanus","naine",{"$f":"DATE(MID(B95,2,2),MID(B95,4,2),MID(B95,6,2))","v":"1941-11-24"},{"$f":"INT((TODAY()-F95)/365.25)","v":77},"Tootmine","tööline",640]
[null,"36406070555","Aarne","Norak","mees",{"$f":"DATE(MID(B96,2,2),MID(B96,4,2),MID(B96,6,2))","v":"1964-06-07"},{"$f":"INT((TODAY()-F96)/365.25)","v":55},"Tootmine","tööline",620]
[null,"36504060863","Arvi","Väljas","mees",{"$f":"DATE(MID(B97,2,2),MID(B97,4,2),MID(B97,6,2))","v":"1965-04-06"},{"$f":"INT((TODAY()-F97)/365.25)","v":54},"Tootmine","tööline",580]
[null,"35312110930","Kaspar","Veesimaa","mees",{"$f":"DATE(MID(B98,2,2),MID(B98,4,2),MID(B98,6,2))","v":"1953-12-11"},{"$f":"INT((TODAY()-F98)/365.25)","v":65},"Tootmine","tööline",580]
[null,"33904050217","Olav","Berk","mees",{"$f":"DATE(MID(B99,2,2),MID(B99,4,2),MID(B99,6,2))","v":"1939-04-05"},{"$f":"INT((TODAY()-F99)/365.25)","v":80},"Tootmine","tööline",580]
[null,"38211130833","Meelis","Petrov","mees",{"$f":"DATE(MID(B100,2,2),MID(B100,4,2),MID(B100,6,2))","v":"1982-11-13"},{"$f":"INT((TODAY()-F100)/365.25)","v":36},"Tootmine","tööline",570]
[null,38205190379,"Aadu","Heinlo","mees",{"$f":"DATE(MID(B101,2,2),MID(B101,4,2),MID(B101,6,2))","v":"1982-05-19"},{"$f":"INT((TODAY()-F101)/365.25)","v":37},"Tootmine","lukksepp",570]
[null,"48109130038","Kersti","Miller","naine",{"$f":"DATE(MID(B102,2,2),MID(B102,4,2),MID(B102,6,2))","v":"1981-09-13"},{"$f":"INT((TODAY()-F102)/365.25)","v":38},"Tootmine","tööline",570]
[null,"48007150516","Erna","Eek","naine",{"$f":"DATE(MID(B103,2,2),MID(B103,4,2),MID(B103,6,2))","v":"1980-07-15"},{"$f":"INT((TODAY()-F103)/365.25)","v":39},"Tootmine","tööline",550]
[null,"35105180673","Eino","Luige","mees",{"$f":"DATE(MID(B104,2,2),MID(B104,4,2),MID(B104,6,2))","v":"1951-05-18"},{"$f":"INT((TODAY()-F104)/365.25)","v":68},"Tootmine","tööline",510]
[null,"47005130963","Heli","Lind","naine",{"$f":"DATE(MID(B105,2,2),MID(B105,4,2),MID(B105,6,2))","v":"1970-05-13"},{"$f":"INT((TODAY()-F105)/365.25)","v":49},"Tootmine","tööline",500]

{"sheet":"Rist_koond","index":5,"n_rows":50,"n_cols":4,"rows_kept":50,"cut":false,"hidden":false,"merged":[]}
[]
["Osakondade palkade summad"]
[]
["Row Labels","Sum of Palk"]
["Finants",10190]
["Ladu",7000]
["Majandus",5530]
["Müük",12000]
["Ost",4960]
["Tootmine",30025]
["Transport",10680]
["Grand Total",80385]
[]
[]
["Ametide ja sugude keskmine palk"]
[]
["Average of Palk","Column Labels"]
["Row Labels","mees","naine","Grand Total"]
["autojuht",751.81818181818187,null,751.81818181818187]
["diiler",712.5,null,712.5]
["dispetser",660,660,660]
["juhataja",2022.5,2060,2035]
["jurist",null,1540,1540]
["kompekteerija",690,770,730]
["koristaja",null,726.66666666666663,726.66666666666663]
["lukksepp",850,null,850]
["meister",930,null,930]
["müügijuht",1390,875,1046.6666666666667]
["raamatupidaja",850,795,806]
["referent",null,650,650]
["sekretär",null,633.07692307692309,633.07692307692309]
["treial",785,null,785]
["tööline",662.60869565217388,643.88888888888891,657.34375]
["valvur",430,null,430]
["Grand Total",824.57627118644064,793.375,811.969696969697]
[]
[]
["Keskmine palk sugude ja vanusevahemike lõikes"]
[]
["Osakond","(All)"]
[]
["Average of Palk","Column Labels"]
["Row Labels","mees","naine","Grand Total"]
["25-34",870,610,696.66666666666663]
["35-44",701.33333333333337,570,655.6521739130435]
["45-54",1042.3076923076924,980,1010]
["55-64",806.25,806.25,806.25]
["65-74",674.16666666666663,616.66666666666663,662.66666666666663]
["75-84",917,787,873.66666666666663]
["Grand Total",824.57627118644064,793.375,811.969696969697]

{"sheet":"Filter_AT","index":6,"n_rows":70,"n_cols":9,"rows_kept":70,"cut":false,"hidden":false,"merged":[]}
[]
["Kirjed, kus sugu on mees, vanus > 50 ja palk < 100."]
[]
["Isikukood","Eesnimi","Perenimi","Sugu","Sünniaeg","Vanus","Osakond","Amet","Palk"]
["34810190405","Karl","Salu","mees","1948-10-19",71,"Ladu","dispetser",660]
["34708140585","Erki","Arsenov","mees","1947-08-14",72,"Ladu","kompekteerija",690]
["34506190557","Reijo","Meigas","mees","1945-06-19",74,"Ladu","tööline",640]
["34404190222","Kaivo","Berk","mees","1944-04-19",75,"Ladu","tööline",510]
[36008130050,"Einar","Laanepõld","mees","1960-08-13",59,"Ladu","tööline",500]
["35104120460","Reijo","Müürsepp","mees","1951-04-12",68,"Tootmine","lukksepp",770]
["34408020335","Aare","Marmor","mees","1944-08-02",75,"Tootmine","meister",950]
["36203030988","Kaivo","Mets","mees","1962-03-03",57,"Tootmine","meister",920]
["34110060017","Marko","Erikson","mees","1941-10-06",78,"Tootmine","meister",920]
["35901050084","Ahti","Tubin","mees","1959-01-05",60,"Tootmine","treial",900]
[36009040214,"Andrus","Koort","mees","1960-09-04",59,"Tootmine","treial",770]
["34103030178","Einar","Ehala","mees","1941-03-03",78,"Tootmine","treial",680]
["34811280456","Argo","Salu","mees","1948-11-28",70,"Tootmine","tööline",770]
["36110090988","Aadu","Elson","mees","1961-10-09",58,"Tootmine","tööline",750]
["34309100049","Madis","Maasalu","mees","1943-09-10",76,"Tootmine","tööline",720]
["35009030894","Margus","Maasalu","mees","1950-09-03",69,"Tootmine","tööline",710]
["35404050446","Reijo","Bauman","mees","1954-04-05",65,"Tootmine","tööline",700]
["33907250511","Riho","Kuusk","mees","1939-07-25",80,"Tootmine","tööline",690]
["36406070555","Aarne","Norak","mees","1964-06-07",55,"Tootmine","tööline",620]
["36504060863","Arvi","Väljas","mees","1965-04-06",54,"Tootmine","tööline",580]
["35312110930","Kaspar","Veesimaa","mees","1953-12-11",65,"Tootmine","tööline",580]
["33904050217","Olav","Berk","mees","1939-04-05",80,"Tootmine","tööline",580]
["35105180673","Eino","Luige","mees","1951-05-18",68,"Tootmine","tööline",510]
["36802240722","Ahto","Danilov","mees","1968-02-24",51,"Transport","autojuht",910]
["35809050610","Aadu","Malva","mees","1958-09-05",61,"Transport","autojuht",790]
["34906210936","Jaan","Kaasik","mees","1949-06-21",70,"Transport","autojuht",730]
["36512210549","Paul","Naaber","mees","1965-12-21",53,"Transport","autojuht",700]
["35001130124","Aarne","Oks","mees","1950-01-13",69,"Transport","autojuht",700]
["35408240148","Arnold","Merilaid","mees","1954-08-24",65,"Transport","autojuht",630]
["34204170615","Aadu","Pulk","mees","1942-04-17",77,"Transport","valvur",430]
[]
[]
["Kirjed, kus osakond on ladu või ost ja sugu on naine"]
[]
["Isikukood","Eesnimi","Perenimi","Sugu","Sünniaeg","Vanus","Osakond","Amet","Palk"]
["45710100356","Airi","Põld","naine","1957-10-10",62,"Ladu","kompekteerija",770]
["46709190988","Selma","Parre","naine","1967-09-19",52,"Ladu","tööline",710]
["48208230166","Tiina","Markus","naine","1982-08-23",37,"Ladu","tööline",500]
["46605150941","Maarja","Ambros","naine","1966-05-15",53,"Ost","sekretär",950]
["45903030319","Valve","Mäesalu","naine","1959-03-03",60,"Ost","sekretär",750]
["46809210954","Aigi","Härm","naine","1968-09-21",51,"Ost","sekretär",720]
["44311130888","Sirje","Härm","naine","1943-11-13",75,"Ost","sekretär",570]
[]
[]
["Kirjed, kus osakond on müük või ost ja amet on juhataja või sekretär"]
[]
["Isikukood","Eesnimi","Perenimi","Sugu","Sünniaeg","Vanus","Osakond","Amet","Palk"]
["37006180544","Erno","Salumets","mees","1970-06-18",49,"Müük","juhataja",2430]
["37303030624","Aarne","Mikson","mees","1973-03-03",46,"Ost","juhataja",1970]
["46605150941","Maarja","Ambros","naine","1966-05-15",53,"Ost","sekretär",950]
["45903030319","Valve","Mäesalu","naine","1959-03-03",60,"Ost","sekretär",750]
["46809210954","Aigi","Härm","naine","1968-09-21",51,"Ost","sekretär",720]
[48801180808,"Erika","Kasemets","naine","1988-01-18",31,"Müük","sekretär",650]
["47605040659","Hilja","Raid","naine","1976-05-04",43,"Müük","sekretär",640]
["48210210529","Faina","Kukk","naine","1982-10-21",37,"Müük","sekretär",580]
[48704250911,"Helen","Aigro","naine","1987-04-25",32,"Müük","sekretär",570]
["46809170171","Jana","Kaal","naine","1968-09-17",51,"Müük","sekretär",570]
["45209010485","Juulia","Tubin","naine","1952-09-01",67,"Müük","sekretär",570]
["44311130888","Sirje","Härm","naine","1943-11-13",75,"Ost","sekretär",570]
[]
[]
["Kirjed, kus amet on jurist või müügijuht, vanus >= 50 ja palk >= 1200"]
[]
["Eesnimi","Perenimi","Amet","Vanus","Palk"]
["Malle","Ligi","jurist",63,1510]
["Tarmo","Müller","müügijuht",52,1390]

{"sheet":"P_Müügid","index":7,"n_rows":649,"n_cols":12,"rows_kept":649,"cut":false,"hidden":false,"merged":[]}
[]
[null,"Puidu müük",null,"AS Karu & Pojad",null,null,null,{"$f":"YEAR(C9)","v":2013},null,null,"P-abi"]
[]
[null,"sortimine","autofilter","arend. filter","vahekokkuv.","risttabel","SumIF"]
[]
[null,null,null,null,null,null,"Kokku",null,{"$f":"SUM(P_kogus)","v":85495},null,{"$f":"SUM(P_maks)","v":5606050}]
[]
[null,"P_arve","P_kuupäev","P_ostja","P_maa","P_liik","P_sort","P_müüja","P_kogus","P_hind","P_maks","P_kuu"]
[null,"P256","2013-11-04","Känd",{"$f":"VLOOKUP(P_ostja, o_tab, 2, 0)","v":"Harju"},"haab",1,"Ilves",23,{"$f":"VLOOKUP(P_liik, P_hinnad, P_sort+1, 0)","v":50},{"$f":"P_hind * P_kogus","v":1150},{"$f":"MONTH(P_kuupäev)","v":11}]
[null,null,null,null,null,"haab Total",null,null,{"$f":"SUBTOTAL(9,I9:I9)","v":23},null,{"$f":"SUBTOTAL(9,K9:K9)","v":1150}]
[null,"P176","2013-08-04","Känd",{"$f":"VLOOKUP(P_ostja, o_tab, 2, 0)","v":"Harju"},"kask",1,"Siil",40,{"$f":"VLOOKUP(P_liik, P_hinnad, P_sort+1, 0)","v":70},{"$f":"P_hind * P_kogus","v":2800},{"$f":"MONTH(P_kuupäev)","v":8}]
[null,"P199","2013-08-30","Känd",{"$f":"VLOOKUP(P_ostja, o_tab, 2, 0)","v":"Harju"},"kask",1,"Rebane",14,{"$f":"VLOOKUP(P_liik, P_hinnad, P_sort+1, 0)","v":70},{"$f":"P_hind * P_kogus","v":980},{"$f":"MONTH(P_kuupäev)","v":8}]
[null,null,null,null,null,"kask Total",null,null,{"$f":"SUBTOTAL(9,I11:I12)","v":54},null,{"$f":"SUBTOTAL(9,K11:K12)","v":3780}]
[null,"P070","2013-03-25","Känd",{"$f":"VLOOKUP(P_ostja, o_tab, 2, 0)","v":"Harju"},"kuusk",1,"Ilves",72,{"$f":"VLOOKUP(P_liik, P_hinnad, P_sort+1, 0)","v":80},{"$f":"P_hind * P_kogus","v":5760},{"$f":"MONTH(P_kuupäev)","v":3}]
[null,"P070","2013-03-25","Känd",{"$f":"VLOOKUP(P_ostja, o_tab, 2, 0)","v":"Harju"},"kuusk",2,"Ilves",58,{"$f":"VLOOKUP(P_liik, P_hinnad, P_sort+1, 0)","v":72},{"$f":"P_hind * P_kogus","v":4176},{"$f":"MONTH(P_kuupäev)","v":3}]
[null,"P097","2013-04-24","Känd",{"$f":"VLOOKUP(P_ostja, o_tab, 2, 0)","v":"Harju"},"kuusk",1,"Ilves",29,{"$f":"VLOOKUP(P_liik, P_hinnad, P_sort+1, 0)","v":80},{"$f":"P_hind * P_kogus","v":2320},{"$f":"MONTH(P_kuupäev)","v":4}]
[null,null,null,null,null,"kuusk Total",null,null,{"$f":"SUBTOTAL(9,I14:I16)","v":159},null,{"$f":"SUBTOTAL(9,K14:K16)","v":12256}]
[null,"P097","2013-04-24","Känd",{"$f":"VLOOKUP(P_ostja, o_tab, 2, 0)","v":"Harju"},"küte",3,"Ilves",63,{"$f":"VLOOKUP(P_liik, P_hinnad, P_sort+1, 0)","v":38},{"$f":"P_hind * P_kogus","v":2394},{"$f":"MONTH(P_kuupäev)","v":4}]
[null,null,null,null,null,"küte Total",null,null,{"$f":"SUBTOTAL(9,I18:I18)","v":63},null,{"$f":"SUBTOTAL(9,K18:K18)","v":2394}]
[null,"P088","2013-04-16","Känd",{"$f":"VLOOKUP(P_ostja, o_tab, 2, 0)","v":"Harju"},"lepp",1,"Põder",40,{"$f":"VLOOKUP(P_liik, P_hinnad, P_sort+1, 0)","v":65},{"$f":"P_hind * P_kogus","v":2600},{"$f":"MONTH(P_kuupäev)","v":4}]
[null,"P176","2013-08-04","Känd",{"$f":"VLOOKUP(P_ostja, o_tab, 2, 0)","v":"Harju"},"lepp",2,"Siil",31,{"$f":"VLOOKUP(P_liik, P_hinnad, P_sort+1, 0)","v":59},{"$f":"P_hind * P_kogus","v":1829},{"$f":"MONTH(P_kuupäev)","v":8}]
[null,"P180","2013-08-08","Känd",{"$f":"VLOOKUP(P_ostja, o_tab, 2, 0)","v":"Harju"},"lepp",3,"Hunt",31,{"$f":"VLOOKUP(P_liik, P_hinnad, P_sort+1, 0)","v":52},{"$f":"P_hind * P_kogus","v":1612},{"$f":"MONTH(P_kuupäev)","v":8}]
[null,"P199","2013-08-30","Känd",{"$f":"VLOOKUP(P_ostja, o_tab, 2, 0)","v":"Harju"},"lepp",3,"Rebane",10,{"$f":"VLOOKUP(P_liik, P_hinnad, P_sort+1, 0)","v":52},{"$f":"P_hind * P_kogus","v":520},{"$f":"MONTH(P_kuupäev)","v":8}]
[null,null,null,null,null,"lepp Total",null,null,{"$f":"SUBTOTAL(9,I20:I23)","v":112},null,{"$f":"SUBTOTAL(9,K20:K23)","v":6561}]
[null,"P088","2013-04-16","Känd",{"$f":"VLOOKUP(P_ostja, o_tab, 2, 0)","v":"Harju"},"mänd",2,"Põder",61,{"$f":"VLOOKUP(P_liik, P_hinnad, P_sort+1, 0)","v":68},{"$f":"P_hind * P_kogus","v":4148},{"$f":"MONTH(P_kuupäev)","v":4}]
[null,"P131","2013-05-29","Känd",{"$f":"VLOOKUP(P_ostja, o_tab, 2, 0)","v":"Harju"},"mänd",3,"Hunt",79,{"$f":"VLOOKUP(P_liik, P_hinnad, P_sort+1, 0)","v":60},{"$f":"P_hind * P_kogus","v":4740},{"$f":"MONTH(P_kuupäev)","v":5}]
[null,null,null,null,null,"mänd Total",null,null,{"$f":"SUBTOTAL(9,I25:I26)","v":140},null,{"$f":"SUBTOTAL(9,K25:K26)","v":8888}]
[null,"P151","2013-07-01","Känd",{"$f":"VLOOKUP(P_ostja, o_tab, 2, 0)","v":"Harju"},"saar",1,"Jänes",49,{"$f":"VLOOKUP(P_liik, P_hinnad, P_sort+1, 0)","v":85},{"$f":"P_hind * P_kogus","v":4165},{"$f":"MONTH(P_kuupäev)","v":7}]
[null,"P180","2013-08-08","Känd",{"$f":"VLOOKUP(P_ostja, o_tab, 2, 0)","v":"Harju"},"saar",1,"Hunt",23,{"$f":"VLOOKUP(P_liik, P_hinnad, P_sort+1, 0)","v":85},{"$f":"P_hind * P_kogus","v":1955},{"$f":"MONTH(P_kuupäev)","v":8}]
[null,null,null,null,null,"saar Total",null,null,{"$f":"SUBTOTAL(9,I28:I29)","v":72},null,{"$f":"SUBTOTAL(9,K28:K29)","v":6120}]
[null,"P026","2013-01-28","Känd",{"$f":"VLOOKUP(P_ostja, o_tab, 2, 0)","v":"Harju"},"tamm",2,"Siil",11,{"$f":"VLOOKUP(P_liik, P_hinnad, P_sort+1, 0)","v":99},{"$f":"P_hind * P_kogus","v":1089},{"$f":"MONTH(P_kuupäev)","v":1}]
[null,"P097","2013-04-24","Känd",{"$f":"VLOOKUP(P_ostja, o_tab, 2, 0)","v":"Harju"},"tamm",1,"Ilves",43,{"$f":"VLOOKUP(P_liik, P_hinnad, P_sort+1, 0)","v":110},{"$f":"P_hind * P_kogus","v":4730},{"$f":"MONTH(P_kuupäev)","v":4}]
[null,null,null,null,null,"tamm Total",null,null,{"$f":"SUBTOTAL(9,I31:I32)","v":54},null,{"$f":"SUBTOTAL(9,K31:K32)","v":5819}]
[null,null,null,"Känd Total",null,null,null,null,{"$f":"SUBTOTAL(9,I9:I32)","v":677},null,{"$f":"SUBTOTAL(9,K9:K32)","v":46968}]
[null,"P042","2013-02-21","Mänd",{"$f":"VLOOKUP(P_ostja, o_tab, 2, 0)","v":"Harju"},"haab",3,"Põder",26,{"$f":"VLOOKUP(P_liik, P_hinnad, P_sort+1, 0)","v":40},{"$f":"P_hind * P_kogus","v":1040},{"$f":"MONTH(P_kuupäev)","v":2}]
[null,null,null,null,null,"haab Total",null,null,{"$f":"SUBTOTAL(9,I35:I35)","v":26},null,{"$f":"SUBTOTAL(9,K35:K35)","v":1040}]
[null,"P237","2013-10-16","Mänd",{"$f":"VLOOKUP(P_ostja, o_tab, 2, 0)","v":"Harju"},"kask",3,"Karu",76,{"$f":"VLOOKUP(P_liik, P_hinnad, P_sort+1, 0)","v":56},{"$f":"P_hind * P_kogus","v":4256},{"$f":"MONTH(P_kuupäev)","v":10}]
[null,"P237","2013-10-16","Mänd",{"$f":"VLOOKUP(P_ostja, o_tab, 2, 0)","v":"Harju"},"kask",1,"Karu",49,{"$f":"VLOOKUP(P_liik, P_hinnad, P_sort+1, 0)","v":70},{"$f":"P_hind * P_kogus","v":3430},{"$f":"MONTH(P_kuupäev)","v":10}]
[null,null,null,null,null,"kask Total",null,null,{"$f":"SUBTOTAL(9,I37:I38)","v":125},null,{"$f":"SUBTOTAL(9,K37:K38)","v":7686}]
[null,"P257","2013-11-05","Mänd",{"$f":"VLOOKUP(P_ostja, o_tab, 2, 0)","v":"Harju"},"kuusk",1,"Põder",68,{"$f":"VLOOKUP(P_liik, P_hinnad, P_sort+1, 0)","v":80},{"$f":"P_hind * P_kogus","v":5440},{"$f":"MONTH(P_kuupäev)","v":11}]
[null,null,null,null,null,"kuusk Total",null,null,{"$f":"SUBTOTAL(9,I40:I40)","v":68},null,{"$f":"SUBTOTAL(9,K40:K40)","v":5440}]
[null,"P009","2013-01-08","Mänd",{"$f":"VLOOKUP(P_ostja, o_tab, 2, 0)","v":"Harju"},"küte",1,"Jänes",45,{"$f":"VLOOKUP(P_liik, P_hinnad, P_sort+1, 0)","v":47},{"$f":"P_hind * P_kogus","v":2115},{"$f":"MONTH(P_kuupäev)","v":1}]
[null,"P244","2013-10-22","Mänd",{"$f":"VLOOKUP(P_ostja, o_tab, 2, 0)","v":"Harju"},"küte",3,"Siil",61,{"$f":"VLOOKUP(P_liik, P_hinnad, P_sort+1, 0)","v":38},{"$f":"P_hind * P_kogus","v":2318},{"$f":"MONTH(P_kuupäev)","v":10}]
[null,null,null,null,null,"küte Total",null,null,{"$f":"SUBTOTAL(9,I42:I43)","v":106},null,{"$f":"SUBTOTAL(9,K42:K43)","v":4433}]
[null,"P089","2013-04-16","Mänd",{"$f":"VLOOKUP(P_ostja, o_tab, 2, 0)","v":"Harju"},"lepp",2,"Põder",25,{"$f":"VLOOKUP(P_liik, P_hinnad, P_sort+1, 0)","v":59},{"$f":"P_hind * P_kogus","v":1475},{"$f":"MONTH(P_kuupäev)","v":4}]
[null,null,null,null,null,"lepp Total",null,null,{"$f":"SUBTOTAL(9,I45:I45)","v":25},null,{"$f":"SUBTOTAL(9,K45:K45)","v":1475}]
[null,"P041","2013-02-20","Mänd",{"$f":"VLOOKUP(P_ostja, o_tab, 2, 0)","v":"Harju"},"mänd",1,"Siil",74,{"$f":"VLOOKUP(P_liik, P_hinnad, P_sort+1, 0)","v":75},{"$f":"P_hind * P_kogus","v":5550},{"$f":"MONTH(P_kuupäev)","v":2}]
[null,"P145","2013-06-19","Mänd",{"$f":"VLOOKUP(P_ostja, o_tab, 2, 0)","v":"Harju"},"mänd",3,"Karu",47,{"$f":"VLOOKUP(P_liik, P_hinnad, P_sort+1, 0)","v":60},{"$f":"P_hind * P_kogus","v":2820},{"$f":"MONTH(P_kuupäev)","v":6}]
[null,"P240","2013-10-19","Mänd",{"$f":"VLOOKUP(P_ostja, o_tab, 2, 0)","v":"Harju"},"mänd",1,"Ilves",55,{"$f":"VLOOKUP(P_liik, P_hinnad, P_sort+1, 0)","v":75},{"$f":"P_hind * P_kogus","v":4125},{"$f":"MONTH(P_kuupäev)","v":10}]
[null,"P257","2013-11-05","Mänd",{"$f":"VLOOKUP(P_ostja, o_tab, 2, 0)","v":"Harju"},"mänd",2,"Põder",23,{"$f":"VLOOKUP(P_liik, P_hinnad, P_sort+1, 0)","v":68},{"$f":"P_hind * P_kogus","v":1564},{"$f":"MONTH(P_kuupäev)","v":11}]
[null,null,null,null,null,"mänd Total",null,null,{"$f":"SUBTOTAL(9,I47:I50)","v":199},null,{"$f":"SUBTOTAL(9,K47:K50)","v":14059}]
[null,"P042","2013-02-21","Mänd",{"$f":"VLOOKUP(P_ostja, o_tab, 2, 0)","v":"Harju"},"saar",1,"Põder",49,{"$f":"VLOOKUP(P_liik, P_hinnad, P_sort+1, 0)","v":85},{"$f":"P_hind * P_kogus","v":4165},{"$f":"MONTH(P_kuupäev)","v":2}]
[null,null,null,null,null,"saar Total",null,null,{"$f":"SUBTOTAL(9,I52:I52)","v":49},null,{"$f":"SUBTOTAL(9,K52:K52)","v":4165}]
[null,null,null,"Mänd Total",null,null,null,null,{"$f":"SUBTOTAL(9,I35:I52)","v":598},null,{"$f":"SUBTOTAL(9,K35:K52)","v":38298}]
[null,"P247","2013-10-25","Tuvi",{"$f":"VLOOKUP(P_ostja, o_tab, 2, 0)","v":"Harju"},"haab",2,"Põder",10,{"$f":"VLOOKUP(P_liik, P_hinnad, P_sort+1, 0)","v":45},{"$f":"P_hind * P_kogus","v":450},{"$f":"MONTH(P_kuupäev)","v":10}]
[null,null,null,null,null,"haab Total",null,null,{"$f":"SUBTOTAL(9,I55:I55)","v":10},null,{"$f":"SUBTOTAL(9,K55:K55)","v":450}]
[null,"P273","2013-12-01","Tuvi",{"$f":"VLOOKUP(P_ostja, o_tab, 2, 0)","v":"Harju"},"kask",2,"Karu",48,{"$f":"VLOOKUP(P_liik, P_hinnad, P_sort+1, 0)","v":63},{"$f":"P_hind * P_kogus","v":3024},{"$f":"MONTH(P_kuupäev)","v":12}]
[null,null,null,null,null,"kask Total",null,null,{"$f":"SUBTOTAL(9,I57:I57)","v":48},null,{"$f":"SUBTOTAL(9,K57:K57)","v":3024}]
[null,"P242","2013-10-21","Tuvi",{"$f":"VLOOKUP(P_ostja, o_tab, 2, 0)","v":"Harju"},"kuusk",1,"Karu",24,{"$f":"VLOOKUP(P_liik, P_hinnad, P_sort+1, 0)","v":80},{"$f":"P_hind * P_kogus","v":1920},{"$f":"MONTH(P_kuupäev)","v":10}]
[null,"P247","2013-10-25","Tuvi",{"$f":"VLOOKUP(P_ostja, o_tab, 2, 0)","v":"Harju"},"kuusk",1,"Põder",39,{"$f":"VLOOKUP(P_liik, P_hinnad, P_sort+1, 0)","v":80},{"$f":"P_hind * P_kogus","v":3120},{"$f":"MONTH(P_kuupäev)","v":10}]
[null,"P283","2013-12-12","Tuvi",{"$f":"VLOOKUP(P_ostja, o_tab, 2, 0)","v":"Harju"},"kuusk",1,"Karu",63,{"$f":"VLOOKUP(P_liik, P_hinnad, P_sort+1, 0)","v":80},{"$f":"P_hind * P_kogus","v":5040},{"$f":"MONTH(P_kuupäev)","v":12}]
[null,"P284","2013-12-13","Tuvi",{"$f":"VLOOKUP(P_ostja, o_tab, 2, 0)","v":"Harju"},"kuusk",1,"Hunt",26,{"$f":"VLOOKUP(P_liik, P_hinnad, P_sort+1, 0)","v":80},{"$f":"P_hind * P_kogus","v":2080},{"$f":"MONTH(P_kuupäev)","v":12}]
[null,null,null,null,null,"kuusk Total",null,null,{"$f":"SUBTOTAL(9,I59:I62)","v":152},null,{"$f":"SUBTOTAL(9,K59:K62)","v":12160}]
[null,"P027","2013-01-30","Tuvi",{"$f":"VLOOKUP(P_ostja, o_tab, 2, 0)","v":"Harju"},"küte",1,"Siil",27,{"$f":"VLOOKUP(P_liik, P_hinnad, P_sort+1, 0)","v":47},{"$f":"P_hind * P_kogus","v":1269},{"$f":"MONTH(P_kuupäev)","v":1}]
[null,"P166","2013-07-23","Tuvi",{"$f":"VLOOKUP(P_ostja, o_tab, 2, 0)","v":"Harju"},"küte",1,"Põder",17,{"$f":"VLOOKUP(P_liik, P_hinnad, P_sort+1, 0)","v":47},{"$f":"P_hind * P_kogus","v":799},{"$f":"MONTH(P_kuupäev)","v":7}]
[null,null,null,null,null,"küte Total",null,null,{"$f":"SUBTOTAL(9,I64:I65)","v":44},null,{"$f":"SUBTOTAL(9,K64:K65)","v":2068}]
[null,"P094","2013-04-20","Tuvi",{"$f":"VLOOKUP(P_ostja, o_tab, 2, 0)","v":"Harju"},"lepp",1,"Hunt",30,{"$f":"VLOOKUP(P_liik, P_hinnad, P_sort+1, 0)","v":65},{"$f":"P_hind * P_kogus","v":1950},{"$f":"MONTH(P_kuupäev)","v":4}]
[null,"P129","2013-05-26","Tuvi",{"$f":"VLOOKUP(P_ostja, o_tab, 2, 0)","v":"Harju"},"lepp",1,"Siil",24,{"$f":"VLOOKUP(P_liik, P_hinnad, P_sort+1, 0)","v":65},{"$f":"P_hind * P_kogus","v":1560},{"$f":"MONTH(P_kuupäev)","v":5}]
[null,null,null,null,null,"lepp Total",null,null,{"$f":"SUBTOTAL(9,I67:I68)","v":54},null,{"$f":"SUBTOTAL(9,K67:K68)","v":3510}]
[null,"P094","2013-04-20","Tuvi",{"$f":"VLOOKUP(P_ostja, o_tab, 2, 0)","v":"Harju"},"mänd",2,"Hunt",53,{"$f":"VLOOKUP(P_liik, P_hinnad, P_sort+1, 0)","v":68},{"$f":"P_hind * P_kogus","v":3604},{"$f":"MONTH(P_kuupäev)","v":4}]
[null,"P163","2013-07-18","Tuvi",{"$f":"VLOOKUP(P_ostja, o_tab, 2, 0)","v":"Harju"},"mänd",3,"Rebane",36,{"$f":"VLOOKUP(P_liik, P_hinnad, P_sort+1, 0)","v":60},{"$f":"P_hind * P_kogus","v":2160},{"$f":"MONTH(P_kuupäev)","v":7}]
[null,"P166","2013-07-23","Tuvi",{"$f":"VLOOKUP(P_ostja, o_tab, 2, 0)","v":"Harju"},"mänd",1,"Põder",74,{"$f":"VLOOKUP(P_liik, P_hinnad, P_sort+1, 0)","v":75},{"$f":"P_hind * P_kogus","v":5550},{"$f":"MONTH(P_kuupäev)","v":7}]
[null,"P242","2013-10-21","Tuvi",{"$f":"VLOOKUP(P_ostja, o_tab, 2, 0)","v":"Harju"},"mänd",3,"Karu",60,{"$f":"VLOOKUP(P_liik, P_hinnad, P_sort+1, 0)","v":60},{"$f":"P_hind * P_kogus","v":3600},{"$f":"MONTH(P_kuupäev)","v":10}]
[null,null,null,null,null,"mänd Total",null,null,{"$f":"SUBTOTAL(9,I70:I73)","v":223},null,{"$f":"SUBTOTAL(9,K70:K73)","v":14914}]
[null,"P066","2013-03-22","Tuvi",{"$f":"VLOOKUP(P_ostja, o_tab, 2, 0)","v":"Harju"},"saar",1,"Karu",67,{"$f":"VLOOKUP(P_liik, P_hinnad, P_sort+1, 0)","v":85},{"$f":"P_hind * P_kogus","v":5695},{"$f":"MONTH(P_kuupäev)","v":3}]
[null,"P066","2013-03-22","Tuvi",{"$f":"VLOOKUP(P_ostja, o_tab, 2, 0)","v":"Harju"},"saar",1,"Karu",52,{"$f":"VLOOKUP(P_liik, P_hinnad, P_sort+1, 0)","v":85},{"$f":"P_hind * P_kogus","v":4420},{"$f":"MONTH(P_kuupäev)","v":3}]
[null,"P163","2013-07-18","Tuvi",{"$f":"VLOOKUP(P_ostja, o_tab, 2, 0)","v":"Harju"},"saar",2,"Rebane",12,{"$f":"VLOOKUP(P_liik, P_hinnad, P_sort+1, 0)","v":77},{"$f":"P_hind * P_kogus","v":924},{"$f":"MONTH(P_kuupäev)","v":7}]
[null,null,null,null,null,"saar Total",null,null,{"$f":"SUBTOTAL(9,I75:I77)","v":131},null,{"$f":"SUBTOTAL(9,K75:K77)","v":11039}]
[null,"P284","2013-12-13","Tuvi",{"$f":"VLOOKUP(P_ostja, o_tab, 2, 0)","v":"Harju"},"tamm",2,"Hunt",18,{"$f":"VLOOKUP(P_liik, P_hinnad, P_sort+1, 0)","v":99},{"$f":"P_hind * P_kogus","v":1782},{"$f":"MONTH(P_kuupäev)","v":12}]
[null,null,null,null,null,"tamm Total",null,null,{"$f":"SUBTOTAL(9,I79:I79)","v":18},null,{"$f":"SUBTOTAL(9,K79:K79)","v":1782}]
[null,null,null,"Tuvi Total",null,null,null,null,{"$f":"SUBTOTAL(9,I55:I79)","v":680},null,{"$f":"SUBTOTAL(9,K55:K79)","v":48947}]
[null,"P015","2013-01-16","Varblane",{"$f":"VLOOKUP(P_ostja, o_tab, 2, 0)","v":"Harju"},"haab",3,"Hunt",17,{"$f":"VLOOKUP(P_liik, P_hinnad, P_sort+1, 0)","v":40},{"$f":"P_hind * P_kogus","v":680},{"$f":"MONTH(P_kuupäev)","v":1}]
[null,"P059","2013-03-12","Varblane",{"$f":"VLOOKUP(P_ostja, o_tab, 2, 0)","v":"Harju"},"haab",2,"Põder",75,{"$f":"VLOOKUP(P_liik, P_hinnad, P_sort+1, 0)","v":45},{"$f":"P_hind * P_kogus","v":3375},{"$f":"MONTH(P_kuupäev)","v":3}]
[null,"P062","2013-03-18","Varblane",{"$f":"VLOOKUP(P_ostja, o_tab, 2, 0)","v":"Harju"},"haab",2,"Jänes",49,{"$f":"VLOOKUP(P_liik, P_hinnad, P_sort+1, 0)","v":45},{"$f":"P_hind * P_kogus","v":2205},{"$f":"MONTH(P_kuupäev)","v":3}]
[null,"P062","2013-03-18","Varblane",{"$f":"VLOOKUP(P_ostja, o_tab, 2, 0)","v":"Harju"},"haab",1,"Jänes",36,{"$f":"VLOOKUP(P_liik, P_hinnad, P_sort+1, 0)","v":50},{"$f":"P_hind * P_kogus","v":1800},{"$f":"MONTH(P_kuupäev)","v":3}]
[null,"P083","2013-04-10","Varblane",{"$f":"VLOOKUP(P_ostja, o_tab, 2, 0)","v":"Harju"},"haab",1,"Rebane",30,{"$f":"VLOOKUP(P_liik, P_hinnad, P_sort+1, 0)","v":50},{"$f":"P_hind * P_kogus","v":1500},{"$f":"MONTH(P_kuupäev)","v":4}]
[null,"P200","2013-08-31","Varblane",{"$f":"VLOOKUP(P_ostja, o_tab, 2, 0)","v":"Harju"},"haab",1,"Rebane",25,{"$f":"VLOOKUP(P_liik, P_hinnad, P_sort+1, 0)","v":50},{"$f":"P_hind * P_kogus","v":1250},{"$f":"MONTH(P_kuupäev)","v":8}]
[null,"P218","2013-09-24","Varblane",{"$f":"VLOOKUP(P_ostja, o_tab, 2, 0)","v":"Harju"},"haab",2,"Rebane",58,{"$f":"VLOOKUP(P_liik, P_hinnad, P_sort+1, 0)","v":45},{"$f":"P_hind * P_kogus","v":2610},{"$f":"MONTH(P_kuupäev)","v":9}]
[null,"P254","2013-11-01","Varblane",{"$f":"VLOOKUP(P_ostja, o_tab, 2, 0)","v":"Harju"},"haab",1,"Jänes",26,{"$f":"VLOOKUP(P_liik, P_hinnad, P_sort+1, 0)","v":50},{"$f":"P_hind * P_kogus","v":1300},{"$f":"MONTH(P_kuupäev)","v":11}]
[null,null,null,null,null,"haab Total",null,null,{"$f":"SUBTOTAL(9,I82:I89)","v":316},null,{"$f":"SUBTOTAL(9,K82:K89)","v":14720}]
[null,"P046","2013-02-27","Varblane",{"$f":"VLOOKUP(P_ostja, o_tab, 2, 0)","v":"Harju"},"kask",1,"Rebane",34,{"$f":"VLOOKUP(P_liik, P_hinnad, P_sort+1, 0)","v":70},{"$f":"P_hind * P_kogus","v":2380},{"$f":"MONTH(P_kuupäev)","v":2}]
[null,"P049","2013-03-01","Varblane",{"$f":"VLOOKUP(P_ostja, o_tab, 2, 0)","v":"Harju"},"kask",1,"Siil",73,{"$f":"VLOOKUP(P_liik, P_hinnad, P_sort+1, 0)","v":70},{"$f":"P_hind * P_kogus","v":5110},{"$f":"MONTH(P_kuupäev)","v":3}]
[null,"P232","2013-10-11","Varblane",{"$f":"VLOOKUP(P_ostja, o_tab, 2, 0)","v":"Harju"},"kask",3,"Põder",71,{"$f":"VLOOKUP(P_liik, P_hinnad, P_sort+1, 0)","v":56},{"$f":"P_hind * P_kogus","v":3976},{"$f":"MONTH(P_kuupäev)","v":10}]
[null,"P254","2013-11-01","Varblane",{"$f":"VLOOKUP(P_ostja, o_tab, 2, 0)","v":"Harju"},"kask",3,"Jänes",52,{"$f":"VLOOKUP(P_liik, P_hinnad, P_sort+1, 0)","v":56},{"$f":"P_hind * P_kogus","v":2912},{"$f":"MONTH(P_kuupäev)","v":11}]
[null,null,null,null,null,"kask Total",null,null,{"$f":"SUBTOTAL(9,I91:I94)","v":230},null,{"$f":"SUBTOTAL(9,K91:K94)","v":14378}]
[null,"P104","2013-04-30","Varblane",{"$f":"VLOOKUP(P_ostja, o_tab, 2, 0)","v":"Harju"},"kuusk",2,"Ilves",54,{"$f":"VLOOKUP(P_liik, P_hinnad, P_sort+1, 0)","v":72},{"$f":"P_hind * P_kogus","v":3888},{"$f":"MONTH(P_kuupäev)","v":4}]
[null,"P218","2013-09-24","Varblane",{"$f":"VLOOKUP(P_ostja, o_tab, 2, 0)","v":"Harju"},"kuusk",1,"Rebane",53,{"$f":"VLOOKUP(P_liik, P_hinnad, P_sort+1, 0)","v":80},{"$f":"P_hind * P_kogus","v":4240},{"$f":"MONTH(P_kuupäev)","v":9}]
[null,null,null,null,null,"kuusk Total",null,null,{"$f":"SUBTOTAL(9,I96:I97)","v":107},null,{"$f":"SUBTOTAL(9,K96:K97)","v":8128}]
[null,"P218","2013-09-24","Varblane",{"$f":"VLOOKUP(P_ostja, o_tab, 2, 0)","v":"Harju"},"küte",3,"Rebane",77,{"$f":"VLOOKUP(P_liik, P_hinnad, P_sort+1, 0)","v":38},{"$f":"P_hind * P_kogus","v":2926},{"$f":"MONTH(P_kuupäev)","v":9}]
[null,null,null,null,null,"küte Total",null,null,{"$f":"SUBTOTAL(9,I99:I99)","v":77},null,{"$f":"SUBTOTAL(9,K99:K99)","v":2926}]
[null,"P060","2013-03-13","Varblane",{"$f":"VLOOKUP(P_ostja, o_tab, 2, 0)","v":"Harju"},"lepp",2,"Karu",46,{"$f":"VLOOKUP(P_liik, P_hinnad, P_sort+1, 0)","v":59},{"$f":"P_hind * P_kogus","v":2714},{"$f":"MONTH(P_kuupäev)","v":3}]
[null,"P214","2013-09-21","Varblane",{"$f":"VLOOKUP(P_ostja, o_tab, 2, 0)","v":"Harju"},"lepp",1,"Jänes",58,{"$f":"VLOOKUP(P_liik, P_hinnad, P_sort+1, 0)","v":65},{"$f":"P_hind * P_kogus","v":3770},{"$f":"MONTH(P_kuupäev)","v":9}]
[null,"P274","2013-12-01","Varblane",{"$f":"VLOOKUP(P_ostja, o_tab, 2, 0)","v":"Harju"},"lepp",1,"Siil",67,{"$f":"VLOOKUP(P_liik, P_hinnad, P_sort+1, 0)","v":65},{"$f":"P_hind * P_kogus","v":4355},{"$f":"MONTH(P_kuupäev)","v":12}]
[null,null,null,null,null,"lepp Total",null,null,{"$f":"SUBTOTAL(9,I101:I103)","v":171},null,{"$f":"SUBTOTAL(9,K101:K103)","v":10839}]
[null,"P087","2013-04-15","Varblane",{"$f":"VLOOKUP(P_ostja, o_tab, 2, 0)","v":"Harju"},"mänd",1,"Hunt",69,{"$f":"VLOOKUP(P_liik, P_hinnad, P_sort+1, 0)","v":75},{"$f":"P_hind * P_kogus","v":5175},{"$f":"MONTH(P_kuupäev)","v":4}]
[null,"P104","2013-04-30","Varblane",{"$f":"VLOOKUP(P_ostja, o_tab, 2, 0)","v":"Harju"},"mänd",1,"Ilves",25,{"$f":"VLOOKUP(P_liik, P_hinnad, P_sort+1, 0)","v":75},{"$f":"P_hind * P_kogus","v":1875},{"$f":"MONTH(P_kuupäev)","v":4}]
[null,"P172","2013-07-30","Varblane",{"$f":"VLOOKUP(P_ostja, o_tab, 2, 0)","v":"Harju"},"mänd",2,"Hunt",73,{"$f":"VLOOKUP(P_liik, P_hinnad, P_sort+1, 0)","v":68},{"$f":"P_hind * P_kogus","v":4964},{"$f":"MONTH(P_kuupäev)","v":7}]
[null,null,null,null,null,"mänd Total",null,null,{"$f":"SUBTOTAL(9,I105:I107)","v":167},null,{"$f":"SUBTOTAL(9,K105:K107)","v":12014}]
[null,"P015","2013-01-16","Varblane",{"$f":"VLOOKUP(P_ostja, o_tab, 2, 0)","v":"Harju"},"saar",1,"Hunt",40,{"$f":"VLOOKUP(P_liik, P_hinnad, P_sort+1, 0)","v":85},{"$f":"P_hind * P_kogus","v":3400},{"$f":"MONTH(P_kuupäev)","v":1}]
[null,"P083","2013-04-10","Varblane",{"$f":"VLOOKUP(P_ostja, o_tab, 2, 0)","v":"Harju"},"saar",1,"Rebane",36,{"$f":"VLOOKUP(P_liik, P_hinnad, P_sort+1, 0)","v":85},{"$f":"P_hind * P_kogus","v":3060},{"$f":"MONTH(P_kuupäev)","v":4}]
[null,"P102","2013-04-28","Varblane",{"$f":"VLOOKUP(P_ostja, o_tab, 2, 0)","v":"Harju"},"saar",2,"Põder",48,{"$f":"VLOOKUP(P_liik, P_hinnad, P_sort+1, 0)","v":77},{"$f":"P_hind * P_kogus","v":3696},{"$f":"MONTH(P_kuupäev)","v":4}]
[null,null,null,null,null,"saar Total",null,null,{"$f":"SUBTOTAL(9,I109:I111)","v":124},null,{"$f":"SUBTOTAL(9,K109:K111)","v":10156}]
[null,"P200","2013-08-31","Varblane",{"$f":"VLOOKUP(P_ostja, o_tab, 2, 0)","v":"Harju"},"tamm",1,"Rebane",36,{"$f":"VLOOKUP(P_liik, P_hinnad, P_sort+1, 0)","v":110},{"$f":"P_hind * P_kogus","v":3960},{"$f":"MONTH(P_kuupäev)","v":8}]
[null,null,null,null,null,"tamm Total",null,null,{"$f":"SUBTOTAL(9,I113:I113)","v":36},null,{"$f":"SUBTOTAL(9,K113:K113)","v":3960}]
[null,"P015","2013-01-16","Varblane",{"$f":"VLOOKUP(P_ostja, o_tab, 2, 0)","v":"Harju"},"vaher",1,"Hunt",27,{"$f":"VLOOKUP(P_liik, P_hinnad, P_sort+1, 0)","v":95},{"$f":"P_hind * P_kogus","v":2565},{"$f":"MONTH(P_kuupäev)","v":1}]
[null,"P062","2013-03-18","Varblane",{"$f":"VLOOKUP(P_ostja, o_tab, 2, 0)","v":"Harju"},"vaher",1,"Jänes",27,{"$f":"VLOOKUP(P_liik, P_hinnad, P_sort+1, 0)","v":95},{"$f":"P_hind * P_kogus","v":2565},{"$f":"MONTH(P_kuupäev)","v":3}]
[null,null,null,null,null,"vaher Total",null,null,{"$f":"SUBTOTAL(9,I115:I116)","v":54},null,{"$f":"SUBTOTAL(9,K115:K116)","v":5130}]
[null,null,null,"Varblane Total",null,null,null,null,{"$f":"SUBTOTAL(9,I82:I116)","v":1282},null,{"$f":"SUBTOTAL(9,K82:K116)","v":82251}]
[null,null,null,null,"Harju Total",null,null,null,{"$f":"SUBTOTAL(9,I9:I116)","v":3237},null,{"$f":"SUBTOTAL(9,K9:K116)","v":216464}]
[null,"P057","2013-03-08","Ilves",{"$f":"VLOOKUP(P_ostja, o_tab, 2, 0)","v":"Lääne"},"haab",1,"Siil",13,{"$f":"VLOOKUP(P_liik, P_hinnad, P_sort+1, 0)","v":50},{"$f":"P_hind * P_kogus","v":650},{"$f":"MONTH(P_kuupäev)","v":3}]
[null,"P250","2013-10-28","Ilves",{"$f":"VLOOKUP(P_ostja, o_tab, 2, 0)","v":"Lääne"},"haab",3,"Hunt",59,{"$f":"VLOOKUP(P_liik, P_hinnad, P_sort+1, 0)","v":40},{"$f":"P_hind * P_kogus","v":2360},{"$f":"MONTH(P_kuupäev)","v":10}]
[null,"P269","2013-11-27","Ilves",{"$f":"VLOOKUP(P_ostja, o_tab, 2, 0)","v":"Lääne"},"haab",3,"Karu",23,{"$f":"VLOOKUP(P_liik, P_hinnad, P_sort+1, 0)","v":40},{"$f":"P_hind * P_kogus","v":920},{"$f":"MONTH(P_kuupäev)","v":11}]
[null,null,null,null,null,"haab Total",null,null,{"$f":"SUBTOTAL(9,I120:I122)","v":95},null,{"$f":"SUBTOTAL(9,K120:K122)","v":3930}]
[null,"P016","2013-01-17","Ilves",{"$f":"VLOOKUP(P_ostja, o_tab, 2, 0)","v":"Lääne"},"kask",1,"Hunt",13,{"$f":"VLOOKUP(P_liik, P_hinnad, P_sort+1, 0)","v":70},{"$f":"P_hind * P_kogus","v":910},{"$f":"MONTH(P_kuupäev)","v":1}]
[null,"P245","2013-10-23","Ilves",{"$f":"VLOOKUP(P_ostja, o_tab, 2, 0)","v":"Lääne"},"kask",1,"Karu",47,{"$f":"VLOOKUP(P_liik, P_hinnad, P_sort+1, 0)","v":70},{"$f":"P_hind * P_kogus","v":3290},{"$f":"MONTH(P_kuupäev)","v":10}]
[null,"P261","2013-11-13","Ilves",{"$f":"VLOOKUP(P_ostja, o_tab, 2, 0)","v":"Lääne"},"kask",3,"Rebane",68,{"$f":"VLOOKUP(P_liik, P_hinnad, P_sort+1, 0)","v":56},{"$f":"P_hind * P_kogus","v":3808},{"$f":"MONTH(P_kuupäev)","v":11}]
[null,null,null,null,null,"kask Total",null,null,{"$f":"SUBTOTAL(9,I124:I126)","v":128},null,{"$f":"SUBTOTAL(9,K124:K126)","v":8008}]
[null,"P198","2013-08-29","Ilves",{"$f":"VLOOKUP(P_ostja, o_tab, 2, 0)","v":"Lääne"},"kuusk",3,"Karu",70,{"$f":"VLOOKUP(P_liik, P_hinnad, P_sort+1, 0)","v":64},{"$f":"P_hind * P_kogus","v":4480},{"$f":"MONTH(P_kuupäev)","v":8}]
[null,"P241","2013-10-20","Ilves",{"$f":"VLOOKUP(P_ostja, o_tab, 2, 0)","v":"Lääne"},"kuusk",2,"Siil",43,{"$f":"VLOOKUP(P_liik, P_hinnad, P_sort+1, 0)","v":72},{"$f":"P_hind * P_kogus","v":3096},{"$f":"MONTH(P_kuupäev)","v":10}]
[null,"P241","2013-10-20","Ilves",{"$f":"VLOOKUP(P_ostja, o_tab, 2, 0)","v":"Lääne"},"kuusk",2,"Siil",43,{"$f":"VLOOKUP(P_liik, P_hinnad, P_sort+1, 0)","v":72},{"$f":"P_hind * P_kogus","v":3096},{"$f":"MONTH(P_kuupäev)","v":10}]
[null,"P245","2013-10-23","Ilves",{"$f":"VLOOKUP(P_ostja, o_tab, 2, 0)","v":"Lääne"},"kuusk",3,"Karu",36,{"$f":"VLOOKUP(P_liik, P_hinnad, P_sort+1, 0)","v":64},{"$f":"P_hind * P_kogus","v":2304},{"$f":"MONTH(P_kuupäev)","v":10}]
[null,null,null,null,null,"kuusk Total",null,null,{"$f":"SUBTOTAL(9,I128:I131)","v":192},null,{"$f":"SUBTOTAL(9,K128:K131)","v":12976}]
[null,"P250","2013-10-28","Ilves",{"$f":"VLOOKUP(P_ostja, o_tab, 2, 0)","v":"Lääne"},"küte",1,"Hunt",56,{"$f":"VLOOKUP(P_liik, P_hinnad, P_sort+1, 0)","v":47},{"$f":"P_hind * P_kogus","v":2632},{"$f":"MONTH(P_kuupäev)","v":10}]
[null,"P267","2013-11-22","Ilves",{"$f":"VLOOKUP(P_ostja, o_tab, 2, 0)","v":"Lääne"},"küte",1,"Hunt",76,{"$f":"VLOOKUP(P_liik, P_hinnad, P_sort+1, 0)","v":47},{"$f":"P_hind * P_kogus","v":3572},{"$f":"MONTH(P_kuupäev)","v":11}]
[null,"P267","2013-11-22","Ilves",{"$f":"VLOOKUP(P_ostja, o_tab, 2, 0)","v":"Lääne"},"küte",2,"Hunt",13,{"$f":"VLOOKUP(P_liik, P_hinnad, P_sort+1, 0)","v":42},{"$f":"P_hind * P_kogus","v":546},{"$f":"MONTH(P_kuupäev)","v":11}]
[null,null,null,null,null,"küte Total",null,null,{"$f":"SUBTOTAL(9,I133:I135)","v":145},null,{"$f":"SUBTOTAL(9,K133:K135)","v":6750}]
[null,"P143","2013-06-15","Ilves",{"$f":"VLOOKUP(P_ostja, o_tab, 2, 0)","v":"Lääne"},"lepp",2,"Ilves",12,{"$f":"VLOOKUP(P_liik, P_hinnad, P_sort+1, 0)","v":59},{"$f":"P_hind * P_kogus","v":708},{"$f":"MONTH(P_kuupäev)","v":6}]
[null,"P182","2013-08-13","Ilves",{"$f":"VLOOKUP(P_ostja, o_tab, 2, 0)","v":"Lääne"},"lepp",1,"Karu",36,{"$f":"VLOOKUP(P_liik, P_hinnad, P_sort+1, 0)","v":65},{"$f":"P_hind * P_kogus","v":2340},{"$f":"MONTH(P_kuupäev)","v":8}]
[null,"P261","2013-11-13","Ilves",{"$f":"VLOOKUP(P_ostja, o_tab, 2, 0)","v":"Lääne"},"lepp",2,"Rebane",13,{"$f":"VLOOKUP(P_liik, P_hinnad, P_sort+1, 0)","v":59},{"$f":"P_hind * P_kogus","v":767},{"$f":"MONTH(P_kuupäev)","v":11}]
[null,"P267","2013-11-22","Ilves",{"$f":"VLOOKUP(P_ostja, o_tab, 2, 0)","v":"Lääne"},"lepp",1,"Hunt",79,{"$f":"VLOOKUP(P_liik, P_hinnad, P_sort+1, 0)","v":65},{"$f":"P_hind * P_kogus","v":5135},{"$f":"MONTH(P_kuupäev)","v":11}]
[null,null,null,null,null,"lepp Total",null,null,{"$f":"SUBTOTAL(9,I137:I140)","v":140},null,{"$f":"SUBTOTAL(9,K137:K140)","v":8950}]
[null,"P057","2013-03-08","Ilves",{"$f":"VLOOKUP(P_ostja, o_tab, 2, 0)","v":"Lääne"},"mänd",2,"Siil",22,{"$f":"VLOOKUP(P_liik, P_hinnad, P_sort+1, 0)","v":68},{"$f":"P_hind * P_kogus","v":1496},{"$f":"MONTH(P_kuupäev)","v":3}]
[null,"P143","2013-06-15","Ilves",{"$f":"VLOOKUP(P_ostja, o_tab, 2, 0)","v":"Lääne"},"mänd",2,"Ilves",72,{"$f":"VLOOKUP(P_liik, P_hinnad, P_sort+1, 0)","v":68},{"$f":"P_hind * P_kogus","v":4896},{"$f":"MONTH(P_kuupäev)","v":6}]
[null,"P152","2013-07-01","Ilves",{"$f":"VLOOKUP(P_ostja, o_tab, 2, 0)","v":"Lääne"},"mänd",1,"Ilves",15,{"$f":"VLOOKUP(P_liik, P_hinnad, P_sort+1, 0)","v":75},{"$f":"P_hind * P_kogus","v":1125},{"$f":"MONTH(P_kuupäev)","v":7}]
[null,null,null,null,null,"mänd Total",null,null,{"$f":"SUBTOTAL(9,I142:I144)","v":109},null,{"$f":"SUBTOTAL(9,K142:K144)","v":7517}]
[null,"P245","2013-10-23","Ilves",{"$f":"VLOOKUP(P_ostja, o_tab, 2, 0)","v":"Lääne"},"saar",3,"Karu",43,{"$f":"VLOOKUP(P_liik, P_hinnad, P_sort+1, 0)","v":68},{"$f":"P_hind * P_kogus","v":2924},{"$f":"MONTH(P_kuupäev)","v":10}]
[null,"P267","2013-11-22","Ilves",{"$f":"VLOOKUP(P_ostja, o_tab, 2, 0)","v":"Lääne"},"saar",1,"Hunt",34,{"$f":"VLOOKUP(P_liik, P_hinnad, P_sort+1, 0)","v":85},{"$f":"P_hind * P_kogus","v":2890},{"$f":"MONTH(P_kuupäev)","v":11}]
[null,"P269","2013-11-27","Ilves",{"$f":"VLOOKUP(P_ostja, o_tab, 2, 0)","v":"Lääne"},"saar",2,"Karu",32,{"$f":"VLOOKUP(P_liik, P_hinnad, P_sort+1, 0)","v":77},{"$f":"P_hind * P_kogus","v":2464},{"$f":"MONTH(P_kuupäev)","v":11}]
[null,null,null,null,null,"saar Total",null,null,{"$f":"SUBTOTAL(9,I146:I148)","v":109},null,{"$f":"SUBTOTAL(9,K146:K148)","v":8278}]
[null,"P016","2013-01-17","Ilves",{"$f":"VLOOKUP(P_ostja, o_tab, 2, 0)","v":"Lääne"},"tamm",2,"Hunt",31,{"$f":"VLOOKUP(P_liik, P_hinnad, P_sort+1, 0)","v":99},{"$f":"P_hind * P_kogus","v":3069},{"$f":"MONTH(P_kuupäev)","v":1}]
[null,null,null,null,null,"tamm Total",null,null,{"$f":"SUBTOTAL(9,I150:I150)","v":31},null,{"$f":"SUBTOTAL(9,K150:K150)","v":3069}]
[null,"P032","2013-02-03","Ilves",{"$f":"VLOOKUP(P_ostja, o_tab, 2, 0)","v":"Lääne"},"vaher",2,"Karu",26,{"$f":"VLOOKUP(P_liik, P_hinnad, P_sort+1, 0)","v":86},{"$f":"P_hind * P_kogus","v":2236},{"$f":"MONTH(P_kuupäev)","v":2}]
[null,"P207","2013-09-14","Ilves",{"$f":"VLOOKUP(P_ostja, o_tab, 2, 0)","v":"Lääne"},"vaher",3,"Rebane",10,{"$f":"VLOOKUP(P_liik, P_hinnad, P_sort+1, 0)","v":76},{"$f":"P_hind * P_kogus","v":760},{"$f":"MONTH(P_kuupäev)","v":9}]
[null,null,null,null,null,"vaher Total",null,null,{"$f":"SUBTOTAL(9,I152:I153)","v":36},null,{"$f":"SUBTOTAL(9,K152:K153)","v":2996}]
[null,null,null,"Ilves Total",null,null,null,null,{"$f":"SUBTOTAL(9,I120:I153)","v":985},null,{"$f":"SUBTOTAL(9,K120:K153)","v":62474}]
[null,"P139","2013-06-11","Karu",{"$f":"VLOOKUP(P_ostja, o_tab, 2, 0)","v":"Lääne"},"kask",1,"Põder",72,{"$f":"VLOOKUP(P_liik, P_hinnad, P_sort+1, 0)","v":70},{"$f":"P_hind * P_kogus","v":5040},{"$f":"MONTH(P_kuupäev)","v":6}]
[null,"P170","2013-07-28","Karu",{"$f":"VLOOKUP(P_ostja, o_tab, 2, 0)","v":"Lääne"},"kask",1,"Ilves",70,{"$f":"VLOOKUP(P_liik, P_hinnad, P_sort+1, 0)","v":70},{"$f":"P_hind * P_kogus","v":4900},{"$f":"MONTH(P_kuupäev)","v":7}]
[null,"P170","2013-07-28","Karu",{"$f":"VLOOKUP(P_ostja, o_tab, 2, 0)","v":"Lääne"},"kask",2,"Ilves",44,{"$f":"VLOOKUP(P_liik, P_hinnad, P_sort+1, 0)","v":63},{"$f":"P_hind * P_kogus","v":2772},{"$f":"MONTH(P_kuupäev)","v":7}]
[null,null,null,null,null,"kask Total",null,null,{"$f":"SUBTOTAL(9,I156:I158)","v":186},null,{"$f":"SUBTOTAL(9,K156:K158)","v":12712}]
[null,"P275","2013-12-01","Karu",{"$f":"VLOOKUP(P_ostja, o_tab, 2, 0)","v":"Lääne"},"kuusk",1,"Hunt",47,{"$f":"VLOOKUP(P_liik, P_hinnad, P_sort+1, 0)","v":80},{"$f":"P_hind * P_kogus","v":3760},{"$f":"MONTH(P_kuupäev)","v":12}]
[null,"P280","2013-12-09","Karu",{"$f":"VLOOKUP(P_ostja, o_tab, 2, 0)","v":"Lääne"},"kuusk",2,"Põder",33,{"$f":"VLOOKUP(P_liik, P_hinnad, P_sort+1, 0)","v":72},{"$f":"P_hind * P_kogus","v":2376},{"$f":"MONTH(P_kuupäev)","v":12}]
[null,null,null,null,null,"kuusk Total",null,null,{"$f":"SUBTOTAL(9,I160:I161)","v":80},null,{"$f":"SUBTOTAL(9,K160:K161)","v":6136}]
[null,"P004","2013-01-04","Karu",{"$f":"VLOOKUP(P_ostja, o_tab, 2, 0)","v":"Lääne"},"küte",1,"Siil",12,{"$f":"VLOOKUP(P_liik, P_hinnad, P_sort+1, 0)","v":47},{"$f":"P_hind * P_kogus","v":564},{"$f":"MONTH(P_kuupäev)","v":1}]
[null,"P010","2013-01-09","Karu",{"$f":"VLOOKUP(P_ostja, o_tab, 2, 0)","v":"Lääne"},"küte",2,"Hunt",6,{"$f":"VLOOKUP(P_liik, P_hinnad, P_sort+1, 0)","v":42},{"$f":"P_hind * P_kogus","v":252},{"$f":"MONTH(P_kuupäev)","v":1}]
[null,"P210","2013-09-17","Karu",{"$f":"VLOOKUP(P_ostja, o_tab, 2, 0)","v":"Lääne"},"küte",1,"Jänes",16,{"$f":"VLOOKUP(P_liik, P_hinnad, P_sort+1, 0)","v":47},{"$f":"P_hind * P_kogus","v":752},{"$f":"MONTH(P_kuupäev)","v":9}]
[null,"P275","2013-12-01","Karu",{"$f":"VLOOKUP(P_ostja, o_tab, 2, 0)","v":"Lääne"},"küte",2,"Hunt",17,{"$f":"VLOOKUP(P_liik, P_hinnad, P_sort+1, 0)","v":42},{"$f":"P_hind * P_kogus","v":714},{"$f":"MONTH(P_kuupäev)","v":12}]
[null,null,null,null,null,"küte Total",null,null,{"$f":"SUBTOTAL(9,I163:I166)","v":51},null,{"$f":"SUBTOTAL(9,K163:K166)","v":2282}]
[null,"P098","2013-04-25","Karu",{"$f":"VLOOKUP(P_ostja, o_tab, 2, 0)","v":"Lääne"},"lepp",2,"Siil",65,{"$f":"VLOOKUP(P_liik, P_hinnad, P_sort+1, 0)","v":59},{"$f":"P_hind * P_kogus","v":3835},{"$f":"MONTH(P_kuupäev)","v":4}]
[null,"P139","2013-06-11","Karu",{"$f":"VLOOKUP(P_ostja, o_tab, 2, 0)","v":"Lääne"},"lepp",2,"Põder",9,{"$f":"VLOOKUP(P_liik, P_hinnad, P_sort+1, 0)","v":59},{"$f":"P_hind * P_kogus","v":531},{"$f":"MONTH(P_kuupäev)","v":6}]
[null,"P186","2013-08-19","Karu",{"$f":"VLOOKUP(P_ostja, o_tab, 2, 0)","v":"Lääne"},"lepp",1,"Rebane",67,{"$f":"VLOOKUP(P_liik, P_hinnad, P_sort+1, 0)","v":65},{"$f":"P_hind * P_kogus","v":4355},{"$f":"MONTH(P_kuupäev)","v":8}]
[null,"P239","2013-10-18","Karu",{"$f":"VLOOKUP(P_ostja, o_tab, 2, 0)","v":"Lääne"},"lepp",2,"Ilves",37,{"$f":"VLOOKUP(P_liik, P_hinnad, P_sort+1, 0)","v":59},{"$f":"P_hind * P_kogus","v":2183},{"$f":"MONTH(P_kuupäev)","v":10}]
[null,"P275","2013-12-01","Karu",{"$f":"VLOOKUP(P_ostja, o_tab, 2, 0)","v":"Lääne"},"lepp",2,"Hunt",8,{"$f":"VLOOKUP(P_liik, P_hinnad, P_sort+1, 0)","v":59},{"$f":"P_hind * P_kogus","v":472},{"$f":"MONTH(P_kuupäev)","v":12}]
[null,"P286","2013-12-20","Karu",{"$f":"VLOOKUP(P_ostja, o_tab, 2, 0)","v":"Lääne"},"lepp",1,"Karu",26,{"$f":"VLOOKUP(P_liik, P_hinnad, P_sort+1, 0)","v":65},{"$f":"P_hind * P_kogus","v":1690},{"$f":"MONTH(P_kuupäev)","v":12}]
[null,null,null,null,null,"lepp Total",null,null,{"$f":"SUBTOTAL(9,I168:I173)","v":212},null,{"$f":"SUBTOTAL(9,K168:K173)","v":13066}]
[null,"P010","2013-01-09","Karu",{"$f":"VLOOKUP(P_ostja, o_tab, 2, 0)","v":"Lääne"},"mänd",1,"Hunt",55,{"$f":"VLOOKUP(P_liik, P_hinnad, P_sort+1, 0)","v":75},{"$f":"P_hind * P_kogus","v":4125},{"$f":"MONTH(P_kuupäev)","v":1}]
[null,"P010","2013-01-09","Karu",{"$f":"VLOOKUP(P_ostja, o_tab, 2, 0)","v":"Lääne"},"mänd",2,"Hunt",39,{"$f":"VLOOKUP(P_liik, P_hinnad, P_sort+1, 0)","v":68},{"$f":"P_hind * P_kogus","v":2652},{"$f":"MONTH(P_kuupäev)","v":1}]
[null,"P031","2013-02-02","Karu",{"$f":"VLOOKUP(P_ostja, o_tab, 2, 0)","v":"Lääne"},"mänd",1,"Jänes",53,{"$f":"VLOOKUP(P_liik, P_hinnad, P_sort+1, 0)","v":75},{"$f":"P_hind * P_kogus","v":3975},{"$f":"MONTH(P_kuupäev)","v":2}]
[null,"P213","2013-09-21","Karu",{"$f":"VLOOKUP(P_ostja, o_tab, 2, 0)","v":"Lääne"},"mänd",2,"Rebane",59,{"$f":"VLOOKUP(P_liik, P_hinnad, P_sort+1, 0)","v":68},{"$f":"P_hind * P_kogus","v":4012},{"$f":"MONTH(P_kuupäev)","v":9}]
[null,"P213","2013-09-21","Karu",{"$f":"VLOOKUP(P_ostja, o_tab, 2, 0)","v":"Lääne"},"mänd",2,"Rebane",24,{"$f":"VLOOKUP(P_liik, P_hinnad, P_sort+1, 0)","v":68},{"$f":"P_hind * P_kogus","v":1632},{"$f":"MONTH(P_kuupäev)","v":9}]
[null,null,null,null,null,"mänd Total",null,null,{"$f":"SUBTOTAL(9,I175:I179)","v":230},null,{"$f":"SUBTOTAL(9,K175:K179)","v":16396}]
[null,"P213","2013-09-21","Karu",{"$f":"VLOOKUP(P_ostja, o_tab, 2, 0)","v":"Lääne"},"saar",3,"Rebane",59,{"$f":"VLOOKUP(P_liik, P_hinnad, P_sort+1, 0)","v":68},{"$f":"P_hind * P_kogus","v":4012},{"$f":"MONTH(P_kuupäev)","v":9}]
[null,"P228","2013-10-07","Karu",{"$f":"VLOOKUP(P_ostja, o_tab, 2, 0)","v":"Lääne"},"saar",1,"Jänes",12,{"$f":"VLOOKUP(P_liik, P_hinnad, P_sort+1, 0)","v":85},{"$f":"P_hind * P_kogus","v":1020},{"$f":"MONTH(P_kuupäev)","v":10}]
[null,null,null,null,null,"saar Total",null,null,{"$f":"SUBTOTAL(9,I181:I182)","v":71},null,{"$f":"SUBTOTAL(9,K181:K182)","v":5032}]
[null,"P170","2013-07-28","Karu",{"$f":"VLOOKUP(P_ostja, o_tab, 2, 0)","v":"Lääne"},"tamm",1,"Ilves",19,{"$f":"VLOOKUP(P_liik, P_hinnad, P_sort+1, 0)","v":110},{"$f":"P_hind * P_kogus","v":2090},{"$f":"MONTH(P_kuupäev)","v":7}]
[null,null,null,null,null,"tamm Total",null,null,{"$f":"SUBTOTAL(9,I184:I184)","v":19},null,{"$f":"SUBTOTAL(9,K184:K184)","v":2090}]
[null,"P004","2013-01-04","Karu",{"$f":"VLOOKUP(P_ostja, o_tab, 2, 0)","v":"Lääne"},"vaher",1,"Siil",39,{"$f":"VLOOKUP(P_liik, P_hinnad, P_sort+1, 0)","v":95},{"$f":"P_hind * P_kogus","v":3705},{"$f":"MONTH(P_kuupäev)","v":1}]
[null,null,null,null,null,"vaher Total",null,null,{"$f":"SUBTOTAL(9,I186:I186)","v":39},null,{"$f":"SUBTOTAL(9,K186:K186)","v":3705}]
[null,null,null,"Karu Total",null,null,null,null,{"$f":"SUBTOTAL(9,I156:I186)","v":888},null,{"$f":"SUBTOTAL(9,K156:K186)","v":61419}]
[null,"P281","2013-12-10","Kuusk",{"$f":"VLOOKUP(P_ostja, o_tab, 2, 0)","v":"Lääne"},"haab",1,"Karu",34,{"$f":"VLOOKUP(P_liik, P_hinnad, P_sort+1, 0)","v":50},{"$f":"P_hind * P_kogus","v":1700},{"$f":"MONTH(P_kuupäev)","v":12}]
[null,null,null,null,null,"haab Total",null,null,{"$f":"SUBTOTAL(9,I189:I189)","v":34},null,{"$f":"SUBTOTAL(9,K189:K189)","v":1700}]
[null,"P092","2013-04-19","Kuusk",{"$f":"VLOOKUP(P_ostja, o_tab, 2, 0)","v":"Lääne"},"kask",1,"Jänes",51,{"$f":"VLOOKUP(P_liik, P_hinnad, P_sort+1, 0)","v":70},{"$f":"P_hind * P_kogus","v":3570},{"$f":"MONTH(P_kuupäev)","v":4}]
[null,"P227","2013-10-07","Kuusk",{"$f":"VLOOKUP(P_ostja, o_tab, 2, 0)","v":"Lääne"},"kask",1,"Ilves",51,{"$f":"VLOOKUP(P_liik, P_hinnad, P_sort+1, 0)","v":70},{"$f":"P_hind * P_kogus","v":3570},{"$f":"MONTH(P_kuupäev)","v":10}]
[null,"P262","2013-11-15","Kuusk",{"$f":"VLOOKUP(P_ostja, o_tab, 2, 0)","v":"Lääne"},"kask",1,"Siil",73,{"$f":"VLOOKUP(P_liik, P_hinnad, P_sort+1, 0)","v":70},{"$f":"P_hind * P_kogus","v":5110},{"$f":"MONTH(P_kuupäev)","v":11}]
[null,null,null,null,null,"kask Total",null,null,{"$f":"SUBTOTAL(9,I191:I193)","v":175},null,{"$f":"SUBTOTAL(9,K191:K193)","v":12250}]
[null,"P110","2013-05-06","Kuusk",{"$f":"VLOOKUP(P_ostja, o_tab, 2, 0)","v":"Lääne"},"küte",1,"Rebane",12,{"$f":"VLOOKUP(P_liik, P_hinnad, P_sort+1, 0)","v":47},{"$f":"P_hind * P_kogus","v":564},{"$f":"MONTH(P_kuupäev)","v":5}]
[null,"P281","2013-12-10","Kuusk",{"$f":"VLOOKUP(P_ostja, o_tab, 2, 0)","v":"Lääne"},"küte",1,"Karu",54,{"$f":"VLOOKUP(P_liik, P_hinnad, P_sort+1, 0)","v":47},{"$f":"P_hind * P_kogus","v":2538},{"$f":"MONTH(P_kuupäev)","v":12}]
[null,null,null,null,null,"küte Total",null,null,{"$f":"SUBTOTAL(9,I195:I196)","v":66},null,{"$f":"SUBTOTAL(9,K195:K196)","v":3102}]
[null,"P092","2013-04-19","Kuusk",{"$f":"VLOOKUP(P_ostja, o_tab, 2, 0)","v":"Lääne"},"lepp",2,"Jänes",52,{"$f":"VLOOKUP(P_liik, P_hinnad, P_sort+1, 0)","v":59},{"$f":"P_hind * P_kogus","v":3068},{"$f":"MONTH(P_kuupäev)","v":4}]
[null,"P141","2013-06-13","Kuusk",{"$f":"VLOOKUP(P_ostja, o_tab, 2, 0)","v":"Lääne"},"lepp",1,"Karu",46,{"$f":"VLOOKUP(P_liik, P_hinnad, P_sort+1, 0)","v":65},{"$f":"P_hind * P_kogus","v":2990},{"$f":"MONTH(P_kuupäev)","v":6}]
[null,null,null,null,null,"lepp Total",null,null,{"$f":"SUBTOTAL(9,I198:I199)","v":98},null,{"$f":"SUBTOTAL(9,K198:K199)","v":6058}]
[null,"P161","2013-07-13","Kuusk",{"$f":"VLOOKUP(P_ostja, o_tab, 2, 0)","v":"Lääne"},"mänd",1,"Jänes",11,{"$f":"VLOOKUP(P_liik, P_hinnad, P_sort+1, 0)","v":75},{"$f":"P_hind * P_kogus","v":825},{"$f":"MONTH(P_kuupäev)","v":7}]
[null,"P281","2013-12-10","Kuusk",{"$f":"VLOOKUP(P_ostja, o_tab, 2, 0)","v":"Lääne"},"mänd",1,"Karu",78,{"$f":"VLOOKUP(P_liik, P_hinnad, P_sort+1, 0)","v":75},{"$f":"P_hind * P_kogus","v":5850},{"$f":"MONTH(P_kuupäev)","v":12}]
[null,null,null,null,null,"mänd Total",null,null,{"$f":"SUBTOTAL(9,I201:I202)","v":89},null,{"$f":"SUBTOTAL(9,K201:K202)","v":6675}]
[null,"P090","2013-04-17","Kuusk",{"$f":"VLOOKUP(P_ostja, o_tab, 2, 0)","v":"Lääne"},"saar",3,"Rebane",41,{"$f":"VLOOKUP(P_liik, P_hinnad, P_sort+1, 0)","v":68},{"$f":"P_hind * P_kogus","v":2788},{"$f":"MONTH(P_kuupäev)","v":4}]
[null,"P262","2013-11-15","Kuusk",{"$f":"VLOOKUP(P_ostja, o_tab, 2, 0)","v":"Lääne"},"saar",1,"Siil",71,{"$f":"VLOOKUP(P_liik, P_hinnad, P_sort+1, 0)","v":85},{"$f":"P_hind * P_kogus","v":6035},{"$f":"MONTH(P_kuupäev)","v":11}]
[null,null,null,null,null,"saar Total",null,null,{"$f":"SUBTOTAL(9,I204:I205)","v":112},null,{"$f":"SUBTOTAL(9,K204:K205)","v":8823}]
[null,"P227","2013-10-07","Kuusk",{"$f":"VLOOKUP(P_ostja, o_tab, 2, 0)","v":"Lääne"},"vaher",1,"Ilves",61,{"$f":"VLOOKUP(P_liik, P_hinnad, P_sort+1, 0)","v":95},{"$f":"P_hind * P_kogus","v":5795},{"$f":"MONTH(P_kuupäev)","v":10}]
[null,null,null,null,null,"vaher Total",null,null,{"$f":"SUBTOTAL(9,I207:I207)","v":61},null,{"$f":"SUBTOTAL(9,K207:K207)","v":5795}]
[null,null,null,"Kuusk Total",null,null,null,null,{"$f":"SUBTOTAL(9,I189:I207)","v":635},null,{"$f":"SUBTOTAL(9,K189:K207)","v":44403}]
[null,null,null,null,"Lääne Total",null,null,null,{"$f":"SUBTOTAL(9,I120:I207)","v":2508},null,{"$f":"SUBTOTAL(9,K120:K207)","v":168296}]
[null,"P271","2013-11-29","Kass",{"$f":"VLOOKUP(P_ostja, o_tab, 2, 0)","v":"Paide"},"kuusk",3,"Ilves",60,{"$f":"VLOOKUP(P_liik, P_hinnad, P_sort+1, 0)","v":64},{"$f":"P_hind * P_kogus","v":3840},{"$f":"MONTH(P_kuupäev)","v":11}]
[null,null,null,null,null,"kuusk Total",null,null,{"$f":"SUBTOTAL(9,I211:I211)","v":60},null,{"$f":"SUBTOTAL(9,K211:K211)","v":3840}]
[null,"P178","2013-08-05","Kass",{"$f":"VLOOKUP(P_ostja, o_tab, 2, 0)","v":"Paide"},"mänd",1,"Jänes",48,{"$f":"VLOOKUP(P_liik, P_hinnad, P_sort+1, 0)","v":75},{"$f":"P_hind * P_kogus","v":3600},{"$f":"MONTH(P_kuupäev)","v":8}]
[null,"P243","2013-10-21","Kass",{"$f":"VLOOKUP(P_ostja, o_tab, 2, 0)","v":"Paide"},"mänd",1,"Ilves",62,{"$f":"VLOOKUP(P_liik, P_hinnad, P_sort+1, 0)","v":75},{"$f":"P_hind * P_kogus","v":4650},{"$f":"MONTH(P_kuupäev)","v":10}]
[null,"P243","2013-10-21","Kass",{"$f":"VLOOKUP(P_ostja, o_tab, 2, 0)","v":"Paide"},"mänd",3,"Ilves",62,{"$f":"VLOOKUP(P_liik, P_hinnad, P_sort+1, 0)","v":60},{"$f":"P_hind * P_kogus","v":3720},{"$f":"MONTH(P_kuupäev)","v":10}]
[null,"P246","2013-10-23","Kass",{"$f":"VLOOKUP(P_ostja, o_tab, 2, 0)","v":"Paide"},"mänd",1,"Jänes",26,{"$f":"VLOOKUP(P_liik, P_hinnad, P_sort+1, 0)","v":75},{"$f":"P_hind * P_kogus","v":1950},{"$f":"MONTH(P_kuupäev)","v":10}]
[null,null,null,null,null,"mänd Total",null,null,{"$f":"SUBTOTAL(9,I213:I216)","v":198},null,{"$f":"SUBTOTAL(9,K213:K216)","v":13920}]
[null,"P193","2013-08-25","Kass",{"$f":"VLOOKUP(P_ostja, o_tab, 2, 0)","v":"Paide"},"saar",2,"Hunt",16,{"$f":"VLOOKUP(P_liik, P_hinnad, P_sort+1, 0)","v":77},{"$f":"P_hind * P_kogus","v":1232},{"$f":"MONTH(P_kuupäev)","v":8}]
[null,"P271","2013-11-29","Kass",{"$f":"VLOOKUP(P_ostja, o_tab, 2, 0)","v":"Paide"},"saar",1,"Ilves",52,{"$f":"VLOOKUP(P_liik, P_hinnad, P_sort+1, 0)","v":85},{"$f":"P_hind * P_kogus","v":4420},{"$f":"MONTH(P_kuupäev)","v":11}]
[null,null,null,null,null,"saar Total",null,null,{"$f":"SUBTOTAL(9,I218:I219)","v":68},null,{"$f":"SUBTOTAL(9,K218:K219)","v":5652}]
[null,"P069","2013-03-24","Kass",{"$f":"VLOOKUP(P_ostja, o_tab, 2, 0)","v":"Paide"},"tamm",2,"Jänes",23,{"$f":"VLOOKUP(P_liik, P_hinnad, P_sort+1, 0)","v":99},{"$f":"P_hind * P_kogus","v":2277},{"$f":"MONTH(P_kuupäev)","v":3}]
[null,"P193","2013-08-25","Kass",{"$f":"VLOOKUP(P_ostja, o_tab, 2, 0)","v":"Paide"},"tamm",1,"Hunt",11,{"$f":"VLOOKUP(P_liik, P_hinnad, P_sort+1, 0)","v":110},{"$f":"P_hind * P_kogus","v":1210},{"$f":"MONTH(P_kuupäev)","v":8}]
[null,null,null,null,null,"tamm Total",null,null,{"$f":"SUBTOTAL(9,I221:I222)","v":34},null,{"$f":"SUBTOTAL(9,K221:K222)","v":3487}]
[null,"P229","2013-10-08","Kass",{"$f":"VLOOKUP(P_ostja, o_tab, 2, 0)","v":"Paide"},"vaher",2,"Siil",20,{"$f":"VLOOKUP(P_liik, P_hinnad, P_sort+1, 0)","v":86},{"$f":"P_hind * P_kogus","v":1720},{"$f":"MONTH(P_kuupäev)","v":10}]
[null,null,null,null,null,"vaher Total",null,null,{"$f":"SUBTOTAL(9,I224:I224)","v":20},null,{"$f":"SUBTOTAL(9,K224:K224)","v":1720}]
[null,null,null,"Kass Total",null,null,null,null,{"$f":"SUBTOTAL(9,I211:I224)","v":380},null,{"$f":"SUBTOTAL(9,K211:K224)","v":28619}]
[null,"P085","2013-04-14","Lepik",{"$f":"VLOOKUP(P_ostja, o_tab, 2, 0)","v":"Paide"},"haab",2,"Karu",75,{"$f":"VLOOKUP(P_liik, P_hinnad, P_sort+1, 0)","v":45},{"$f":"P_hind * P_kogus","v":3375},{"$f":"MONTH(P_kuupäev)","v":4}]
[null,null,null,null,null,"haab Total",null,null,{"$f":"SUBTOTAL(9,I227:I227)","v":75},null,{"$f":"SUBTOTAL(9,K227:K227)","v":3375}]
[null,"P039","2013-02-18","Lepik",{"$f":"VLOOKUP(P_ostja, o_tab, 2, 0)","v":"Paide"},"kask",3,"Hunt",62,{"$f":"VLOOKUP(P_liik, P_hinnad, P_sort+1, 0)","v":56},{"$f":"P_hind * P_kogus","v":3472},{"$f":"MONTH(P_kuupäev)","v":2}]
[null,null,null,null,null,"kask Total",null,null,{"$f":"SUBTOTAL(9,I229:I229)","v":62},null,{"$f":"SUBTOTAL(9,K229:K229)","v":3472}]
[null,"P195","2013-08-27","Lepik",{"$f":"VLOOKUP(P_ostja, o_tab, 2, 0)","v":"Paide"},"kuusk",1,"Hunt",20,{"$f":"VLOOKUP(P_liik, P_hinnad, P_sort+1, 0)","v":80},{"$f":"P_hind * P_kogus","v":1600},{"$f":"MONTH(P_kuupäev)","v":8}]
[null,null,null,null,null,"kuusk Total",null,null,{"$f":"SUBTOTAL(9,I231:I231)","v":20},null,{"$f":"SUBTOTAL(9,K231:K231)","v":1600}]
[null,"P012","2013-01-12","Lepik",{"$f":"VLOOKUP(P_ostja, o_tab, 2, 0)","v":"Paide"},"küte",1,"Jänes",71,{"$f":"VLOOKUP(P_liik, P_hinnad, P_sort+1, 0)","v":47},{"$f":"P_hind * P_kogus","v":3337},{"$f":"MONTH(P_kuupäev)","v":1}]
[null,"P122","2013-05-17","Lepik",{"$f":"VLOOKUP(P_ostja, o_tab, 2, 0)","v":"Paide"},"küte",3,"Ilves",13,{"$f":"VLOOKUP(P_liik, P_hinnad, P_sort+1, 0)","v":38},{"$f":"P_hind * P_kogus","v":494},{"$f":"MONTH(P_kuupäev)","v":5}]
[null,"P249","2013-10-27","Lepik",{"$f":"VLOOKUP(P_ostja, o_tab, 2, 0)","v":"Paide"},"küte",1,"Ilves",78,{"$f":"VLOOKUP(P_liik, P_hinnad, P_sort+1, 0)","v":47},{"$f":"P_hind * P_kogus","v":3666},{"$f":"MONTH(P_kuupäev)","v":10}]
[null,null,null,null,null,"küte Total",null,null,{"$f":"SUBTOTAL(9,I233:I235)","v":162},null,{"$f":"SUBTOTAL(9,K233:K235)","v":7497}]
[null,"P052","2013-03-02","Lepik",{"$f":"VLOOKUP(P_ostja, o_tab, 2, 0)","v":"Paide"},"lepp",3,"Ilves",65,{"$f":"VLOOKUP(P_liik, P_hinnad, P_sort+1, 0)","v":52},{"$f":"P_hind * P_kogus","v":3380},{"$f":"MONTH(P_kuupäev)","v":3}]
[null,"P293","2013-12-28","Lepik",{"$f":"VLOOKUP(P_ostja, o_tab, 2, 0)","v":"Paide"},"lepp",2,"Ilves",45,{"$f":"VLOOKUP(P_liik, P_hinnad, P_sort+1, 0)","v":59},{"$f":"P_hind * P_kogus","v":2655},{"$f":"MONTH(P_kuupäev)","v":12}]
[null,null,null,null,null,"lepp Total",null,null,{"$f":"SUBTOTAL(9,I237:I238)","v":110},null,{"$f":"SUBTOTAL(9,K237:K238)","v":6035}]
[null,"P034","2013-02-05","Lepik",{"$f":"VLOOKUP(P_ostja, o_tab, 2, 0)","v":"Paide"},"mänd",1,"Siil",30,{"$f":"VLOOKUP(P_liik, P_hinnad, P_sort+1, 0)","v":75},{"$f":"P_hind * P_kogus","v":2250},{"$f":"MONTH(P_kuupäev)","v":2}]
[null,"P122","2013-05-17","Lepik",{"$f":"VLOOKUP(P_ostja, o_tab, 2, 0)","v":"Paide"},"mänd",2,"Ilves",76,{"$f":"VLOOKUP(P_liik, P_hinnad, P_sort+1, 0)","v":68},{"$f":"P_hind * P_kogus","v":5168},{"$f":"MONTH(P_kuupäev)","v":5}]
[null,"P158","2013-07-10","Lepik",{"$f":"VLOOKUP(P_ostja, o_tab, 2, 0)","v":"Paide"},"mänd",1,"Siil",23,{"$f":"VLOOKUP(P_liik, P_hinnad, P_sort+1, 0)","v":75},{"$f":"P_hind * P_kogus","v":1725},{"$f":"MONTH(P_kuupäev)","v":7}]
[null,"P195","2013-08-27","Lepik",{"$f":"VLOOKUP(P_ostja, o_tab, 2, 0)","v":"Paide"},"mänd",3,"Hunt",43,{"$f":"VLOOKUP(P_liik, P_hinnad, P_sort+1, 0)","v":60},{"$f":"P_hind * P_kogus","v":2580},{"$f":"MONTH(P_kuupäev)","v":8}]
[null,"P195","2013-08-27","Lepik",{"$f":"VLOOKUP(P_ostja, o_tab, 2, 0)","v":"Paide"},"mänd",1,"Hunt",12,{"$f":"VLOOKUP(P_liik, P_hinnad, P_sort+1, 0)","v":75},{"$f":"P_hind * P_kogus","v":900},{"$f":"MONTH(P_kuupäev)","v":8}]
[null,"P268","2013-11-22","Lepik",{"$f":"VLOOKUP(P_ostja, o_tab, 2, 0)","v":"Paide"},"mänd",2,"Põder",41,{"$f":"VLOOKUP(P_liik, P_hinnad, P_sort+1, 0)","v":68},{"$f":"P_hind * P_kogus","v":2788},{"$f":"MONTH(P_kuupäev)","v":11}]
[null,null,null,null,null,"mänd Total",null,null,{"$f":"SUBTOTAL(9,I240:I245)","v":225},null,{"$f":"SUBTOTAL(9,K240:K245)","v":15411}]
[null,"P051","2013-03-02","Lepik",{"$f":"VLOOKUP(P_ostja, o_tab, 2, 0)","v":"Paide"},"saar",3,"Karu",63,{"$f":"VLOOKUP(P_liik, P_hinnad, P_sort+1, 0)","v":68},{"$f":"P_hind * P_kogus","v":4284},{"$f":"MONTH(P_kuupäev)","v":3}]
[null,null,null,null,null,"saar Total",null,null,{"$f":"SUBTOTAL(9,I247:I247)","v":63},null,{"$f":"SUBTOTAL(9,K247:K247)","v":4284}]
[null,"P034","2013-02-05","Lepik",{"$f":"VLOOKUP(P_ostja, o_tab, 2, 0)","v":"Paide"},"tamm",1,"Siil",15,{"$f":"VLOOKUP(P_liik, P_hinnad, P_sort+1, 0)","v":110},{"$f":"P_hind * P_kogus","v":1650},{"$f":"MONTH(P_kuupäev)","v":2}]
[null,null,null,null,null,"tamm Total",null,null,{"$f":"SUBTOTAL(9,I249:I249)","v":15},null,{"$f":"SUBTOTAL(9,K249:K249)","v":1650}]
[null,"P085","2013-04-14","Lepik",{"$f":"VLOOKUP(P_ostja, o_tab, 2, 0)","v":"Paide"},"vaher",1,"Karu",13,{"$f":"VLOOKUP(P_liik, P_hinnad, P_sort+1, 0)","v":95},{"$f":"P_hind * P_kogus","v":1235},{"$f":"MONTH(P_kuupäev)","v":4}]
[null,"P293","2013-12-28","Lepik",{"$f":"VLOOKUP(P_ostja, o_tab, 2, 0)","v":"Paide"},"vaher",1,"Ilves",21,{"$f":"VLOOKUP(P_liik, P_hinnad, P_sort+1, 0)","v":95},{"$f":"P_hind * P_kogus","v":1995},{"$f":"MONTH(P_kuupäev)","v":12}]
[null,null,null,null,null,"vaher Total",null,null,{"$f":"SUBTOTAL(9,I251:I252)","v":34},null,{"$f":"SUBTOTAL(9,K251:K252)","v":3230}]
[null,null,null,"Lepik Total",null,null,null,null,{"$f":"SUBTOTAL(9,I227:I252)","v":766},null,{"$f":"SUBTOTAL(9,K227:K252)","v":46554}]
[null,null,null,null,"Paide Total",null,null,null,{"$f":"SUBTOTAL(9,I211:I252)","v":1146},null,{"$f":"SUBTOTAL(9,K211:K252)","v":75173}]
[null,"P095","2013-04-21","Haab",{"$f":"VLOOKUP(P_ostja, o_tab, 2, 0)","v":"Pärnu"},"haab",1,"Karu",41,{"$f":"VLOOKUP(P_liik, P_hinnad, P_sort+1, 0)","v":50},{"$f":"P_hind * P_kogus","v":2050},{"$f":"MONTH(P_kuupäev)","v":4}]
[null,"P221","2013-09-27","Haab",{"$f":"VLOOKUP(P_ostja, o_tab, 2, 0)","v":"Pärnu"},"haab",3,"Hunt",44,{"$f":"VLOOKUP(P_liik, P_hinnad, P_sort+1, 0)","v":40},{"$f":"P_hind * P_kogus","v":1760},{"$f":"MONTH(P_kuupäev)","v":9}]
[null,"P230","2013-10-09","Haab",{"$f":"VLOOKUP(P_ostja, o_tab, 2, 0)","v":"Pärnu"},"haab",2,"Põder",70,{"$f":"VLOOKUP(P_liik, P_hinnad, P_sort+1, 0)","v":45},{"$f":"P_hind * P_kogus","v":3150},{"$f":"MONTH(P_kuupäev)","v":10}]
[null,null,null,null,null,"haab Total",null,null,{"$f":"SUBTOTAL(9,I256:I258)","v":155},null,{"$f":"SUBTOTAL(9,K256:K258)","v":6960}]
[null,"P002","2013-01-03","Haab",{"$f":"VLOOKUP(P_ostja, o_tab, 2, 0)","v":"Pärnu"},"kask",1,"Karu",75,{"$f":"VLOOKUP(P_liik, P_hinnad, P_sort+1, 0)","v":70},{"$f":"P_hind * P_kogus","v":5250},{"$f":"MONTH(P_kuupäev)","v":1}]
[null,null,null,null,null,"kask Total",null,null,{"$f":"SUBTOTAL(9,I260:I260)","v":75},null,{"$f":"SUBTOTAL(9,K260:K260)","v":5250}]
[null,"P095","2013-04-21","Haab",{"$f":"VLOOKUP(P_ostja, o_tab, 2, 0)","v":"Pärnu"},"kuusk",1,"Karu",62,{"$f":"VLOOKUP(P_liik, P_hinnad, P_sort+1, 0)","v":80},{"$f":"P_hind * P_kogus","v":4960},{"$f":"MONTH(P_kuupäev)","v":4}]
[null,"P205","2013-09-09","Haab",{"$f":"VLOOKUP(P_ostja, o_tab, 2, 0)","v":"Pärnu"},"kuusk",3,"Jänes",69,{"$f":"VLOOKUP(P_liik, P_hinnad, P_sort+1, 0)","v":64},{"$f":"P_hind * P_kogus","v":4416},{"$f":"MONTH(P_kuupäev)","v":9}]
[null,null,null,null,null,"kuusk Total",null,null,{"$f":"SUBTOTAL(9,I262:I263)","v":131},null,{"$f":"SUBTOTAL(9,K262:K263)","v":9376}]
[null,"P112","2013-05-09","Haab",{"$f":"VLOOKUP(P_ostja, o_tab, 2, 0)","v":"Pärnu"},"küte",1,"Karu",18,{"$f":"VLOOKUP(P_liik, P_hinnad, P_sort+1, 0)","v":47},{"$f":"P_hind * P_kogus","v":846},{"$f":"MONTH(P_kuupäev)","v":5}]
[null,"P230","2013-10-09","Haab",{"$f":"VLOOKUP(P_ostja, o_tab, 2, 0)","v":"Pärnu"},"küte",1,"Põder",30,{"$f":"VLOOKUP(P_liik, P_hinnad, P_sort+1, 0)","v":47},{"$f":"P_hind * P_kogus","v":1410},{"$f":"MONTH(P_kuupäev)","v":10}]
[null,null,null,null,null,"küte Total",null,null,{"$f":"SUBTOTAL(9,I265:I266)","v":48},null,{"$f":"SUBTOTAL(9,K265:K266)","v":2256}]
[null,"P080","2013-04-06","Haab",{"$f":"VLOOKUP(P_ostja, o_tab, 2, 0)","v":"Pärnu"},"mänd",3,"Ilves",34,{"$f":"VLOOKUP(P_liik, P_hinnad, P_sort+1, 0)","v":60},{"$f":"P_hind * P_kogus","v":2040},{"$f":"MONTH(P_kuupäev)","v":4}]
[null,"P095","2013-04-21","Haab",{"$f":"VLOOKUP(P_ostja, o_tab, 2, 0)","v":"Pärnu"},"mänd",2,"Karu",21,{"$f":"VLOOKUP(P_liik, P_hinnad, P_sort+1, 0)","v":68},{"$f":"P_hind * P_kogus","v":1428},{"$f":"MONTH(P_kuupäev)","v":4}]
[null,"P221","2013-09-27","Haab",{"$f":"VLOOKUP(P_ostja, o_tab, 2, 0)","v":"Pärnu"},"mänd",1,"Hunt",48,{"$f":"VLOOKUP(P_liik, P_hinnad, P_sort+1, 0)","v":75},{"$f":"P_hind * P_kogus","v":3600},{"$f":"MONTH(P_kuupäev)","v":9}]
[null,null,null,null,null,"mänd Total",null,null,{"$f":"SUBTOTAL(9,I268:I270)","v":103},null,{"$f":"SUBTOTAL(9,K268:K270)","v":7068}]
[null,"P112","2013-05-09","Haab",{"$f":"VLOOKUP(P_ostja, o_tab, 2, 0)","v":"Pärnu"},"saar",2,"Karu",10,{"$f":"VLOOKUP(P_liik, P_hinnad, P_sort+1, 0)","v":77},{"$f":"P_hind * P_kogus","v":770},{"$f":"MONTH(P_kuupäev)","v":5}]
[null,"P204","2013-09-05","Haab",{"$f":"VLOOKUP(P_ostja, o_tab, 2, 0)","v":"Pärnu"},"saar",2,"Siil",19,{"$f":"VLOOKUP(P_liik, P_hinnad, P_sort+1, 0)","v":77},{"$f":"P_hind * P_kogus","v":1463},{"$f":"MONTH(P_kuupäev)","v":9}]
[null,null,null,null,null,"saar Total",null,null,{"$f":"SUBTOTAL(9,I272:I273)","v":29},null,{"$f":"SUBTOTAL(9,K272:K273)","v":2233}]
[null,"P002","2013-01-03","Haab",{"$f":"VLOOKUP(P_ostja, o_tab, 2, 0)","v":"Pärnu"},"vaher",1,"Karu",10,{"$f":"VLOOKUP(P_liik, P_hinnad, P_sort+1, 0)","v":95},{"$f":"P_hind * P_kogus","v":950},{"$f":"MONTH(P_kuupäev)","v":1}]
[null,null,null,null,null,"vaher Total",null,null,{"$f":"SUBTOTAL(9,I275:I275)","v":10},null,{"$f":"SUBTOTAL(9,K275:K275)","v":950}]
[null,null,null,"Haab Total",null,null,null,null,{"$f":"SUBTOTAL(9,I256:I275)","v":551},null,{"$f":"SUBTOTAL(9,K256:K275)","v":34093}]
[null,"P079","2013-04-05","Juur",{"$f":"VLOOKUP(P_ostja, o_tab, 2, 0)","v":"Pärnu"},"haab",1,"Ilves",15,{"$f":"VLOOKUP(P_liik, P_hinnad, P_sort+1, 0)","v":50},{"$f":"P_hind * P_kogus","v":750},{"$f":"MONTH(P_kuupäev)","v":4}]
[null,"P082","2013-04-09","Juur",{"$f":"VLOOKUP(P_ostja, o_tab, 2, 0)","v":"Pärnu"},"haab",1,"Siil",35,{"$f":"VLOOKUP(P_liik, P_hinnad, P_sort+1, 0)","v":50},{"$f":"P_hind * P_kogus","v":1750},{"$f":"MONTH(P_kuupäev)","v":4}]
[null,"P130","2013-05-27","Juur",{"$f":"VLOOKUP(P_ostja, o_tab, 2, 0)","v":"Pärnu"},"haab",1,"Hunt",20,{"$f":"VLOOKUP(P_liik, P_hinnad, P_sort+1, 0)","v":50},{"$f":"P_hind * P_kogus","v":1000},{"$f":"MONTH(P_kuupäev)","v":5}]
[null,"P233","2013-10-12","Juur",{"$f":"VLOOKUP(P_ostja, o_tab, 2, 0)","v":"Pärnu"},"haab",1,"Karu",35,{"$f":"VLOOKUP(P_liik, P_hinnad, P_sort+1, 0)","v":50},{"$f":"P_hind * P_kogus","v":1750},{"$f":"MONTH(P_kuupäev)","v":10}]
[null,null,null,null,null,"haab Total",null,null,{"$f":"SUBTOTAL(9,I278:I281)","v":105},null,{"$f":"SUBTOTAL(9,K278:K281)","v":5250}]
[null,"P044","2013-02-25","Juur",{"$f":"VLOOKUP(P_ostja, o_tab, 2, 0)","v":"Pärnu"},"kask",1,"Hunt",37,{"$f":"VLOOKUP(P_liik, P_hinnad, P_sort+1, 0)","v":70},{"$f":"P_hind * P_kogus","v":2590},{"$f":"MONTH(P_kuupäev)","v":2}]
[null,null,null,null,null,"kask Total",null,null,{"$f":"SUBTOTAL(9,I283:I283)","v":37},null,{"$f":"SUBTOTAL(9,K283:K283)","v":2590}]
[null,"P253","2013-10-31","Juur",{"$f":"VLOOKUP(P_ostja, o_tab, 2, 0)","v":"Pärnu"},"kuusk",2,"Ilves",28,{"$f":"VLOOKUP(P_liik, P_hinnad, P_sort+1, 0)","v":72},{"$f":"P_hind * P_kogus","v":2016},{"$f":"MONTH(P_kuupäev)","v":10}]
[null,null,null,null,null,"kuusk Total",null,null,{"$f":"SUBTOTAL(9,I285:I285)","v":28},null,{"$f":"SUBTOTAL(9,K285:K285)","v":2016}]
[null,"P115","2013-05-11","Juur",{"$f":"VLOOKUP(P_ostja, o_tab, 2, 0)","v":"Pärnu"},"küte",1,"Ilves",71,{"$f":"VLOOKUP(P_liik, P_hinnad, P_sort+1, 0)","v":47},{"$f":"P_hind * P_kogus","v":3337},{"$f":"MONTH(P_kuupäev)","v":5}]
[null,"P130","2013-05-27","Juur",{"$f":"VLOOKUP(P_ostja, o_tab, 2, 0)","v":"Pärnu"},"küte",2,"Hunt",11,{"$f":"VLOOKUP(P_liik, P_hinnad, P_sort+1, 0)","v":42},{"$f":"P_hind * P_kogus","v":462},{"$f":"MONTH(P_kuupäev)","v":5}]
[null,null,null,null,null,"küte Total",null,null,{"$f":"SUBTOTAL(9,I287:I288)","v":82},null,{"$f":"SUBTOTAL(9,K287:K288)","v":3799}]
[null,"P149","2013-06-24","Juur",{"$f":"VLOOKUP(P_ostja, o_tab, 2, 0)","v":"Pärnu"},"lepp",1,"Põder",32,{"$f":"VLOOKUP(P_liik, P_hinnad, P_sort+1, 0)","v":65},{"$f":"P_hind * P_kogus","v":2080},{"$f":"MONTH(P_kuupäev)","v":6}]
[null,"P177","2013-08-05","Juur",{"$f":"VLOOKUP(P_ostja, o_tab, 2, 0)","v":"Pärnu"},"lepp",3,"Rebane",58,{"$f":"VLOOKUP(P_liik, P_hinnad, P_sort+1, 0)","v":52},{"$f":"P_hind * P_kogus","v":3016},{"$f":"MONTH(P_kuupäev)","v":8}]
[null,null,null,null,null,"lepp Total",null,null,{"$f":"SUBTOTAL(9,I290:I291)","v":90},null,{"$f":"SUBTOTAL(9,K290:K291)","v":5096}]
[null,"P006","2013-01-06","Juur",{"$f":"VLOOKUP(P_ostja, o_tab, 2, 0)","v":"Pärnu"},"mänd",2,"Rebane",37,{"$f":"VLOOKUP(P_liik, P_hinnad, P_sort+1, 0)","v":68},{"$f":"P_hind * P_kogus","v":2516},{"$f":"MONTH(P_kuupäev)","v":1}]
[null,"P044","2013-02-25","Juur",{"$f":"VLOOKUP(P_ostja, o_tab, 2, 0)","v":"Pärnu"},"mänd",3,"Hunt",33,{"$f":"VLOOKUP(P_liik, P_hinnad, P_sort+1, 0)","v":60},{"$f":"P_hind * P_kogus","v":1980},{"$f":"MONTH(P_kuupäev)","v":2}]
[null,"P235","2013-10-14","Juur",{"$f":"VLOOKUP(P_ostja, o_tab, 2, 0)","v":"Pärnu"},"mänd",1,"Karu",59,{"$f":"VLOOKUP(P_liik, P_hinnad, P_sort+1, 0)","v":75},{"$f":"P_hind * P_kogus","v":4425},{"$f":"MONTH(P_kuupäev)","v":10}]
[null,null,null,null,null,"mänd Total",null,null,{"$f":"SUBTOTAL(9,I293:I295)","v":129},null,{"$f":"SUBTOTAL(9,K293:K295)","v":8921}]
[null,"P235","2013-10-14","Juur",{"$f":"VLOOKUP(P_ostja, o_tab, 2, 0)","v":"Pärnu"},"saar",3,"Karu",29,{"$f":"VLOOKUP(P_liik, P_hinnad, P_sort+1, 0)","v":68},{"$f":"P_hind * P_kogus","v":1972},{"$f":"MONTH(P_kuupäev)","v":10}]
[null,"P253","2013-10-31","Juur",{"$f":"VLOOKUP(P_ostja, o_tab, 2, 0)","v":"Pärnu"},"saar",3,"Ilves",60,{"$f":"VLOOKUP(P_liik, P_hinnad, P_sort+1, 0)","v":68},{"$f":"P_hind * P_kogus","v":4080},{"$f":"MONTH(P_kuupäev)","v":10}]
[null,null,null,null,null,"saar Total",null,null,{"$f":"SUBTOTAL(9,I297:I298)","v":89},null,{"$f":"SUBTOTAL(9,K297:K298)","v":6052}]
[null,"P064","2013-03-20","Juur",{"$f":"VLOOKUP(P_ostja, o_tab, 2, 0)","v":"Pärnu"},"tamm",1,"Rebane",35,{"$f":"VLOOKUP(P_liik, P_hinnad, P_sort+1, 0)","v":110},{"$f":"P_hind * P_kogus","v":3850},{"$f":"MONTH(P_kuupäev)","v":3}]
[null,null,null,null,null,"tamm Total",null,null,{"$f":"SUBTOTAL(9,I300:I300)","v":35},null,{"$f":"SUBTOTAL(9,K300:K300)","v":3850}]
[null,"P064","2013-03-20","Juur",{"$f":"VLOOKUP(P_ostja, o_tab, 2, 0)","v":"Pärnu"},"vaher",2,"Rebane",31,{"$f":"VLOOKUP(P_liik, P_hinnad, P_sort+1, 0)","v":86},{"$f":"P_hind * P_kogus","v":2666},{"$f":"MONTH(P_kuupäev)","v":3}]
[null,null,null,null,null,"vaher Total",null,null,{"$f":"SUBTOTAL(9,I302:I302)","v":31},null,{"$f":"SUBTOTAL(9,K302:K302)","v":2666}]
[null,null,null,"Juur Total",null,null,null,null,{"$f":"SUBTOTAL(9,I278:I302)","v":626},null,{"$f":"SUBTOTAL(9,K278:K302)","v":40240}]
[null,"P238","2013-10-17","Kaasik",{"$f":"VLOOKUP(P_ostja, o_tab, 2, 0)","v":"Pärnu"},"haab",1,"Karu",41,{"$f":"VLOOKUP(P_liik, P_hinnad, P_sort+1, 0)","v":50},{"$f":"P_hind * P_kogus","v":2050},{"$f":"MONTH(P_kuupäev)","v":10}]
[null,null,null,null,null,"haab Total",null,null,{"$f":"SUBTOTAL(9,I305:I305)","v":41},null,{"$f":"SUBTOTAL(9,K305:K305)","v":2050}]
[null,"P077","2013-04-03","Kaasik",{"$f":"VLOOKUP(P_ostja, o_tab, 2, 0)","v":"Pärnu"},"kask",1,"Põder",39,{"$f":"VLOOKUP(P_liik, P_hinnad, P_sort+1, 0)","v":70},{"$f":"P_hind * P_kogus","v":2730},{"$f":"MONTH(P_kuupäev)","v":4}]
[null,"P181","2013-08-12","Kaasik",{"$f":"VLOOKUP(P_ostja, o_tab, 2, 0)","v":"Pärnu"},"kask",1,"Karu",17,{"$f":"VLOOKUP(P_liik, P_hinnad, P_sort+1, 0)","v":70},{"$f":"P_hind * P_kogus","v":1190},{"$f":"MONTH(P_kuupäev)","v":8}]
[null,null,null,null,null,"kask Total",null,null,{"$f":"SUBTOTAL(9,I307:I308)","v":56},null,{"$f":"SUBTOTAL(9,K307:K308)","v":3920}]
[null,"P127","2013-05-22","Kaasik",{"$f":"VLOOKUP(P_ostja, o_tab, 2, 0)","v":"Pärnu"},"kuusk",2,"Ilves",74,{"$f":"VLOOKUP(P_liik, P_hinnad, P_sort+1, 0)","v":72},{"$f":"P_hind * P_kogus","v":5328},{"$f":"MONTH(P_kuupäev)","v":5}]
[null,null,null,null,null,"kuusk Total",null,null,{"$f":"SUBTOTAL(9,I310:I310)","v":74},null,{"$f":"SUBTOTAL(9,K310:K310)","v":5328}]
[null,"P167","2013-07-24","Kaasik",{"$f":"VLOOKUP(P_ostja, o_tab, 2, 0)","v":"Pärnu"},"lepp",2,"Põder",65,{"$f":"VLOOKUP(P_liik, P_hinnad, P_sort+1, 0)","v":59},{"$f":"P_hind * P_kogus","v":3835},{"$f":"MONTH(P_kuupäev)","v":7}]
[null,"P181","2013-08-12","Kaasik",{"$f":"VLOOKUP(P_ostja, o_tab, 2, 0)","v":"Pärnu"},"lepp",2,"Karu",72,{"$f":"VLOOKUP(P_liik, P_hinnad, P_sort+1, 0)","v":59},{"$f":"P_hind * P_kogus","v":4248},{"$f":"MONTH(P_kuupäev)","v":8}]
[null,"P238","2013-10-17","Kaasik",{"$f":"VLOOKUP(P_ostja, o_tab, 2, 0)","v":"Pärnu"},"lepp",3,"Karu",55,{"$f":"VLOOKUP(P_liik, P_hinnad, P_sort+1, 0)","v":52},{"$f":"P_hind * P_kogus","v":2860},{"$f":"MONTH(P_kuupäev)","v":10}]
[null,"P260","2013-11-12","Kaasik",{"$f":"VLOOKUP(P_ostja, o_tab, 2, 0)","v":"Pärnu"},"lepp",2,"Jänes",18,{"$f":"VLOOKUP(P_liik, P_hinnad, P_sort+1, 0)","v":59},{"$f":"P_hind * P_kogus","v":1062},{"$f":"MONTH(P_kuupäev)","v":11}]
[null,null,null,null,null,"lepp Total",null,null,{"$f":"SUBTOTAL(9,I312:I315)","v":210},null,{"$f":"SUBTOTAL(9,K312:K315)","v":12005}]
[null,"P100","2013-04-26","Kaasik",{"$f":"VLOOKUP(P_ostja, o_tab, 2, 0)","v":"Pärnu"},"mänd",2,"Ilves",70,{"$f":"VLOOKUP(P_liik, P_hinnad, P_sort+1, 0)","v":68},{"$f":"P_hind * P_kogus","v":4760},{"$f":"MONTH(P_kuupäev)","v":4}]
[null,"P181","2013-08-12","Kaasik",{"$f":"VLOOKUP(P_ostja, o_tab, 2, 0)","v":"Pärnu"},"mänd",1,"Karu",14,{"$f":"VLOOKUP(P_liik, P_hinnad, P_sort+1, 0)","v":75},{"$f":"P_hind * P_kogus","v":1050},{"$f":"MONTH(P_kuupäev)","v":8}]
[null,"P260","2013-11-12","Kaasik",{"$f":"VLOOKUP(P_ostja, o_tab, 2, 0)","v":"Pärnu"},"mänd",3,"Jänes",59,{"$f":"VLOOKUP(P_liik, P_hinnad, P_sort+1, 0)","v":60},{"$f":"P_hind * P_kogus","v":3540},{"$f":"MONTH(P_kuupäev)","v":11}]
[null,null,null,null,null,"mänd Total",null,null,{"$f":"SUBTOTAL(9,I317:I319)","v":143},null,{"$f":"SUBTOTAL(9,K317:K319)","v":9350}]
[null,"P081","2013-04-08","Kaasik",{"$f":"VLOOKUP(P_ostja, o_tab, 2, 0)","v":"Pärnu"},"tamm",2,"Hunt",50,{"$f":"VLOOKUP(P_liik, P_hinnad, P_sort+1, 0)","v":99},{"$f":"P_hind * P_kogus","v":4950},{"$f":"MONTH(P_kuupäev)","v":4}]
[null,null,null,null,null,"tamm Total",null,null,{"$f":"SUBTOTAL(9,I321:I321)","v":50},null,{"$f":"SUBTOTAL(9,K321:K321)","v":4950}]
[null,null,null,"Kaasik Total",null,null,null,null,{"$f":"SUBTOTAL(9,I305:I321)","v":574},null,{"$f":"SUBTOTAL(9,K305:K321)","v":37603}]
[null,"P028","2013-01-31","Kask",{"$f":"VLOOKUP(P_ostja, o_tab, 2, 0)","v":"Pärnu"},"haab",2,"Ilves",46,{"$f":"VLOOKUP(P_liik, P_hinnad, P_sort+1, 0)","v":45},{"$f":"P_hind * P_kogus","v":2070},{"$f":"MONTH(P_kuupäev)","v":1}]
[null,null,null,null,null,"haab Total",null,null,{"$f":"SUBTOTAL(9,I324:I324)","v":46},null,{"$f":"SUBTOTAL(9,K324:K324)","v":2070}]
[null,"P068","2013-03-23","Kask",{"$f":"VLOOKUP(P_ostja, o_tab, 2, 0)","v":"Pärnu"},"kask",1,"Ilves",32,{"$f":"VLOOKUP(P_liik, P_hinnad, P_sort+1, 0)","v":70},{"$f":"P_hind * P_kogus","v":2240},{"$f":"MONTH(P_kuupäev)","v":3}]
[null,null,null,null,null,"kask Total",null,null,{"$f":"SUBTOTAL(9,I326:I326)","v":32},null,{"$f":"SUBTOTAL(9,K326:K326)","v":2240}]
[null,"P028","2013-01-31","Kask",{"$f":"VLOOKUP(P_ostja, o_tab, 2, 0)","v":"Pärnu"},"kuusk",1,"Ilves",40,{"$f":"VLOOKUP(P_liik, P_hinnad, P_sort+1, 0)","v":80},{"$f":"P_hind * P_kogus","v":3200},{"$f":"MONTH(P_kuupäev)","v":1}]
[null,"P076","2013-04-02","Kask",{"$f":"VLOOKUP(P_ostja, o_tab, 2, 0)","v":"Pärnu"},"kuusk",2,"Siil",14,{"$f":"VLOOKUP(P_liik, P_hinnad, P_sort+1, 0)","v":72},{"$f":"P_hind * P_kogus","v":1008},{"$f":"MONTH(P_kuupäev)","v":4}]
[null,"P272","2013-11-30","Kask",{"$f":"VLOOKUP(P_ostja, o_tab, 2, 0)","v":"Pärnu"},"kuusk",1,"Ilves",29,{"$f":"VLOOKUP(P_liik, P_hinnad, P_sort+1, 0)","v":80},{"$f":"P_hind * P_kogus","v":2320},{"$f":"MONTH(P_kuupäev)","v":11}]
[null,null,null,null,null,"kuusk Total",null,null,{"$f":"SUBTOTAL(9,I328:I330)","v":83},null,{"$f":"SUBTOTAL(9,K328:K330)","v":6528}]
[null,"P208","2013-09-15","Kask",{"$f":"VLOOKUP(P_ostja, o_tab, 2, 0)","v":"Pärnu"},"küte",1,"Ilves",71,{"$f":"VLOOKUP(P_liik, P_hinnad, P_sort+1, 0)","v":47},{"$f":"P_hind * P_kogus","v":3337},{"$f":"MONTH(P_kuupäev)","v":9}]
[null,"P259","2013-11-09","Kask",{"$f":"VLOOKUP(P_ostja, o_tab, 2, 0)","v":"Pärnu"},"küte",1,"Hunt",30,{"$f":"VLOOKUP(P_liik, P_hinnad, P_sort+1, 0)","v":47},{"$f":"P_hind * P_kogus","v":1410},{"$f":"MONTH(P_kuupäev)","v":11}]
[null,null,null,null,null,"küte Total",null,null,{"$f":"SUBTOTAL(9,I332:I333)","v":101},null,{"$f":"SUBTOTAL(9,K332:K333)","v":4747}]
[null,"P035","2013-02-12","Kask",{"$f":"VLOOKUP(P_ostja, o_tab, 2, 0)","v":"Pärnu"},"lepp",1,"Karu",53,{"$f":"VLOOKUP(P_liik, P_hinnad, P_sort+1, 0)","v":65},{"$f":"P_hind * P_kogus","v":3445},{"$f":"MONTH(P_kuupäev)","v":2}]
[null,"P116","2013-05-13","Kask",{"$f":"VLOOKUP(P_ostja, o_tab, 2, 0)","v":"Pärnu"},"lepp",1,"Hunt",41,{"$f":"VLOOKUP(P_liik, P_hinnad, P_sort+1, 0)","v":65},{"$f":"P_hind * P_kogus","v":2665},{"$f":"MONTH(P_kuupäev)","v":5}]
[null,"P116","2013-05-13","Kask",{"$f":"VLOOKUP(P_ostja, o_tab, 2, 0)","v":"Pärnu"},"lepp",2,"Hunt",14,{"$f":"VLOOKUP(P_liik, P_hinnad, P_sort+1, 0)","v":59},{"$f":"P_hind * P_kogus","v":826},{"$f":"MONTH(P_kuupäev)","v":5}]
[null,"P226","2013-10-06","Kask",{"$f":"VLOOKUP(P_ostja, o_tab, 2, 0)","v":"Pärnu"},"lepp",2,"Jänes",20,{"$f":"VLOOKUP(P_liik, P_hinnad, P_sort+1, 0)","v":59},{"$f":"P_hind * P_kogus","v":1180},{"$f":"MONTH(P_kuupäev)","v":10}]
[null,null,null,null,null,"lepp Total",null,null,{"$f":"SUBTOTAL(9,I335:I338)","v":128},null,{"$f":"SUBTOTAL(9,K335:K338)","v":8116}]
[null,"P014","2013-01-14","Kask",{"$f":"VLOOKUP(P_ostja, o_tab, 2, 0)","v":"Pärnu"},"mänd",1,"Siil",40,{"$f":"VLOOKUP(P_liik, P_hinnad, P_sort+1, 0)","v":75},{"$f":"P_hind * P_kogus","v":3000},{"$f":"MONTH(P_kuupäev)","v":1}]
[null,"P038","2013-02-18","Kask",{"$f":"VLOOKUP(P_ostja, o_tab, 2, 0)","v":"Pärnu"},"mänd",1,"Ilves",36,{"$f":"VLOOKUP(P_liik, P_hinnad, P_sort+1, 0)","v":75},{"$f":"P_hind * P_kogus","v":2700},{"$f":"MONTH(P_kuupäev)","v":2}]
[null,"P123","2013-05-17","Kask",{"$f":"VLOOKUP(P_ostja, o_tab, 2, 0)","v":"Pärnu"},"mänd",1,"Hunt",47,{"$f":"VLOOKUP(P_liik, P_hinnad, P_sort+1, 0)","v":75},{"$f":"P_hind * P_kogus","v":3525},{"$f":"MONTH(P_kuupäev)","v":5}]
[null,null,null,null,null,"mänd Total",null,null,{"$f":"SUBTOTAL(9,I340:I342)","v":123},null,{"$f":"SUBTOTAL(9,K340:K342)","v":9225}]
[null,"P014","2013-01-14","Kask",{"$f":"VLOOKUP(P_ostja, o_tab, 2, 0)","v":"Pärnu"},"saar",1,"Siil",17,{"$f":"VLOOKUP(P_liik, P_hinnad, P_sort+1, 0)","v":85},{"$f":"P_hind * P_kogus","v":1445},{"$f":"MONTH(P_kuupäev)","v":1}]
[null,null,null,null,null,"saar Total",null,null,{"$f":"SUBTOTAL(9,I344:I344)","v":17},null,{"$f":"SUBTOTAL(9,K344:K344)","v":1445}]
[null,"P038","2013-02-18","Kask",{"$f":"VLOOKUP(P_ostja, o_tab, 2, 0)","v":"Pärnu"},"tamm",1,"Ilves",14,{"$f":"VLOOKUP(P_liik, P_hinnad, P_sort+1, 0)","v":110},{"$f":"P_hind * P_kogus","v":1540},{"$f":"MONTH(P_kuupäev)","v":2}]
[null,"P126","2013-05-21","Kask",{"$f":"VLOOKUP(P_ostja, o_tab, 2, 0)","v":"Pärnu"},"tamm",1,"Ilves",30,{"$f":"VLOOKUP(P_liik, P_hinnad, P_sort+1, 0)","v":110},{"$f":"P_hind * P_kogus","v":3300},{"$f":"MONTH(P_kuupäev)","v":5}]
[null,"P187","2013-08-20","Kask",{"$f":"VLOOKUP(P_ostja, o_tab, 2, 0)","v":"Pärnu"},"tamm",1,"Jänes",59,{"$f":"VLOOKUP(P_liik, P_hinnad, P_sort+1, 0)","v":110},{"$f":"P_hind * P_kogus","v":6490},{"$f":"MONTH(P_kuupäev)","v":8}]
[null,null,null,null,null,"tamm Total",null,null,{"$f":"SUBTOTAL(9,I346:I348)","v":103},null,{"$f":"SUBTOTAL(9,K346:K348)","v":11330}]
[null,"P038","2013-02-18","Kask",{"$f":"VLOOKUP(P_ostja, o_tab, 2, 0)","v":"Pärnu"},"vaher",3,"Ilves",78,{"$f":"VLOOKUP(P_liik, P_hinnad, P_sort+1, 0)","v":76},{"$f":"P_hind * P_kogus","v":5928},{"$f":"MONTH(P_kuupäev)","v":2}]
[null,null,null,null,null,"vaher Total",null,null,{"$f":"SUBTOTAL(9,I350:I350)","v":78},null,{"$f":"SUBTOTAL(9,K350:K350)","v":5928}]
[null,null,null,"Kask Total",null,null,null,null,{"$f":"SUBTOTAL(9,I324:I350)","v":711},null,{"$f":"SUBTOTAL(9,K324:K350)","v":51629}]
[null,"P073","2013-03-31","Kaun",{"$f":"VLOOKUP(P_ostja, o_tab, 2, 0)","v":"Pärnu"},"haab",1,"Hunt",27,{"$f":"VLOOKUP(P_liik, P_hinnad, P_sort+1, 0)","v":50},{"$f":"P_hind * P_kogus","v":1350},{"$f":"MONTH(P_kuupäev)","v":3}]
[null,"P091","2013-04-18","Kaun",{"$f":"VLOOKUP(P_ostja, o_tab, 2, 0)","v":"Pärnu"},"haab",1,"Ilves",72,{"$f":"VLOOKUP(P_liik, P_hinnad, P_sort+1, 0)","v":50},{"$f":"P_hind * P_kogus","v":3600},{"$f":"MONTH(P_kuupäev)","v":4}]
[null,"P114","2013-05-10","Kaun",{"$f":"VLOOKUP(P_ostja, o_tab, 2, 0)","v":"Pärnu"},"haab",2,"Põder",25,{"$f":"VLOOKUP(P_liik, P_hinnad, P_sort+1, 0)","v":45},{"$f":"P_hind * P_kogus","v":1125},{"$f":"MONTH(P_kuupäev)","v":5}]
[null,null,null,null,null,"haab Total",null,null,{"$f":"SUBTOTAL(9,I353:I355)","v":124},null,{"$f":"SUBTOTAL(9,K353:K355)","v":6075}]
[null,"P147","2013-06-21","Kaun",{"$f":"VLOOKUP(P_ostja, o_tab, 2, 0)","v":"Pärnu"},"kask",2,"Karu",33,{"$f":"VLOOKUP(P_liik, P_hinnad, P_sort+1, 0)","v":63},{"$f":"P_hind * P_kogus","v":2079},{"$f":"MONTH(P_kuupäev)","v":6}]
[null,"P266","2013-11-21","Kaun",{"$f":"VLOOKUP(P_ostja, o_tab, 2, 0)","v":"Pärnu"},"kask",2,"Karu",70,{"$f":"VLOOKUP(P_liik, P_hinnad, P_sort+1, 0)","v":63},{"$f":"P_hind * P_kogus","v":4410},{"$f":"MONTH(P_kuupäev)","v":11}]
[null,null,null,null,null,"kask Total",null,null,{"$f":"SUBTOTAL(9,I357:I358)","v":103},null,{"$f":"SUBTOTAL(9,K357:K358)","v":6489}]
[null,"P073","2013-03-31","Kaun",{"$f":"VLOOKUP(P_ostja, o_tab, 2, 0)","v":"Pärnu"},"kuusk",1,"Hunt",21,{"$f":"VLOOKUP(P_liik, P_hinnad, P_sort+1, 0)","v":80},{"$f":"P_hind * P_kogus","v":1680},{"$f":"MONTH(P_kuupäev)","v":3}]
[null,"P117","2013-05-14","Kaun",{"$f":"VLOOKUP(P_ostja, o_tab, 2, 0)","v":"Pärnu"},"kuusk",3,"Jänes",55,{"$f":"VLOOKUP(P_liik, P_hinnad, P_sort+1, 0)","v":64},{"$f":"P_hind * P_kogus","v":3520},{"$f":"MONTH(P_kuupäev)","v":5}]
[null,"P153","2013-07-05","Kaun",{"$f":"VLOOKUP(P_ostja, o_tab, 2, 0)","v":"Pärnu"},"kuusk",3,"Põder",56,{"$f":"VLOOKUP(P_liik, P_hinnad, P_sort+1, 0)","v":64},{"$f":"P_hind * P_kogus","v":3584},{"$f":"MONTH(P_kuupäev)","v":7}]
[null,"P165","2013-07-20","Kaun",{"$f":"VLOOKUP(P_ostja, o_tab, 2, 0)","v":"Pärnu"},"kuusk",3,"Karu",26,{"$f":"VLOOKUP(P_liik, P_hinnad, P_sort+1, 0)","v":64},{"$f":"P_hind * P_kogus","v":1664},{"$f":"MONTH(P_kuupäev)","v":7}]
[null,null,null,null,null,"kuusk Total",null,null,{"$f":"SUBTOTAL(9,I360:I363)","v":158},null,{"$f":"SUBTOTAL(9,K360:K363)","v":10448}]
[null,"P020","2013-01-23","Kaun",{"$f":"VLOOKUP(P_ostja, o_tab, 2, 0)","v":"Pärnu"},"küte",1,"Põder",48,{"$f":"VLOOKUP(P_liik, P_hinnad, P_sort+1, 0)","v":47},{"$f":"P_hind * P_kogus","v":2256},{"$f":"MONTH(P_kuupäev)","v":1}]
[null,"P184","2013-08-17","Kaun",{"$f":"VLOOKUP(P_ostja, o_tab, 2, 0)","v":"Pärnu"},"küte",1,"Karu",14,{"$f":"VLOOKUP(P_liik, P_hinnad, P_sort+1, 0)","v":47},{"$f":"P_hind * P_kogus","v":658},{"$f":"MONTH(P_kuupäev)","v":8}]
[null,"P255","2013-11-03","Kaun",{"$f":"VLOOKUP(P_ostja, o_tab, 2, 0)","v":"Pärnu"},"küte",1,"Rebane",61,{"$f":"VLOOKUP(P_liik, P_hinnad, P_sort+1, 0)","v":47},{"$f":"P_hind * P_kogus","v":2867},{"$f":"MONTH(P_kuupäev)","v":11}]
[null,null,null,null,null,"küte Total",null,null,{"$f":"SUBTOTAL(9,I365:I367)","v":123},null,{"$f":"SUBTOTAL(9,K365:K367)","v":5781}]
[null,"P050","2013-03-01","Kaun",{"$f":"VLOOKUP(P_ostja, o_tab, 2, 0)","v":"Pärnu"},"lepp",1,"Ilves",65,{"$f":"VLOOKUP(P_liik, P_hinnad, P_sort+1, 0)","v":65},{"$f":"P_hind * P_kogus","v":4225},{"$f":"MONTH(P_kuupäev)","v":3}]
[null,"P173","2013-07-31","Kaun",{"$f":"VLOOKUP(P_ostja, o_tab, 2, 0)","v":"Pärnu"},"lepp",2,"Jänes",23,{"$f":"VLOOKUP(P_liik, P_hinnad, P_sort+1, 0)","v":59},{"$f":"P_hind * P_kogus","v":1357},{"$f":"MONTH(P_kuupäev)","v":7}]
[null,"P196","2013-08-28","Kaun",{"$f":"VLOOKUP(P_ostja, o_tab, 2, 0)","v":"Pärnu"},"lepp",2,"Siil",38,{"$f":"VLOOKUP(P_liik, P_hinnad, P_sort+1, 0)","v":59},{"$f":"P_hind * P_kogus","v":2242},{"$f":"MONTH(P_kuupäev)","v":8}]
[null,null,null,null,null,"lepp Total",null,null,{"$f":"SUBTOTAL(9,I369:I371)","v":126},null,{"$f":"SUBTOTAL(9,K369:K371)","v":7824}]
[null,"P093","2013-04-20","Kaun",{"$f":"VLOOKUP(P_ostja, o_tab, 2, 0)","v":"Pärnu"},"mänd",3,"Jänes",71,{"$f":"VLOOKUP(P_liik, P_hinnad, P_sort+1, 0)","v":60},{"$f":"P_hind * P_kogus","v":4260},{"$f":"MONTH(P_kuupäev)","v":4}]
[null,null,null,null,null,"mänd Total",null,null,{"$f":"SUBTOTAL(9,I373:I373)","v":71},null,{"$f":"SUBTOTAL(9,K373:K373)","v":4260}]
[null,"P114","2013-05-10","Kaun",{"$f":"VLOOKUP(P_ostja, o_tab, 2, 0)","v":"Pärnu"},"saar",3,"Põder",19,{"$f":"VLOOKUP(P_liik, P_hinnad, P_sort+1, 0)","v":68},{"$f":"P_hind * P_kogus","v":1292},{"$f":"MONTH(P_kuupäev)","v":5}]
[null,null,null,null,null,"saar Total",null,null,{"$f":"SUBTOTAL(9,I375:I375)","v":19},null,{"$f":"SUBTOTAL(9,K375:K375)","v":1292}]
[null,"P148","2013-06-22","Kaun",{"$f":"VLOOKUP(P_ostja, o_tab, 2, 0)","v":"Pärnu"},"tamm",2,"Rebane",65,{"$f":"VLOOKUP(P_liik, P_hinnad, P_sort+1, 0)","v":99},{"$f":"P_hind * P_kogus","v":6435},{"$f":"MONTH(P_kuupäev)","v":6}]
[null,"P148","2013-06-22","Kaun",{"$f":"VLOOKUP(P_ostja, o_tab, 2, 0)","v":"Pärnu"},"tamm",1,"Rebane",10,{"$f":"VLOOKUP(P_liik, P_hinnad, P_sort+1, 0)","v":110},{"$f":"P_hind * P_kogus","v":1100},{"$f":"MONTH(P_kuupäev)","v":6}]
[null,"P190","2013-08-22","Kaun",{"$f":"VLOOKUP(P_ostja, o_tab, 2, 0)","v":"Pärnu"},"tamm",2,"Põder",78,{"$f":"VLOOKUP(P_liik, P_hinnad, P_sort+1, 0)","v":99},{"$f":"P_hind * P_kogus","v":7722},{"$f":"MONTH(P_kuupäev)","v":8}]
[null,null,null,null,null,"tamm Total",null,null,{"$f":"SUBTOTAL(9,I377:I379)","v":153},null,{"$f":"SUBTOTAL(9,K377:K379)","v":15257}]
[null,"P255","2013-11-03","Kaun",{"$f":"VLOOKUP(P_ostja, o_tab, 2, 0)","v":"Pärnu"},"vaher",1,"Rebane",26,{"$f":"VLOOKUP(P_liik, P_hinnad, P_sort+1, 0)","v":95},{"$f":"P_hind * P_kogus","v":2470},{"$f":"MONTH(P_kuupäev)","v":11}]
[null,null,null,null,null,"vaher Total",null,null,{"$f":"SUBTOTAL(9,I381:I381)","v":26},null,{"$f":"SUBTOTAL(9,K381:K381)","v":2470}]
[null,null,null,"Kaun Total",null,null,null,null,{"$f":"SUBTOTAL(9,I353:I381)","v":903},null,{"$f":"SUBTOTAL(9,K353:K381)","v":59896}]
[null,null,null,null,"Pärnu Total",null,null,null,{"$f":"SUBTOTAL(9,I256:I381)","v":3365},null,{"$f":"SUBTOTAL(9,K256:K381)","v":223461}]
[null,"P150","2013-06-28","Pihel",{"$f":"VLOOKUP(P_ostja, o_tab, 2, 0)","v":"Rapla"},"kask",2,"Jänes",36,{"$f":"VLOOKUP(P_liik, P_hinnad, P_sort+1, 0)","v":63},{"$f":"P_hind * P_kogus","v":2268},{"$f":"MONTH(P_kuupäev)","v":6}]
[null,"P216","2013-09-23","Pihel",{"$f":"VLOOKUP(P_ostja, o_tab, 2, 0)","v":"Rapla"},"kask",3,"Jänes",74,{"$f":"VLOOKUP(P_liik, P_hinnad, P_sort+1, 0)","v":56},{"$f":"P_hind * P_kogus","v":4144},{"$f":"MONTH(P_kuupäev)","v":9}]
[null,null,null,null,null,"kask Total",null,null,{"$f":"SUBTOTAL(9,I385:I386)","v":110},null,{"$f":"SUBTOTAL(9,K385:K386)","v":6412}]
[null,"P018","2013-01-19","Pihel",{"$f":"VLOOKUP(P_ostja, o_tab, 2, 0)","v":"Rapla"},"kuusk",3,"Siil",52,{"$f":"VLOOKUP(P_liik, P_hinnad, P_sort+1, 0)","v":64},{"$f":"P_hind * P_kogus","v":3328},{"$f":"MONTH(P_kuupäev)","v":1}]
[null,"P109","2013-05-04","Pihel",{"$f":"VLOOKUP(P_ostja, o_tab, 2, 0)","v":"Rapla"},"kuusk",1,"Karu",12,{"$f":"VLOOKUP(P_liik, P_hinnad, P_sort+1, 0)","v":80},{"$f":"P_hind * P_kogus","v":960},{"$f":"MONTH(P_kuupäev)","v":5}]
[null,null,null,null,null,"kuusk Total",null,null,{"$f":"SUBTOTAL(9,I388:I389)","v":64},null,{"$f":"SUBTOTAL(9,K388:K389)","v":4288}]
[null,"P288","2013-12-22","Pihel",{"$f":"VLOOKUP(P_ostja, o_tab, 2, 0)","v":"Rapla"},"küte",1,"Jänes",12,{"$f":"VLOOKUP(P_liik, P_hinnad, P_sort+1, 0)","v":47},{"$f":"P_hind * P_kogus","v":564},{"$f":"MONTH(P_kuupäev)","v":12}]
[null,null,null,null,null,"küte Total",null,null,{"$f":"SUBTOTAL(9,I391:I391)","v":12},null,{"$f":"SUBTOTAL(9,K391:K391)","v":564}]
[null,"P121","2013-05-16","Pihel",{"$f":"VLOOKUP(P_ostja, o_tab, 2, 0)","v":"Rapla"},"lepp",1,"Karu",17,{"$f":"VLOOKUP(P_liik, P_hinnad, P_sort+1, 0)","v":65},{"$f":"P_hind * P_kogus","v":1105},{"$f":"MONTH(P_kuupäev)","v":5}]
[null,null,null,null,null,"lepp Total",null,null,{"$f":"SUBTOTAL(9,I393:I393)","v":17},null,{"$f":"SUBTOTAL(9,K393:K393)","v":1105}]
[null,"P169","2013-07-27","Pihel",{"$f":"VLOOKUP(P_ostja, o_tab, 2, 0)","v":"Rapla"},"mänd",1,"Jänes",19,{"$f":"VLOOKUP(P_liik, P_hinnad, P_sort+1, 0)","v":75},{"$f":"P_hind * P_kogus","v":1425},{"$f":"MONTH(P_kuupäev)","v":7}]
[null,"P183","2013-08-15","Pihel",{"$f":"VLOOKUP(P_ostja, o_tab, 2, 0)","v":"Rapla"},"mänd",2,"Jänes",56,{"$f":"VLOOKUP(P_liik, P_hinnad, P_sort+1, 0)","v":68},{"$f":"P_hind * P_kogus","v":3808},{"$f":"MONTH(P_kuupäev)","v":8}]
[null,"P224","2013-10-03","Pihel",{"$f":"VLOOKUP(P_ostja, o_tab, 2, 0)","v":"Rapla"},"mänd",1,"Ilves",60,{"$f":"VLOOKUP(P_liik, P_hinnad, P_sort+1, 0)","v":75},{"$f":"P_hind * P_kogus","v":4500},{"$f":"MONTH(P_kuupäev)","v":10}]
[null,null,null,null,null,"mänd Total",null,null,{"$f":"SUBTOTAL(9,I395:I397)","v":135},null,{"$f":"SUBTOTAL(9,K395:K397)","v":9733}]
[null,null,null,"Pihel Total",null,null,null,null,{"$f":"SUBTOTAL(9,I385:I397)","v":338},null,{"$f":"SUBTOTAL(9,K385:K397)","v":22102}]
[null,"P058","2013-03-11","Vaher",{"$f":"VLOOKUP(P_ostja, o_tab, 2, 0)","v":"Rapla"},"haab",1,"Hunt",59,{"$f":"VLOOKUP(P_liik, P_hinnad, P_sort+1, 0)","v":50},{"$f":"P_hind * P_kogus","v":2950},{"$f":"MONTH(P_kuupäev)","v":3}]
[null,"P223","2013-10-02","Vaher",{"$f":"VLOOKUP(P_ostja, o_tab, 2, 0)","v":"Rapla"},"haab",1,"Siil",31,{"$f":"VLOOKUP(P_liik, P_hinnad, P_sort+1, 0)","v":50},{"$f":"P_hind * P_kogus","v":1550},{"$f":"MONTH(P_kuupäev)","v":10}]
[null,null,null,null,null,"haab Total",null,null,{"$f":"SUBTOTAL(9,I400:I401)","v":90},null,{"$f":"SUBTOTAL(9,K400:K401)","v":4500}]
[null,"P045","2013-02-26","Vaher",{"$f":"VLOOKUP(P_ostja, o_tab, 2, 0)","v":"Rapla"},"kask",1,"Hunt",35,{"$f":"VLOOKUP(P_liik, P_hinnad, P_sort+1, 0)","v":70},{"$f":"P_hind * P_kogus","v":2450},{"$f":"MONTH(P_kuupäev)","v":2}]
[null,"P058","2013-03-11","Vaher",{"$f":"VLOOKUP(P_ostja, o_tab, 2, 0)","v":"Rapla"},"kask",1,"Hunt",25,{"$f":"VLOOKUP(P_liik, P_hinnad, P_sort+1, 0)","v":70},{"$f":"P_hind * P_kogus","v":1750},{"$f":"MONTH(P_kuupäev)","v":3}]
[null,"P058","2013-03-11","Vaher",{"$f":"VLOOKUP(P_ostja, o_tab, 2, 0)","v":"Rapla"},"kask",1,"Hunt",11,{"$f":"VLOOKUP(P_liik, P_hinnad, P_sort+1, 0)","v":70},{"$f":"P_hind * P_kogus","v":770},{"$f":"MONTH(P_kuupäev)","v":3}]
[null,null,null,null,null,"kask Total",null,null,{"$f":"SUBTOTAL(9,I403:I405)","v":71},null,{"$f":"SUBTOTAL(9,K403:K405)","v":4970}]
[null,"P033","2013-02-04","Vaher",{"$f":"VLOOKUP(P_ostja, o_tab, 2, 0)","v":"Rapla"},"kuusk",3,"Karu",66,{"$f":"VLOOKUP(P_liik, P_hinnad, P_sort+1, 0)","v":64},{"$f":"P_hind * P_kogus","v":4224},{"$f":"MONTH(P_kuupäev)","v":2}]
[null,"P287","2013-12-21","Vaher",{"$f":"VLOOKUP(P_ostja, o_tab, 2, 0)","v":"Rapla"},"kuusk",3,"Siil",32,{"$f":"VLOOKUP(P_liik, P_hinnad, P_sort+1, 0)","v":64},{"$f":"P_hind * P_kogus","v":2048},{"$f":"MONTH(P_kuupäev)","v":12}]
[null,null,null,null,null,"kuusk Total",null,null,{"$f":"SUBTOTAL(9,I407:I408)","v":98},null,{"$f":"SUBTOTAL(9,K407:K408)","v":6272}]
[null,"P159","2013-07-11","Vaher",{"$f":"VLOOKUP(P_ostja, o_tab, 2, 0)","v":"Rapla"},"küte",1,"Põder",61,{"$f":"VLOOKUP(P_liik, P_hinnad, P_sort+1, 0)","v":47},{"$f":"P_hind * P_kogus","v":2867},{"$f":"MONTH(P_kuupäev)","v":7}]
[null,null,null,null,null,"küte Total",null,null,{"$f":"SUBTOTAL(9,I410:I410)","v":61},null,{"$f":"SUBTOTAL(9,K410:K410)","v":2867}]
[null,"P179","2013-08-06","Vaher",{"$f":"VLOOKUP(P_ostja, o_tab, 2, 0)","v":"Rapla"},"lepp",2,"Põder",63,{"$f":"VLOOKUP(P_liik, P_hinnad, P_sort+1, 0)","v":59},{"$f":"P_hind * P_kogus","v":3717},{"$f":"MONTH(P_kuupäev)","v":8}]
[null,"P202","2013-09-04","Vaher",{"$f":"VLOOKUP(P_ostja, o_tab, 2, 0)","v":"Rapla"},"lepp",2,"Põder",65,{"$f":"VLOOKUP(P_liik, P_hinnad, P_sort+1, 0)","v":59},{"$f":"P_hind * P_kogus","v":3835},{"$f":"MONTH(P_kuupäev)","v":9}]
[null,"P277","2013-12-03","Vaher",{"$f":"VLOOKUP(P_ostja, o_tab, 2, 0)","v":"Rapla"},"lepp",2,"Jänes",21,{"$f":"VLOOKUP(P_liik, P_hinnad, P_sort+1, 0)","v":59},{"$f":"P_hind * P_kogus","v":1239},{"$f":"MONTH(P_kuupäev)","v":12}]
[null,null,null,null,null,"lepp Total",null,null,{"$f":"SUBTOTAL(9,I412:I414)","v":149},null,{"$f":"SUBTOTAL(9,K412:K414)","v":8791}]
[null,"P008","2013-01-07","Vaher",{"$f":"VLOOKUP(P_ostja, o_tab, 2, 0)","v":"Rapla"},"saar",3,"Hunt",23,{"$f":"VLOOKUP(P_liik, P_hinnad, P_sort+1, 0)","v":68},{"$f":"P_hind * P_kogus","v":1564},{"$f":"MONTH(P_kuupäev)","v":1}]
[null,"P291","2013-12-27","Vaher",{"$f":"VLOOKUP(P_ostja, o_tab, 2, 0)","v":"Rapla"},"saar",2,"Ilves",36,{"$f":"VLOOKUP(P_liik, P_hinnad, P_sort+1, 0)","v":77},{"$f":"P_hind * P_kogus","v":2772},{"$f":"MONTH(P_kuupäev)","v":12}]
[null,"P291","2013-12-27","Vaher",{"$f":"VLOOKUP(P_ostja, o_tab, 2, 0)","v":"Rapla"},"saar",3,"Ilves",26,{"$f":"VLOOKUP(P_liik, P_hinnad, P_sort+1, 0)","v":68},{"$f":"P_hind * P_kogus","v":1768},{"$f":"MONTH(P_kuupäev)","v":12}]
[null,null,null,null,null,"saar Total",null,null,{"$f":"SUBTOTAL(9,I416:I418)","v":85},null,{"$f":"SUBTOTAL(9,K416:K418)","v":6104}]
[null,"P289","2013-12-23","Vaher",{"$f":"VLOOKUP(P_ostja, o_tab, 2, 0)","v":"Rapla"},"vaher",1,"Hunt",18,{"$f":"VLOOKUP(P_liik, P_hinnad, P_sort+1, 0)","v":95},{"$f":"P_hind * P_kogus","v":1710},{"$f":"MONTH(P_kuupäev)","v":12}]
[null,null,null,null,null,"vaher Total",null,null,{"$f":"SUBTOTAL(9,I420:I420)","v":18},null,{"$f":"SUBTOTAL(9,K420:K420)","v":1710}]
[null,null,null,"Vaher Total",null,null,null,null,{"$f":"SUBTOTAL(9,I400:I420)","v":572},null,{"$f":"SUBTOTAL(9,K400:K420)","v":35214}]
[null,"P282","2013-12-11","Vares",{"$f":"VLOOKUP(P_ostja, o_tab, 2, 0)","v":"Rapla"},"kuusk",2,"Karu",78,{"$f":"VLOOKUP(P_liik, P_hinnad, P_sort+1, 0)","v":72},{"$f":"P_hind * P_kogus","v":5616},{"$f":"MONTH(P_kuupäev)","v":12}]
[null,null,null,null,null,"kuusk Total",null,null,{"$f":"SUBTOTAL(9,I423:I423)","v":78},null,{"$f":"SUBTOTAL(9,K423:K423)","v":5616}]
[null,"P013","2013-01-13","Vares",{"$f":"VLOOKUP(P_ostja, o_tab, 2, 0)","v":"Rapla"},"küte",2,"Jänes",25,{"$f":"VLOOKUP(P_liik, P_hinnad, P_sort+1, 0)","v":42},{"$f":"P_hind * P_kogus","v":1050},{"$f":"MONTH(P_kuupäev)","v":1}]
[null,"P013","2013-01-13","Vares",{"$f":"VLOOKUP(P_ostja, o_tab, 2, 0)","v":"Rapla"},"küte",1,"Jänes",22,{"$f":"VLOOKUP(P_liik, P_hinnad, P_sort+1, 0)","v":47},{"$f":"P_hind * P_kogus","v":1034},{"$f":"MONTH(P_kuupäev)","v":1}]
[null,null,null,null,null,"küte Total",null,null,{"$f":"SUBTOTAL(9,I425:I426)","v":47},null,{"$f":"SUBTOTAL(9,K425:K426)","v":2084}]
[null,"P071","2013-03-26","Vares",{"$f":"VLOOKUP(P_ostja, o_tab, 2, 0)","v":"Rapla"},"lepp",2,"Siil",52,{"$f":"VLOOKUP(P_liik, P_hinnad, P_sort+1, 0)","v":59},{"$f":"P_hind * P_kogus","v":3068},{"$f":"MONTH(P_kuupäev)","v":3}]
[null,"P282","2013-12-11","Vares",{"$f":"VLOOKUP(P_ostja, o_tab, 2, 0)","v":"Rapla"},"lepp",1,"Karu",53,{"$f":"VLOOKUP(P_liik, P_hinnad, P_sort+1, 0)","v":65},{"$f":"P_hind * P_kogus","v":3445},{"$f":"MONTH(P_kuupäev)","v":12}]
[null,null,null,null,null,"lepp Total",null,null,{"$f":"SUBTOTAL(9,I428:I429)","v":105},null,{"$f":"SUBTOTAL(9,K428:K429)","v":6513}]
[null,"P282","2013-12-11","Vares",{"$f":"VLOOKUP(P_ostja, o_tab, 2, 0)","v":"Rapla"},"saar",1,"Karu",26,{"$f":"VLOOKUP(P_liik, P_hinnad, P_sort+1, 0)","v":85},{"$f":"P_hind * P_kogus","v":2210},{"$f":"MONTH(P_kuupäev)","v":12}]
[null,null,null,null,null,"saar Total",null,null,{"$f":"SUBTOTAL(9,I431:I431)","v":26},null,{"$f":"SUBTOTAL(9,K431:K431)","v":2210}]
[null,"P013","2013-01-13","Vares",{"$f":"VLOOKUP(P_ostja, o_tab, 2, 0)","v":"Rapla"},"tamm",1,"Jänes",28,{"$f":"VLOOKUP(P_liik, P_hinnad, P_sort+1, 0)","v":110},{"$f":"P_hind * P_kogus","v":3080},{"$f":"MONTH(P_kuupäev)","v":1}]
[null,"P084","2013-04-11","Vares",{"$f":"VLOOKUP(P_ostja, o_tab, 2, 0)","v":"Rapla"},"tamm",1,"Hunt",20,{"$f":"VLOOKUP(P_liik, P_hinnad, P_sort+1, 0)","v":110},{"$f":"P_hind * P_kogus","v":2200},{"$f":"MONTH(P_kuupäev)","v":4}]
[null,"P111","2013-05-08","Vares",{"$f":"VLOOKUP(P_ostja, o_tab, 2, 0)","v":"Rapla"},"tamm",3,"Jänes",40,{"$f":"VLOOKUP(P_liik, P_hinnad, P_sort+1, 0)","v":88},{"$f":"P_hind * P_kogus","v":3520},{"$f":"MONTH(P_kuupäev)","v":5}]
[null,null,null,null,null,"tamm Total",null,null,{"$f":"SUBTOTAL(9,I433:I435)","v":88},null,{"$f":"SUBTOTAL(9,K433:K435)","v":8800}]
[null,null,null,"Vares Total",null,null,null,null,{"$f":"SUBTOTAL(9,I423:I435)","v":344},null,{"$f":"SUBTOTAL(9,K423:K435)","v":25223}]
[null,null,null,null,"Rapla Total",null,null,null,{"$f":"SUBTOTAL(9,I385:I435)","v":1254},null,{"$f":"SUBTOTAL(9,K385:K435)","v":82539}]
[null,"P030","2013-02-01","Lind",{"$f":"VLOOKUP(P_ostja, o_tab, 2, 0)","v":"Valga"},"haab",2,"Põder",44,{"$f":"VLOOKUP(P_liik, P_hinnad, P_sort+1, 0)","v":45},{"$f":"P_hind * P_kogus","v":1980},{"$f":"MONTH(P_kuupäev)","v":2}]
[null,"P078","2013-04-04","Lind",{"$f":"VLOOKUP(P_ostja, o_tab, 2, 0)","v":"Valga"},"haab",1,"Ilves",54,{"$f":"VLOOKUP(P_liik, P_hinnad, P_sort+1, 0)","v":50},{"$f":"P_hind * P_kogus","v":2700},{"$f":"MONTH(P_kuupäev)","v":4}]
[null,null,null,null,null,"haab Total",null,null,{"$f":"SUBTOTAL(9,I439:I440)","v":98},null,{"$f":"SUBTOTAL(9,K439:K440)","v":4680}]
[null,"P029","2013-02-01","Lind",{"$f":"VLOOKUP(P_ostja, o_tab, 2, 0)","v":"Valga"},"kask",3,"Karu",75,{"$f":"VLOOKUP(P_liik, P_hinnad, P_sort+1, 0)","v":56},{"$f":"P_hind * P_kogus","v":4200},{"$f":"MONTH(P_kuupäev)","v":2}]
[null,"P135","2013-06-05","Lind",{"$f":"VLOOKUP(P_ostja, o_tab, 2, 0)","v":"Valga"},"kask",2,"Rebane",23,{"$f":"VLOOKUP(P_liik, P_hinnad, P_sort+1, 0)","v":63},{"$f":"P_hind * P_kogus","v":1449},{"$f":"MONTH(P_kuupäev)","v":6}]
[null,null,null,null,null,"kask Total",null,null,{"$f":"SUBTOTAL(9,I442:I443)","v":98},null,{"$f":"SUBTOTAL(9,K442:K443)","v":5649}]
[null,"P007","2013-01-07","Lind",{"$f":"VLOOKUP(P_ostja, o_tab, 2, 0)","v":"Valga"},"kuusk",2,"Jänes",11,{"$f":"VLOOKUP(P_liik, P_hinnad, P_sort+1, 0)","v":72},{"$f":"P_hind * P_kogus","v":792},{"$f":"MONTH(P_kuupäev)","v":1}]
[null,"P067","2013-03-23","Lind",{"$f":"VLOOKUP(P_ostja, o_tab, 2, 0)","v":"Valga"},"kuusk",1,"Karu",11,{"$f":"VLOOKUP(P_liik, P_hinnad, P_sort+1, 0)","v":80},{"$f":"P_hind * P_kogus","v":880},{"$f":"MONTH(P_kuupäev)","v":3}]
[null,"P096","2013-04-23","Lind",{"$f":"VLOOKUP(P_ostja, o_tab, 2, 0)","v":"Valga"},"kuusk",3,"Ilves",45,{"$f":"VLOOKUP(P_liik, P_hinnad, P_sort+1, 0)","v":64},{"$f":"P_hind * P_kogus","v":2880},{"$f":"MONTH(P_kuupäev)","v":4}]
[null,"P144","2013-06-17","Lind",{"$f":"VLOOKUP(P_ostja, o_tab, 2, 0)","v":"Valga"},"kuusk",3,"Rebane",26,{"$f":"VLOOKUP(P_liik, P_hinnad, P_sort+1, 0)","v":64},{"$f":"P_hind * P_kogus","v":1664},{"$f":"MONTH(P_kuupäev)","v":6}]
[null,"P201","2013-09-02","Lind",{"$f":"VLOOKUP(P_ostja, o_tab, 2, 0)","v":"Valga"},"kuusk",2,"Rebane",71,{"$f":"VLOOKUP(P_liik, P_hinnad, P_sort+1, 0)","v":72},{"$f":"P_hind * P_kogus","v":5112},{"$f":"MONTH(P_kuupäev)","v":9}]
[null,"P236","2013-10-15","Lind",{"$f":"VLOOKUP(P_ostja, o_tab, 2, 0)","v":"Valga"},"kuusk",1,"Jänes",77,{"$f":"VLOOKUP(P_liik, P_hinnad, P_sort+1, 0)","v":80},{"$f":"P_hind * P_kogus","v":6160},{"$f":"MONTH(P_kuupäev)","v":10}]
[null,"P258","2013-11-08","Lind",{"$f":"VLOOKUP(P_ostja, o_tab, 2, 0)","v":"Valga"},"kuusk",2,"Karu",45,{"$f":"VLOOKUP(P_liik, P_hinnad, P_sort+1, 0)","v":72},{"$f":"P_hind * P_kogus","v":3240},{"$f":"MONTH(P_kuupäev)","v":11}]
[null,null,null,null,null,"kuusk Total",null,null,{"$f":"SUBTOTAL(9,I445:I451)","v":286},null,{"$f":"SUBTOTAL(9,K445:K451)","v":20728}]
[null,"P113","2013-05-10","Lind",{"$f":"VLOOKUP(P_ostja, o_tab, 2, 0)","v":"Valga"},"küte",1,"Jänes",49,{"$f":"VLOOKUP(P_liik, P_hinnad, P_sort+1, 0)","v":47},{"$f":"P_hind * P_kogus","v":2303},{"$f":"MONTH(P_kuupäev)","v":5}]
[null,"P118","2013-05-15","Lind",{"$f":"VLOOKUP(P_ostja, o_tab, 2, 0)","v":"Valga"},"küte",1,"Rebane",44,{"$f":"VLOOKUP(P_liik, P_hinnad, P_sort+1, 0)","v":47},{"$f":"P_hind * P_kogus","v":2068},{"$f":"MONTH(P_kuupäev)","v":5}]
[null,"P160","2013-07-12","Lind",{"$f":"VLOOKUP(P_ostja, o_tab, 2, 0)","v":"Valga"},"küte",2,"Põder",39,{"$f":"VLOOKUP(P_liik, P_hinnad, P_sort+1, 0)","v":42},{"$f":"P_hind * P_kogus","v":1638},{"$f":"MONTH(P_kuupäev)","v":7}]
[null,"P209","2013-09-16","Lind",{"$f":"VLOOKUP(P_ostja, o_tab, 2, 0)","v":"Valga"},"küte",2,"Siil",20,{"$f":"VLOOKUP(P_liik, P_hinnad, P_sort+1, 0)","v":42},{"$f":"P_hind * P_kogus","v":840},{"$f":"MONTH(P_kuupäev)","v":9}]
[null,null,null,null,null,"küte Total",null,null,{"$f":"SUBTOTAL(9,I453:I456)","v":152},null,{"$f":"SUBTOTAL(9,K453:K456)","v":6849}]
[null,"P140","2013-06-12","Lind",{"$f":"VLOOKUP(P_ostja, o_tab, 2, 0)","v":"Valga"},"lepp",1,"Karu",72,{"$f":"VLOOKUP(P_liik, P_hinnad, P_sort+1, 0)","v":65},{"$f":"P_hind * P_kogus","v":4680},{"$f":"MONTH(P_kuupäev)","v":6}]
[null,"P185","2013-08-18","Lind",{"$f":"VLOOKUP(P_ostja, o_tab, 2, 0)","v":"Valga"},"lepp",1,"Karu",25,{"$f":"VLOOKUP(P_liik, P_hinnad, P_sort+1, 0)","v":65},{"$f":"P_hind * P_kogus","v":1625},{"$f":"MONTH(P_kuupäev)","v":8}]
[null,"P185","2013-08-18","Lind",{"$f":"VLOOKUP(P_ostja, o_tab, 2, 0)","v":"Valga"},"lepp",1,"Karu",18,{"$f":"VLOOKUP(P_liik, P_hinnad, P_sort+1, 0)","v":65},{"$f":"P_hind * P_kogus","v":1170},{"$f":"MONTH(P_kuupäev)","v":8}]
[null,"P201","2013-09-02","Lind",{"$f":"VLOOKUP(P_ostja, o_tab, 2, 0)","v":"Valga"},"lepp",1,"Rebane",75,{"$f":"VLOOKUP(P_liik, P_hinnad, P_sort+1, 0)","v":65},{"$f":"P_hind * P_kogus","v":4875},{"$f":"MONTH(P_kuupäev)","v":9}]
[null,"P258","2013-11-08","Lind",{"$f":"VLOOKUP(P_ostja, o_tab, 2, 0)","v":"Valga"},"lepp",2,"Karu",18,{"$f":"VLOOKUP(P_liik, P_hinnad, P_sort+1, 0)","v":59},{"$f":"P_hind * P_kogus","v":1062},{"$f":"MONTH(P_kuupäev)","v":11}]
[null,null,null,null,null,"lepp Total",null,null,{"$f":"SUBTOTAL(9,I458:I462)","v":208},null,{"$f":"SUBTOTAL(9,K458:K462)","v":13412}]
[null,"P078","2013-04-04","Lind",{"$f":"VLOOKUP(P_ostja, o_tab, 2, 0)","v":"Valga"},"mänd",1,"Hunt",8,{"$f":"VLOOKUP(P_liik, P_hinnad, P_sort+1, 0)","v":75},{"$f":"P_hind * P_kogus","v":600},{"$f":"MONTH(P_kuupäev)","v":4}]
[null,"P103","2013-04-29","Lind",{"$f":"VLOOKUP(P_ostja, o_tab, 2, 0)","v":"Valga"},"mänd",1,"Hunt",37,{"$f":"VLOOKUP(P_liik, P_hinnad, P_sort+1, 0)","v":75},{"$f":"P_hind * P_kogus","v":2775},{"$f":"MONTH(P_kuupäev)","v":4}]
[null,"P103","2013-04-29","Lind",{"$f":"VLOOKUP(P_ostja, o_tab, 2, 0)","v":"Valga"},"mänd",2,"Hunt",33,{"$f":"VLOOKUP(P_liik, P_hinnad, P_sort+1, 0)","v":68},{"$f":"P_hind * P_kogus","v":2244},{"$f":"MONTH(P_kuupäev)","v":4}]
[null,"P113","2013-05-10","Lind",{"$f":"VLOOKUP(P_ostja, o_tab, 2, 0)","v":"Valga"},"mänd",1,"Jänes",54,{"$f":"VLOOKUP(P_liik, P_hinnad, P_sort+1, 0)","v":75},{"$f":"P_hind * P_kogus","v":4050},{"$f":"MONTH(P_kuupäev)","v":5}]
[null,"P144","2013-06-17","Lind",{"$f":"VLOOKUP(P_ostja, o_tab, 2, 0)","v":"Valga"},"mänd",1,"Rebane",67,{"$f":"VLOOKUP(P_liik, P_hinnad, P_sort+1, 0)","v":75},{"$f":"P_hind * P_kogus","v":5025},{"$f":"MONTH(P_kuupäev)","v":6}]
[null,"P162","2013-07-14","Lind",{"$f":"VLOOKUP(P_ostja, o_tab, 2, 0)","v":"Valga"},"mänd",1,"Karu",52,{"$f":"VLOOKUP(P_liik, P_hinnad, P_sort+1, 0)","v":75},{"$f":"P_hind * P_kogus","v":3900},{"$f":"MONTH(P_kuupäev)","v":7}]
[null,null,null,null,null,"mänd Total",null,null,{"$f":"SUBTOTAL(9,I464:I469)","v":251},null,{"$f":"SUBTOTAL(9,K464:K469)","v":18594}]
[null,"P065","2013-03-21","Lind",{"$f":"VLOOKUP(P_ostja, o_tab, 2, 0)","v":"Valga"},"saar",3,"Karu",18,{"$f":"VLOOKUP(P_liik, P_hinnad, P_sort+1, 0)","v":68},{"$f":"P_hind * P_kogus","v":1224},{"$f":"MONTH(P_kuupäev)","v":3}]
[null,"P160","2013-07-12","Lind",{"$f":"VLOOKUP(P_ostja, o_tab, 2, 0)","v":"Valga"},"saar",3,"Põder",23,{"$f":"VLOOKUP(P_liik, P_hinnad, P_sort+1, 0)","v":68},{"$f":"P_hind * P_kogus","v":1564},{"$f":"MONTH(P_kuupäev)","v":7}]
[null,"P168","2013-07-25","Lind",{"$f":"VLOOKUP(P_ostja, o_tab, 2, 0)","v":"Valga"},"saar",1,"Põder",45,{"$f":"VLOOKUP(P_liik, P_hinnad, P_sort+1, 0)","v":85},{"$f":"P_hind * P_kogus","v":3825},{"$f":"MONTH(P_kuupäev)","v":7}]
[null,null,null,null,null,"saar Total",null,null,{"$f":"SUBTOTAL(9,I471:I473)","v":86},null,{"$f":"SUBTOTAL(9,K471:K473)","v":6613}]
[null,"P096","2013-04-23","Lind",{"$f":"VLOOKUP(P_ostja, o_tab, 2, 0)","v":"Valga"},"tamm",1,"Jänes",37,{"$f":"VLOOKUP(P_liik, P_hinnad, P_sort+1, 0)","v":110},{"$f":"P_hind * P_kogus","v":4070},{"$f":"MONTH(P_kuupäev)","v":4}]
[null,null,null,null,null,"tamm Total",null,null,{"$f":"SUBTOTAL(9,I475:I475)","v":37},null,{"$f":"SUBTOTAL(9,K475:K475)","v":4070}]
[null,"P140","2013-06-12","Lind",{"$f":"VLOOKUP(P_ostja, o_tab, 2, 0)","v":"Valga"},"vaher",3,"Karu",12,{"$f":"VLOOKUP(P_liik, P_hinnad, P_sort+1, 0)","v":76},{"$f":"P_hind * P_kogus","v":912},{"$f":"MONTH(P_kuupäev)","v":6}]
[null,null,null,null,null,"vaher Total",null,null,{"$f":"SUBTOTAL(9,I477:I477)","v":12},null,{"$f":"SUBTOTAL(9,K477:K477)","v":912}]
[null,null,null,"Lind Total",null,null,null,null,{"$f":"SUBTOTAL(9,I439:I477)","v":1228},null,{"$f":"SUBTOTAL(9,K439:K477)","v":81507}]
[null,"P156","2013-07-08","Saar",{"$f":"VLOOKUP(P_ostja, o_tab, 2, 0)","v":"Valga"},"haab",1,"Rebane",24,{"$f":"VLOOKUP(P_liik, P_hinnad, P_sort+1, 0)","v":50},{"$f":"P_hind * P_kogus","v":1200},{"$f":"MONTH(P_kuupäev)","v":7}]
[null,"P279","2013-12-08","Saar",{"$f":"VLOOKUP(P_ostja, o_tab, 2, 0)","v":"Valga"},"haab",1,"Rebane",21,{"$f":"VLOOKUP(P_liik, P_hinnad, P_sort+1, 0)","v":50},{"$f":"P_hind * P_kogus","v":1050},{"$f":"MONTH(P_kuupäev)","v":12}]
[null,null,null,null,null,"haab Total",null,null,{"$f":"SUBTOTAL(9,I480:I481)","v":45},null,{"$f":"SUBTOTAL(9,K480:K481)","v":2250}]
[null,"P101","2013-04-27","Saar",{"$f":"VLOOKUP(P_ostja, o_tab, 2, 0)","v":"Valga"},"kask",1,"Hunt",15,{"$f":"VLOOKUP(P_liik, P_hinnad, P_sort+1, 0)","v":70},{"$f":"P_hind * P_kogus","v":1050},{"$f":"MONTH(P_kuupäev)","v":4}]
[null,null,null,null,null,"kask Total",null,null,{"$f":"SUBTOTAL(9,I483:I483)","v":15},null,{"$f":"SUBTOTAL(9,K483:K483)","v":1050}]
[null,"P040","2013-02-19","Saar",{"$f":"VLOOKUP(P_ostja, o_tab, 2, 0)","v":"Valga"},"kuusk",1,"Jänes",22,{"$f":"VLOOKUP(P_liik, P_hinnad, P_sort+1, 0)","v":80},{"$f":"P_hind * P_kogus","v":1760},{"$f":"MONTH(P_kuupäev)","v":2}]
[null,"P276","2013-12-02","Saar",{"$f":"VLOOKUP(P_ostja, o_tab, 2, 0)","v":"Valga"},"kuusk",1,"Karu",36,{"$f":"VLOOKUP(P_liik, P_hinnad, P_sort+1, 0)","v":80},{"$f":"P_hind * P_kogus","v":2880},{"$f":"MONTH(P_kuupäev)","v":12}]
[null,"P296","2013-12-30","Saar",{"$f":"VLOOKUP(P_ostja, o_tab, 2, 0)","v":"Valga"},"kuusk",1,"Jänes",25,{"$f":"VLOOKUP(P_liik, P_hinnad, P_sort+1, 0)","v":80},{"$f":"P_hind * P_kogus","v":2000},{"$f":"MONTH(P_kuupäev)","v":12}]
[null,null,null,null,null,"kuusk Total",null,null,{"$f":"SUBTOTAL(9,I485:I487)","v":83},null,{"$f":"SUBTOTAL(9,K485:K487)","v":6640}]
[null,"P128","2013-05-23","Saar",{"$f":"VLOOKUP(P_ostja, o_tab, 2, 0)","v":"Valga"},"küte",3,"Karu",30,{"$f":"VLOOKUP(P_liik, P_hinnad, P_sort+1, 0)","v":38},{"$f":"P_hind * P_kogus","v":1140},{"$f":"MONTH(P_kuupäev)","v":5}]
[null,"P133","2013-06-02","Saar",{"$f":"VLOOKUP(P_ostja, o_tab, 2, 0)","v":"Valga"},"küte",1,"Hunt",51,{"$f":"VLOOKUP(P_liik, P_hinnad, P_sort+1, 0)","v":47},{"$f":"P_hind * P_kogus","v":2397},{"$f":"MONTH(P_kuupäev)","v":6}]
[null,"P197","2013-08-29","Saar",{"$f":"VLOOKUP(P_ostja, o_tab, 2, 0)","v":"Valga"},"küte",2,"Rebane",52,{"$f":"VLOOKUP(P_liik, P_hinnad, P_sort+1, 0)","v":42},{"$f":"P_hind * P_kogus","v":2184},{"$f":"MONTH(P_kuupäev)","v":8}]
[null,"P248","2013-10-27","Saar",{"$f":"VLOOKUP(P_ostja, o_tab, 2, 0)","v":"Valga"},"küte",2,"Rebane",77,{"$f":"VLOOKUP(P_liik, P_hinnad, P_sort+1, 0)","v":42},{"$f":"P_hind * P_kogus","v":3234},{"$f":"MONTH(P_kuupäev)","v":10}]
[null,null,null,null,null,"küte Total",null,null,{"$f":"SUBTOTAL(9,I489:I492)","v":210},null,{"$f":"SUBTOTAL(9,K489:K492)","v":8955}]
[null,"P175","2013-08-02","Saar",{"$f":"VLOOKUP(P_ostja, o_tab, 2, 0)","v":"Valga"},"lepp",1,"Karu",21,{"$f":"VLOOKUP(P_liik, P_hinnad, P_sort+1, 0)","v":65},{"$f":"P_hind * P_kogus","v":1365},{"$f":"MONTH(P_kuupäev)","v":8}]
[null,"P191","2013-08-23","Saar",{"$f":"VLOOKUP(P_ostja, o_tab, 2, 0)","v":"Valga"},"lepp",1,"Siil",31,{"$f":"VLOOKUP(P_liik, P_hinnad, P_sort+1, 0)","v":65},{"$f":"P_hind * P_kogus","v":2015},{"$f":"MONTH(P_kuupäev)","v":8}]
[null,null,null,null,null,"lepp Total",null,null,{"$f":"SUBTOTAL(9,I494:I495)","v":52},null,{"$f":"SUBTOTAL(9,K494:K495)","v":3380}]
[null,"P055","2013-03-06","Saar",{"$f":"VLOOKUP(P_ostja, o_tab, 2, 0)","v":"Valga"},"mänd",2,"Jänes",49,{"$f":"VLOOKUP(P_liik, P_hinnad, P_sort+1, 0)","v":68},{"$f":"P_hind * P_kogus","v":3332},{"$f":"MONTH(P_kuupäev)","v":3}]
[null,"P056","2013-03-08","Saar",{"$f":"VLOOKUP(P_ostja, o_tab, 2, 0)","v":"Valga"},"mänd",3,"Rebane",28,{"$f":"VLOOKUP(P_liik, P_hinnad, P_sort+1, 0)","v":60},{"$f":"P_hind * P_kogus","v":1680},{"$f":"MONTH(P_kuupäev)","v":3}]
[null,"P175","2013-08-02","Saar",{"$f":"VLOOKUP(P_ostja, o_tab, 2, 0)","v":"Valga"},"mänd",2,"Karu",14,{"$f":"VLOOKUP(P_liik, P_hinnad, P_sort+1, 0)","v":68},{"$f":"P_hind * P_kogus","v":952},{"$f":"MONTH(P_kuupäev)","v":8}]
[null,"P263","2013-11-17","Saar",{"$f":"VLOOKUP(P_ostja, o_tab, 2, 0)","v":"Valga"},"mänd",1,"Hunt",20,{"$f":"VLOOKUP(P_liik, P_hinnad, P_sort+1, 0)","v":75},{"$f":"P_hind * P_kogus","v":1500},{"$f":"MONTH(P_kuupäev)","v":11}]
[null,null,null,null,null,"mänd Total",null,null,{"$f":"SUBTOTAL(9,I497:I500)","v":111},null,{"$f":"SUBTOTAL(9,K497:K500)","v":7464}]
[null,"P074","2013-04-01","Saar",{"$f":"VLOOKUP(P_ostja, o_tab, 2, 0)","v":"Valga"},"saar",1,"Põder",13,{"$f":"VLOOKUP(P_liik, P_hinnad, P_sort+1, 0)","v":85},{"$f":"P_hind * P_kogus","v":1105},{"$f":"MONTH(P_kuupäev)","v":4}]
[null,"P108","2013-05-04","Saar",{"$f":"VLOOKUP(P_ostja, o_tab, 2, 0)","v":"Valga"},"saar",2,"Ilves",37,{"$f":"VLOOKUP(P_liik, P_hinnad, P_sort+1, 0)","v":77},{"$f":"P_hind * P_kogus","v":2849},{"$f":"MONTH(P_kuupäev)","v":5}]
[null,null,null,null,null,"saar Total",null,null,{"$f":"SUBTOTAL(9,I502:I503)","v":50},null,{"$f":"SUBTOTAL(9,K502:K503)","v":3954}]
[null,"P101","2013-04-27","Saar",{"$f":"VLOOKUP(P_ostja, o_tab, 2, 0)","v":"Valga"},"vaher",3,"Hunt",24,{"$f":"VLOOKUP(P_liik, P_hinnad, P_sort+1, 0)","v":76},{"$f":"P_hind * P_kogus","v":1824},{"$f":"MONTH(P_kuupäev)","v":4}]
[null,null,null,null,null,"vaher Total",null,null,{"$f":"SUBTOTAL(9,I505:I505)","v":24},null,{"$f":"SUBTOTAL(9,K505:K505)","v":1824}]
[null,null,null,"Saar Total",null,null,null,null,{"$f":"SUBTOTAL(9,I480:I505)","v":590},null,{"$f":"SUBTOTAL(9,K480:K505)","v":35517}]
[null,null,null,null,"Valga Total",null,null,null,{"$f":"SUBTOTAL(9,I439:I505)","v":1818},null,{"$f":"SUBTOTAL(9,K439:K505)","v":117024}]
[null,"P037","2013-02-17","Kuusik",{"$f":"VLOOKUP(P_ostja, o_tab, 2, 0)","v":"Viljandi"},"haab",2,"Jänes",32,{"$f":"VLOOKUP(P_liik, P_hinnad, P_sort+1, 0)","v":45},{"$f":"P_hind * P_kogus","v":1440},{"$f":"MONTH(P_kuupäev)","v":2}]
[null,"P157","2013-07-09","Kuusik",{"$f":"VLOOKUP(P_ostja, o_tab, 2, 0)","v":"Viljandi"},"haab",2,"Hunt",11,{"$f":"VLOOKUP(P_liik, P_hinnad, P_sort+1, 0)","v":45},{"$f":"P_hind * P_kogus","v":495},{"$f":"MONTH(P_kuupäev)","v":7}]
[null,"P206","2013-09-12","Kuusik",{"$f":"VLOOKUP(P_ostja, o_tab, 2, 0)","v":"Viljandi"},"haab",2,"Ilves",70,{"$f":"VLOOKUP(P_liik, P_hinnad, P_sort+1, 0)","v":45},{"$f":"P_hind * P_kogus","v":3150},{"$f":"MONTH(P_kuupäev)","v":9}]
[null,"P264","2013-11-18","Kuusik",{"$f":"VLOOKUP(P_ostja, o_tab, 2, 0)","v":"Viljandi"},"haab",3,"Ilves",26,{"$f":"VLOOKUP(P_liik, P_hinnad, P_sort+1, 0)","v":40},{"$f":"P_hind * P_kogus","v":1040},{"$f":"MONTH(P_kuupäev)","v":11}]
[null,null,null,null,null,"haab Total",null,null,{"$f":"SUBTOTAL(9,I509:I512)","v":139},null,{"$f":"SUBTOTAL(9,K509:K512)","v":6125}]
[null,"P022","2013-01-25","Kuusik",{"$f":"VLOOKUP(P_ostja, o_tab, 2, 0)","v":"Viljandi"},"kask",1,"Karu",23,{"$f":"VLOOKUP(P_liik, P_hinnad, P_sort+1, 0)","v":70},{"$f":"P_hind * P_kogus","v":1610},{"$f":"MONTH(P_kuupäev)","v":1}]
[null,"P022","2013-01-25","Kuusik",{"$f":"VLOOKUP(P_ostja, o_tab, 2, 0)","v":"Viljandi"},"kask",1,"Karu",16,{"$f":"VLOOKUP(P_liik, P_hinnad, P_sort+1, 0)","v":70},{"$f":"P_hind * P_kogus","v":1120},{"$f":"MONTH(P_kuupäev)","v":1}]
[null,"P099","2013-04-25","Kuusik",{"$f":"VLOOKUP(P_ostja, o_tab, 2, 0)","v":"Viljandi"},"kask",1,"Hunt",31,{"$f":"VLOOKUP(P_liik, P_hinnad, P_sort+1, 0)","v":70},{"$f":"P_hind * P_kogus","v":2170},{"$f":"MONTH(P_kuupäev)","v":4}]
[null,"P206","2013-09-12","Kuusik",{"$f":"VLOOKUP(P_ostja, o_tab, 2, 0)","v":"Viljandi"},"kask",1,"Ilves",32,{"$f":"VLOOKUP(P_liik, P_hinnad, P_sort+1, 0)","v":70},{"$f":"P_hind * P_kogus","v":2240},{"$f":"MONTH(P_kuupäev)","v":9}]
[null,null,null,null,null,"kask Total",null,null,{"$f":"SUBTOTAL(9,I514:I517)","v":102},null,{"$f":"SUBTOTAL(9,K514:K517)","v":7140}]
[null,"P023","2013-01-25","Kuusik",{"$f":"VLOOKUP(P_ostja, o_tab, 2, 0)","v":"Viljandi"},"kuusk",1,"Jänes",24,{"$f":"VLOOKUP(P_liik, P_hinnad, P_sort+1, 0)","v":80},{"$f":"P_hind * P_kogus","v":1920},{"$f":"MONTH(P_kuupäev)","v":1}]
[null,"P157","2013-07-09","Kuusik",{"$f":"VLOOKUP(P_ostja, o_tab, 2, 0)","v":"Viljandi"},"kuusk",1,"Hunt",25,{"$f":"VLOOKUP(P_liik, P_hinnad, P_sort+1, 0)","v":80},{"$f":"P_hind * P_kogus","v":2000},{"$f":"MONTH(P_kuupäev)","v":7}]
[null,null,null,null,null,"kuusk Total",null,null,{"$f":"SUBTOTAL(9,I519:I520)","v":49},null,{"$f":"SUBTOTAL(9,K519:K520)","v":3920}]
[null,"P022","2013-01-25","Kuusik",{"$f":"VLOOKUP(P_ostja, o_tab, 2, 0)","v":"Viljandi"},"küte",2,"Karu",20,{"$f":"VLOOKUP(P_liik, P_hinnad, P_sort+1, 0)","v":42},{"$f":"P_hind * P_kogus","v":840},{"$f":"MONTH(P_kuupäev)","v":1}]
[null,"P047","2013-02-27","Kuusik",{"$f":"VLOOKUP(P_ostja, o_tab, 2, 0)","v":"Viljandi"},"küte",2,"Hunt",28,{"$f":"VLOOKUP(P_liik, P_hinnad, P_sort+1, 0)","v":42},{"$f":"P_hind * P_kogus","v":1176},{"$f":"MONTH(P_kuupäev)","v":2}]
[null,null,null,null,null,"küte Total",null,null,{"$f":"SUBTOTAL(9,I522:I523)","v":48},null,{"$f":"SUBTOTAL(9,K522:K523)","v":2016}]
[null,"P099","2013-04-25","Kuusik",{"$f":"VLOOKUP(P_ostja, o_tab, 2, 0)","v":"Viljandi"},"lepp",1,"Hunt",36,{"$f":"VLOOKUP(P_liik, P_hinnad, P_sort+1, 0)","v":65},{"$f":"P_hind * P_kogus","v":2340},{"$f":"MONTH(P_kuupäev)","v":4}]
[null,"P189","2013-08-22","Kuusik",{"$f":"VLOOKUP(P_ostja, o_tab, 2, 0)","v":"Viljandi"},"lepp",3,"Rebane",41,{"$f":"VLOOKUP(P_liik, P_hinnad, P_sort+1, 0)","v":52},{"$f":"P_hind * P_kogus","v":2132},{"$f":"MONTH(P_kuupäev)","v":8}]
[null,"P189","2013-08-22","Kuusik",{"$f":"VLOOKUP(P_ostja, o_tab, 2, 0)","v":"Viljandi"},"lepp",1,"Rebane",10,{"$f":"VLOOKUP(P_liik, P_hinnad, P_sort+1, 0)","v":65},{"$f":"P_hind * P_kogus","v":650},{"$f":"MONTH(P_kuupäev)","v":8}]
[null,"P270","2013-11-28","Kuusik",{"$f":"VLOOKUP(P_ostja, o_tab, 2, 0)","v":"Viljandi"},"lepp",3,"Rebane",27,{"$f":"VLOOKUP(P_liik, P_hinnad, P_sort+1, 0)","v":52},{"$f":"P_hind * P_kogus","v":1404},{"$f":"MONTH(P_kuupäev)","v":11}]
[null,null,null,null,null,"lepp Total",null,null,{"$f":"SUBTOTAL(9,I525:I528)","v":114},null,{"$f":"SUBTOTAL(9,K525:K528)","v":6526}]
[null,"P264","2013-11-18","Kuusik",{"$f":"VLOOKUP(P_ostja, o_tab, 2, 0)","v":"Viljandi"},"mänd",1,"Ilves",32,{"$f":"VLOOKUP(P_liik, P_hinnad, P_sort+1, 0)","v":75},{"$f":"P_hind * P_kogus","v":2400},{"$f":"MONTH(P_kuupäev)","v":11}]
[null,null,null,null,null,"mänd Total",null,null,{"$f":"SUBTOTAL(9,I530:I530)","v":32},null,{"$f":"SUBTOTAL(9,K530:K530)","v":2400}]
[null,"P192","2013-08-24","Kuusik",{"$f":"VLOOKUP(P_ostja, o_tab, 2, 0)","v":"Viljandi"},"tamm",2,"Põder",36,{"$f":"VLOOKUP(P_liik, P_hinnad, P_sort+1, 0)","v":99},{"$f":"P_hind * P_kogus","v":3564},{"$f":"MONTH(P_kuupäev)","v":8}]
[null,null,null,null,null,"tamm Total",null,null,{"$f":"SUBTOTAL(9,I532:I532)","v":36},null,{"$f":"SUBTOTAL(9,K532:K532)","v":3564}]
[null,null,null,"Kuusik Total",null,null,null,null,{"$f":"SUBTOTAL(9,I509:I532)","v":520},null,{"$f":"SUBTOTAL(9,K509:K532)","v":31691}]
[null,"P053","2013-03-02","Lepp",{"$f":"VLOOKUP(P_ostja, o_tab, 2, 0)","v":"Viljandi"},"haab",1,"Karu",27,{"$f":"VLOOKUP(P_liik, P_hinnad, P_sort+1, 0)","v":50},{"$f":"P_hind * P_kogus","v":1350},{"$f":"MONTH(P_kuupäev)","v":3}]
[null,"P106","2013-05-03","Lepp",{"$f":"VLOOKUP(P_ostja, o_tab, 2, 0)","v":"Viljandi"},"haab",3,"Ilves",45,{"$f":"VLOOKUP(P_liik, P_hinnad, P_sort+1, 0)","v":40},{"$f":"P_hind * P_kogus","v":1800},{"$f":"MONTH(P_kuupäev)","v":5}]
[null,"P125","2013-05-19","Lepp",{"$f":"VLOOKUP(P_ostja, o_tab, 2, 0)","v":"Viljandi"},"haab",3,"Põder",65,{"$f":"VLOOKUP(P_liik, P_hinnad, P_sort+1, 0)","v":40},{"$f":"P_hind * P_kogus","v":2600},{"$f":"MONTH(P_kuupäev)","v":5}]
[null,"P292","2013-12-27","Lepp",{"$f":"VLOOKUP(P_ostja, o_tab, 2, 0)","v":"Viljandi"},"haab",1,"Hunt",42,{"$f":"VLOOKUP(P_liik, P_hinnad, P_sort+1, 0)","v":50},{"$f":"P_hind * P_kogus","v":2100},{"$f":"MONTH(P_kuupäev)","v":12}]
[null,null,null,null,null,"haab Total",null,null,{"$f":"SUBTOTAL(9,I535:I538)","v":179},null,{"$f":"SUBTOTAL(9,K535:K538)","v":7850}]
[null,"P075","2013-04-02","Lepp",{"$f":"VLOOKUP(P_ostja, o_tab, 2, 0)","v":"Viljandi"},"kask",2,"Ilves",22,{"$f":"VLOOKUP(P_liik, P_hinnad, P_sort+1, 0)","v":63},{"$f":"P_hind * P_kogus","v":1386},{"$f":"MONTH(P_kuupäev)","v":4}]
[null,"P119","2013-05-15","Lepp",{"$f":"VLOOKUP(P_ostja, o_tab, 2, 0)","v":"Viljandi"},"kask",2,"Karu",19,{"$f":"VLOOKUP(P_liik, P_hinnad, P_sort+1, 0)","v":63},{"$f":"P_hind * P_kogus","v":1197},{"$f":"MONTH(P_kuupäev)","v":5}]
[null,"P215","2013-09-22","Lepp",{"$f":"VLOOKUP(P_ostja, o_tab, 2, 0)","v":"Viljandi"},"kask",2,"Ilves",79,{"$f":"VLOOKUP(P_liik, P_hinnad, P_sort+1, 0)","v":63},{"$f":"P_hind * P_kogus","v":4977},{"$f":"MONTH(P_kuupäev)","v":9}]
[null,"P215","2013-09-22","Lepp",{"$f":"VLOOKUP(P_ostja, o_tab, 2, 0)","v":"Viljandi"},"kask",1,"Ilves",47,{"$f":"VLOOKUP(P_liik, P_hinnad, P_sort+1, 0)","v":70},{"$f":"P_hind * P_kogus","v":3290},{"$f":"MONTH(P_kuupäev)","v":9}]
[null,null,null,null,null,"kask Total",null,null,{"$f":"SUBTOTAL(9,I540:I543)","v":167},null,{"$f":"SUBTOTAL(9,K540:K543)","v":10850}]
[null,"P011","2013-01-11","Lepp",{"$f":"VLOOKUP(P_ostja, o_tab, 2, 0)","v":"Viljandi"},"kuusk",1,"Karu",24,{"$f":"VLOOKUP(P_liik, P_hinnad, P_sort+1, 0)","v":80},{"$f":"P_hind * P_kogus","v":1920},{"$f":"MONTH(P_kuupäev)","v":1}]
[null,"P025","2013-01-27","Lepp",{"$f":"VLOOKUP(P_ostja, o_tab, 2, 0)","v":"Viljandi"},"kuusk",1,"Siil",15,{"$f":"VLOOKUP(P_liik, P_hinnad, P_sort+1, 0)","v":80},{"$f":"P_hind * P_kogus","v":1200},{"$f":"MONTH(P_kuupäev)","v":1}]
[null,"P061","2013-03-15","Lepp",{"$f":"VLOOKUP(P_ostja, o_tab, 2, 0)","v":"Viljandi"},"kuusk",3,"Siil",23,{"$f":"VLOOKUP(P_liik, P_hinnad, P_sort+1, 0)","v":64},{"$f":"P_hind * P_kogus","v":1472},{"$f":"MONTH(P_kuupäev)","v":3}]
[null,"P134","2013-06-04","Lepp",{"$f":"VLOOKUP(P_ostja, o_tab, 2, 0)","v":"Viljandi"},"kuusk",1,"Siil",31,{"$f":"VLOOKUP(P_liik, P_hinnad, P_sort+1, 0)","v":80},{"$f":"P_hind * P_kogus","v":2480},{"$f":"MONTH(P_kuupäev)","v":6}]
[null,"P138","2013-06-10","Lepp",{"$f":"VLOOKUP(P_ostja, o_tab, 2, 0)","v":"Viljandi"},"kuusk",1,"Hunt",54,{"$f":"VLOOKUP(P_liik, P_hinnad, P_sort+1, 0)","v":80},{"$f":"P_hind * P_kogus","v":4320},{"$f":"MONTH(P_kuupäev)","v":6}]
[null,"P278","2013-12-05","Lepp",{"$f":"VLOOKUP(P_ostja, o_tab, 2, 0)","v":"Viljandi"},"kuusk",3,"Jänes",55,{"$f":"VLOOKUP(P_liik, P_hinnad, P_sort+1, 0)","v":64},{"$f":"P_hind * P_kogus","v":3520},{"$f":"MONTH(P_kuupäev)","v":12}]
[null,null,null,null,null,"kuusk Total",null,null,{"$f":"SUBTOTAL(9,I545:I550)","v":202},null,{"$f":"SUBTOTAL(9,K545:K550)","v":14912}]
[null,"P054","2013-03-05","Lepp",{"$f":"VLOOKUP(P_ostja, o_tab, 2, 0)","v":"Viljandi"},"küte",2,"Karu",177,{"$f":"VLOOKUP(P_liik, P_hinnad, P_sort+1, 0)","v":42},{"$f":"P_hind * P_kogus","v":7434},{"$f":"MONTH(P_kuupäev)","v":3}]
[null,"P106","2013-05-03","Lepp",{"$f":"VLOOKUP(P_ostja, o_tab, 2, 0)","v":"Viljandi"},"küte",2,"Ilves",31,{"$f":"VLOOKUP(P_liik, P_hinnad, P_sort+1, 0)","v":42},{"$f":"P_hind * P_kogus","v":1302},{"$f":"MONTH(P_kuupäev)","v":5}]
[null,null,null,null,null,"küte Total",null,null,{"$f":"SUBTOTAL(9,I552:I553)","v":208},null,{"$f":"SUBTOTAL(9,K552:K553)","v":8736}]
[null,"P054","2013-03-05","Lepp",{"$f":"VLOOKUP(P_ostja, o_tab, 2, 0)","v":"Viljandi"},"lepp",2,"Karu",37,{"$f":"VLOOKUP(P_liik, P_hinnad, P_sort+1, 0)","v":59},{"$f":"P_hind * P_kogus","v":2183},{"$f":"MONTH(P_kuupäev)","v":3}]
[null,"P225","2013-10-05","Lepp",{"$f":"VLOOKUP(P_ostja, o_tab, 2, 0)","v":"Viljandi"},"lepp",2,"Siil",29,{"$f":"VLOOKUP(P_liik, P_hinnad, P_sort+1, 0)","v":59},{"$f":"P_hind * P_kogus","v":1711},{"$f":"MONTH(P_kuupäev)","v":10}]
[null,null,null,null,null,"lepp Total",null,null,{"$f":"SUBTOTAL(9,I555:I556)","v":66},null,{"$f":"SUBTOTAL(9,K555:K556)","v":3894}]
[null,"P107","2013-05-03","Lepp",{"$f":"VLOOKUP(P_ostja, o_tab, 2, 0)","v":"Viljandi"},"mänd",3,"Rebane",17,{"$f":"VLOOKUP(P_liik, P_hinnad, P_sort+1, 0)","v":60},{"$f":"P_hind * P_kogus","v":1020},{"$f":"MONTH(P_kuupäev)","v":5}]
[null,"P203","2013-09-04","Lepp",{"$f":"VLOOKUP(P_ostja, o_tab, 2, 0)","v":"Viljandi"},"mänd",1,"Põder",13,{"$f":"VLOOKUP(P_liik, P_hinnad, P_sort+1, 0)","v":75},{"$f":"P_hind * P_kogus","v":975},{"$f":"MONTH(P_kuupäev)","v":9}]
[null,"P292","2013-12-27","Lepp",{"$f":"VLOOKUP(P_ostja, o_tab, 2, 0)","v":"Viljandi"},"mänd",1,"Hunt",65,{"$f":"VLOOKUP(P_liik, P_hinnad, P_sort+1, 0)","v":75},{"$f":"P_hind * P_kogus","v":4875},{"$f":"MONTH(P_kuupäev)","v":12}]
[null,null,null,null,null,"mänd Total",null,null,{"$f":"SUBTOTAL(9,I558:I560)","v":95},null,{"$f":"SUBTOTAL(9,K558:K560)","v":6870}]
[null,"P072","2013-03-26","Lepp",{"$f":"VLOOKUP(P_ostja, o_tab, 2, 0)","v":"Viljandi"},"saar",1,"Ilves",8,{"$f":"VLOOKUP(P_liik, P_hinnad, P_sort+1, 0)","v":85},{"$f":"P_hind * P_kogus","v":680},{"$f":"MONTH(P_kuupäev)","v":3}]
[null,"P075","2013-04-02","Lepp",{"$f":"VLOOKUP(P_ostja, o_tab, 2, 0)","v":"Viljandi"},"saar",1,"Ilves",35,{"$f":"VLOOKUP(P_liik, P_hinnad, P_sort+1, 0)","v":85},{"$f":"P_hind * P_kogus","v":2975},{"$f":"MONTH(P_kuupäev)","v":4}]
[null,"P295","2013-12-30","Lepp",{"$f":"VLOOKUP(P_ostja, o_tab, 2, 0)","v":"Viljandi"},"saar",1,"Karu",17,{"$f":"VLOOKUP(P_liik, P_hinnad, P_sort+1, 0)","v":85},{"$f":"P_hind * P_kogus","v":1445},{"$f":"MONTH(P_kuupäev)","v":12}]
[null,null,null,null,null,"saar Total",null,null,{"$f":"SUBTOTAL(9,I562:I564)","v":60},null,{"$f":"SUBTOTAL(9,K562:K564)","v":5100}]
[null,"P024","2013-01-27","Lepp",{"$f":"VLOOKUP(P_ostja, o_tab, 2, 0)","v":"Viljandi"},"tamm",2,"Karu",51,{"$f":"VLOOKUP(P_liik, P_hinnad, P_sort+1, 0)","v":99},{"$f":"P_hind * P_kogus","v":5049},{"$f":"MONTH(P_kuupäev)","v":1}]
[null,null,null,null,null,"tamm Total",null,null,{"$f":"SUBTOTAL(9,I566:I566)","v":51},null,{"$f":"SUBTOTAL(9,K566:K566)","v":5049}]
[null,"P011","2013-01-11","Lepp",{"$f":"VLOOKUP(P_ostja, o_tab, 2, 0)","v":"Viljandi"},"vaher",3,"Jänes",16,{"$f":"VLOOKUP(P_liik, P_hinnad, P_sort+1, 0)","v":76},{"$f":"P_hind * P_kogus","v":1216},{"$f":"MONTH(P_kuupäev)","v":1}]
[null,"P053","2013-03-02","Lepp",{"$f":"VLOOKUP(P_ostja, o_tab, 2, 0)","v":"Viljandi"},"vaher",1,"Hunt",11,{"$f":"VLOOKUP(P_liik, P_hinnad, P_sort+1, 0)","v":95},{"$f":"P_hind * P_kogus","v":1045},{"$f":"MONTH(P_kuupäev)","v":3}]
[null,"P138","2013-06-10","Lepp",{"$f":"VLOOKUP(P_ostja, o_tab, 2, 0)","v":"Viljandi"},"vaher",3,"Hunt",25,{"$f":"VLOOKUP(P_liik, P_hinnad, P_sort+1, 0)","v":76},{"$f":"P_hind * P_kogus","v":1900},{"$f":"MONTH(P_kuupäev)","v":6}]
[null,null,null,null,null,"vaher Total",null,null,{"$f":"SUBTOTAL(9,I568:I570)","v":52},null,{"$f":"SUBTOTAL(9,K568:K570)","v":4161}]
[null,null,null,"Lepp Total",null,null,null,null,{"$f":"SUBTOTAL(9,I535:I570)","v":1080},null,{"$f":"SUBTOTAL(9,K535:K570)","v":67422}]
[null,"P231","2013-10-10","Luik",{"$f":"VLOOKUP(P_ostja, o_tab, 2, 0)","v":"Viljandi"},"haab",2,"Karu",46,{"$f":"VLOOKUP(P_liik, P_hinnad, P_sort+1, 0)","v":45},{"$f":"P_hind * P_kogus","v":2070},{"$f":"MONTH(P_kuupäev)","v":10}]
[null,null,null,null,null,"haab Total",null,null,{"$f":"SUBTOTAL(9,I573:I573)","v":46},null,{"$f":"SUBTOTAL(9,K573:K573)","v":2070}]
[null,"P036","2013-02-13","Luik",{"$f":"VLOOKUP(P_ostja, o_tab, 2, 0)","v":"Viljandi"},"kuusk",3,"Karu",72,{"$f":"VLOOKUP(P_liik, P_hinnad, P_sort+1, 0)","v":64},{"$f":"P_hind * P_kogus","v":4608},{"$f":"MONTH(P_kuupäev)","v":2}]
[null,"P174","2013-08-01","Luik",{"$f":"VLOOKUP(P_ostja, o_tab, 2, 0)","v":"Viljandi"},"kuusk",1,"Hunt",12,{"$f":"VLOOKUP(P_liik, P_hinnad, P_sort+1, 0)","v":80},{"$f":"P_hind * P_kogus","v":960},{"$f":"MONTH(P_kuupäev)","v":8}]
[null,"P188","2013-08-21","Luik",{"$f":"VLOOKUP(P_ostja, o_tab, 2, 0)","v":"Viljandi"},"kuusk",2,"Hunt",61,{"$f":"VLOOKUP(P_liik, P_hinnad, P_sort+1, 0)","v":72},{"$f":"P_hind * P_kogus","v":4392},{"$f":"MONTH(P_kuupäev)","v":8}]
[null,null,null,null,null,"kuusk Total",null,null,{"$f":"SUBTOTAL(9,I575:I577)","v":145},null,{"$f":"SUBTOTAL(9,K575:K577)","v":9960}]
[null,"P231","2013-10-10","Luik",{"$f":"VLOOKUP(P_ostja, o_tab, 2, 0)","v":"Viljandi"},"küte",2,"Karu",71,{"$f":"VLOOKUP(P_liik, P_hinnad, P_sort+1, 0)","v":42},{"$f":"P_hind * P_kogus","v":2982},{"$f":"MONTH(P_kuupäev)","v":10}]
[null,null,null,null,null,"küte Total",null,null,{"$f":"SUBTOTAL(9,I579:I579)","v":71},null,{"$f":"SUBTOTAL(9,K579:K579)","v":2982}]
[null,"P036","2013-02-13","Luik",{"$f":"VLOOKUP(P_ostja, o_tab, 2, 0)","v":"Viljandi"},"lepp",1,"Ilves",53,{"$f":"VLOOKUP(P_liik, P_hinnad, P_sort+1, 0)","v":65},{"$f":"P_hind * P_kogus","v":3445},{"$f":"MONTH(P_kuupäev)","v":2}]
[null,"P120","2013-05-15","Luik",{"$f":"VLOOKUP(P_ostja, o_tab, 2, 0)","v":"Viljandi"},"lepp",3,"Siil",33,{"$f":"VLOOKUP(P_liik, P_hinnad, P_sort+1, 0)","v":52},{"$f":"P_hind * P_kogus","v":1716},{"$f":"MONTH(P_kuupäev)","v":5}]
[null,null,null,null,null,"lepp Total",null,null,{"$f":"SUBTOTAL(9,I581:I582)","v":86},null,{"$f":"SUBTOTAL(9,K581:K582)","v":5161}]
[null,"P124","2013-05-18","Luik",{"$f":"VLOOKUP(P_ostja, o_tab, 2, 0)","v":"Viljandi"},"tamm",1,"Põder",32,{"$f":"VLOOKUP(P_liik, P_hinnad, P_sort+1, 0)","v":110},{"$f":"P_hind * P_kogus","v":3520},{"$f":"MONTH(P_kuupäev)","v":5}]
[null,"P154","2013-07-06","Luik",{"$f":"VLOOKUP(P_ostja, o_tab, 2, 0)","v":"Viljandi"},"tamm",3,"Rebane",11,{"$f":"VLOOKUP(P_liik, P_hinnad, P_sort+1, 0)","v":88},{"$f":"P_hind * P_kogus","v":968},{"$f":"MONTH(P_kuupäev)","v":7}]
[null,null,null,null,null,"tamm Total",null,null,{"$f":"SUBTOTAL(9,I584:I585)","v":43},null,{"$f":"SUBTOTAL(9,K584:K585)","v":4488}]
[null,null,null,"Luik Total",null,null,null,null,{"$f":"SUBTOTAL(9,I573:I585)","v":391},null,{"$f":"SUBTOTAL(9,K573:K585)","v":24661}]
[null,null,null,null,"Viljandi Total",null,null,null,{"$f":"SUBTOTAL(9,I509:I585)","v":1991},null,{"$f":"SUBTOTAL(9,K509:K585)","v":123774}]
[null,"P017","2013-01-18","Paju",{"$f":"VLOOKUP(P_ostja, o_tab, 2, 0)","v":"Võru"},"kask",1,"Põder",50,{"$f":"VLOOKUP(P_liik, P_hinnad, P_sort+1, 0)","v":70},{"$f":"P_hind * P_kogus","v":3500},{"$f":"MONTH(P_kuupäev)","v":1}]
[null,null,null,null,null,"kask Total",null,null,{"$f":"SUBTOTAL(9,I589:I589)","v":50},null,{"$f":"SUBTOTAL(9,K589:K589)","v":3500}]
[null,"P220","2013-09-26","Paju",{"$f":"VLOOKUP(P_ostja, o_tab, 2, 0)","v":"Võru"},"kuusk",1,"Rebane",28,{"$f":"VLOOKUP(P_liik, P_hinnad, P_sort+1, 0)","v":80},{"$f":"P_hind * P_kogus","v":2240},{"$f":"MONTH(P_kuupäev)","v":9}]
[null,"P222","2013-09-29","Paju",{"$f":"VLOOKUP(P_ostja, o_tab, 2, 0)","v":"Võru"},"kuusk",2,"Rebane",34,{"$f":"VLOOKUP(P_liik, P_hinnad, P_sort+1, 0)","v":72},{"$f":"P_hind * P_kogus","v":2448},{"$f":"MONTH(P_kuupäev)","v":9}]
[null,"P234","2013-10-13","Paju",{"$f":"VLOOKUP(P_ostja, o_tab, 2, 0)","v":"Võru"},"kuusk",3,"Ilves",63,{"$f":"VLOOKUP(P_liik, P_hinnad, P_sort+1, 0)","v":64},{"$f":"P_hind * P_kogus","v":4032},{"$f":"MONTH(P_kuupäev)","v":10}]
[null,null,null,null,null,"kuusk Total",null,null,{"$f":"SUBTOTAL(9,I591:I593)","v":125},null,{"$f":"SUBTOTAL(9,K591:K593)","v":8720}]
[null,"P164","2013-07-18","Paju",{"$f":"VLOOKUP(P_ostja, o_tab, 2, 0)","v":"Võru"},"küte",1,"Karu",34,{"$f":"VLOOKUP(P_liik, P_hinnad, P_sort+1, 0)","v":47},{"$f":"P_hind * P_kogus","v":1598},{"$f":"MONTH(P_kuupäev)","v":7}]
[null,null,null,null,null,"küte Total",null,null,{"$f":"SUBTOTAL(9,I595:I595)","v":34},null,{"$f":"SUBTOTAL(9,K595:K595)","v":1598}]
[null,"P234","2013-10-13","Paju",{"$f":"VLOOKUP(P_ostja, o_tab, 2, 0)","v":"Võru"},"mänd",1,"Ilves",73,{"$f":"VLOOKUP(P_liik, P_hinnad, P_sort+1, 0)","v":75},{"$f":"P_hind * P_kogus","v":5475},{"$f":"MONTH(P_kuupäev)","v":10}]
[null,"P251","2013-10-29","Paju",{"$f":"VLOOKUP(P_ostja, o_tab, 2, 0)","v":"Võru"},"mänd",2,"Karu",55,{"$f":"VLOOKUP(P_liik, P_hinnad, P_sort+1, 0)","v":68},{"$f":"P_hind * P_kogus","v":3740},{"$f":"MONTH(P_kuupäev)","v":10}]
[null,"P251","2013-10-29","Paju",{"$f":"VLOOKUP(P_ostja, o_tab, 2, 0)","v":"Võru"},"mänd",2,"Karu",50,{"$f":"VLOOKUP(P_liik, P_hinnad, P_sort+1, 0)","v":68},{"$f":"P_hind * P_kogus","v":3400},{"$f":"MONTH(P_kuupäev)","v":10}]
[null,null,null,null,null,"mänd Total",null,null,{"$f":"SUBTOTAL(9,I597:I599)","v":178},null,{"$f":"SUBTOTAL(9,K597:K599)","v":12615}]
[null,"P265","2013-11-19","Paju",{"$f":"VLOOKUP(P_ostja, o_tab, 2, 0)","v":"Võru"},"saar",3,"Hunt",62,{"$f":"VLOOKUP(P_liik, P_hinnad, P_sort+1, 0)","v":68},{"$f":"P_hind * P_kogus","v":4216},{"$f":"MONTH(P_kuupäev)","v":11}]
[null,null,null,null,null,"saar Total",null,null,{"$f":"SUBTOTAL(9,I601:I601)","v":62},null,{"$f":"SUBTOTAL(9,K601:K601)","v":4216}]
[null,"P265","2013-11-19","Paju",{"$f":"VLOOKUP(P_ostja, o_tab, 2, 0)","v":"Võru"},"vaher",1,"Hunt",25,{"$f":"VLOOKUP(P_liik, P_hinnad, P_sort+1, 0)","v":95},{"$f":"P_hind * P_kogus","v":2375},{"$f":"MONTH(P_kuupäev)","v":11}]
[null,null,null,null,null,"vaher Total",null,null,{"$f":"SUBTOTAL(9,I603:I603)","v":25},null,{"$f":"SUBTOTAL(9,K603:K603)","v":2375}]
[null,null,null,"Paju Total",null,null,null,null,{"$f":"SUBTOTAL(9,I589:I603)","v":474},null,{"$f":"SUBTOTAL(9,K589:K603)","v":33024}]
[null,"P137","2013-06-09","Seen",{"$f":"VLOOKUP(P_ostja, o_tab, 2, 0)","v":"Võru"},"haab",1,"Siil",52,{"$f":"VLOOKUP(P_liik, P_hinnad, P_sort+1, 0)","v":50},{"$f":"P_hind * P_kogus","v":2600},{"$f":"MONTH(P_kuupäev)","v":6}]
[null,"P171","2013-07-29","Seen",{"$f":"VLOOKUP(P_ostja, o_tab, 2, 0)","v":"Võru"},"haab",2,"Põder",37,{"$f":"VLOOKUP(P_liik, P_hinnad, P_sort+1, 0)","v":45},{"$f":"P_hind * P_kogus","v":1665},{"$f":"MONTH(P_kuupäev)","v":7}]
[null,"P211","2013-09-18","Seen",{"$f":"VLOOKUP(P_ostja, o_tab, 2, 0)","v":"Võru"},"haab",2,"Karu",21,{"$f":"VLOOKUP(P_liik, P_hinnad, P_sort+1, 0)","v":45},{"$f":"P_hind * P_kogus","v":945},{"$f":"MONTH(P_kuupäev)","v":9}]
[null,"P212","2013-09-19","Seen",{"$f":"VLOOKUP(P_ostja, o_tab, 2, 0)","v":"Võru"},"haab",1,"Siil",31,{"$f":"VLOOKUP(P_liik, P_hinnad, P_sort+1, 0)","v":50},{"$f":"P_hind * P_kogus","v":1550},{"$f":"MONTH(P_kuupäev)","v":9}]
[null,"P294","2013-12-29","Seen",{"$f":"VLOOKUP(P_ostja, o_tab, 2, 0)","v":"Võru"},"haab",2,"Karu",13,{"$f":"VLOOKUP(P_liik, P_hinnad, P_sort+1, 0)","v":45},{"$f":"P_hind * P_kogus","v":585},{"$f":"MONTH(P_kuupäev)","v":12}]
[null,null,null,null,null,"haab Total",null,null,{"$f":"SUBTOTAL(9,I606:I610)","v":154},null,{"$f":"SUBTOTAL(9,K606:K610)","v":7345}]
[null,"P063","2013-03-19","Seen",{"$f":"VLOOKUP(P_ostja, o_tab, 2, 0)","v":"Võru"},"kask",1,"Siil",73,{"$f":"VLOOKUP(P_liik, P_hinnad, P_sort+1, 0)","v":70},{"$f":"P_hind * P_kogus","v":5110},{"$f":"MONTH(P_kuupäev)","v":3}]
[null,"P219","2013-09-25","Seen",{"$f":"VLOOKUP(P_ostja, o_tab, 2, 0)","v":"Võru"},"kask",2,"Ilves",40,{"$f":"VLOOKUP(P_liik, P_hinnad, P_sort+1, 0)","v":63},{"$f":"P_hind * P_kogus","v":2520},{"$f":"MONTH(P_kuupäev)","v":9}]
[null,null,null,null,null,"kask Total",null,null,{"$f":"SUBTOTAL(9,I612:I613)","v":113},null,{"$f":"SUBTOTAL(9,K612:K613)","v":7630}]
[null,"P105","2013-05-02","Seen",{"$f":"VLOOKUP(P_ostja, o_tab, 2, 0)","v":"Võru"},"kuusk",1,"Ilves",36,{"$f":"VLOOKUP(P_liik, P_hinnad, P_sort+1, 0)","v":80},{"$f":"P_hind * P_kogus","v":2880},{"$f":"MONTH(P_kuupäev)","v":5}]
[null,"P171","2013-07-29","Seen",{"$f":"VLOOKUP(P_ostja, o_tab, 2, 0)","v":"Võru"},"kuusk",3,"Põder",31,{"$f":"VLOOKUP(P_liik, P_hinnad, P_sort+1, 0)","v":64},{"$f":"P_hind * P_kogus","v":1984},{"$f":"MONTH(P_kuupäev)","v":7}]
[null,"P290","2013-12-24","Seen",{"$f":"VLOOKUP(P_ostja, o_tab, 2, 0)","v":"Võru"},"kuusk",1,"Ilves",78,{"$f":"VLOOKUP(P_liik, P_hinnad, P_sort+1, 0)","v":80},{"$f":"P_hind * P_kogus","v":6240},{"$f":"MONTH(P_kuupäev)","v":12}]
[null,null,null,null,null,"kuusk Total",null,null,{"$f":"SUBTOTAL(9,I615:I617)","v":145},null,{"$f":"SUBTOTAL(9,K615:K617)","v":11104}]
[null,"P005","2013-01-06","Seen",{"$f":"VLOOKUP(P_ostja, o_tab, 2, 0)","v":"Võru"},"küte",1,"Põder",44,{"$f":"VLOOKUP(P_liik, P_hinnad, P_sort+1, 0)","v":47},{"$f":"P_hind * P_kogus","v":2068},{"$f":"MONTH(P_kuupäev)","v":1}]
[null,"P021","2013-01-24","Seen",{"$f":"VLOOKUP(P_ostja, o_tab, 2, 0)","v":"Võru"},"küte",2,"Jänes",45,{"$f":"VLOOKUP(P_liik, P_hinnad, P_sort+1, 0)","v":42},{"$f":"P_hind * P_kogus","v":1890},{"$f":"MONTH(P_kuupäev)","v":1}]
[null,"P086","2013-04-14","Seen",{"$f":"VLOOKUP(P_ostja, o_tab, 2, 0)","v":"Võru"},"küte",2,"Ilves",68,{"$f":"VLOOKUP(P_liik, P_hinnad, P_sort+1, 0)","v":42},{"$f":"P_hind * P_kogus","v":2856},{"$f":"MONTH(P_kuupäev)","v":4}]
[null,"P132","2013-05-30","Seen",{"$f":"VLOOKUP(P_ostja, o_tab, 2, 0)","v":"Võru"},"küte",2,"Rebane",12,{"$f":"VLOOKUP(P_liik, P_hinnad, P_sort+1, 0)","v":42},{"$f":"P_hind * P_kogus","v":504},{"$f":"MONTH(P_kuupäev)","v":5}]
[null,"P136","2013-06-08","Seen",{"$f":"VLOOKUP(P_ostja, o_tab, 2, 0)","v":"Võru"},"küte",1,"Hunt",56,{"$f":"VLOOKUP(P_liik, P_hinnad, P_sort+1, 0)","v":47},{"$f":"P_hind * P_kogus","v":2632},{"$f":"MONTH(P_kuupäev)","v":6}]
[null,"P194","2013-08-27","Seen",{"$f":"VLOOKUP(P_ostja, o_tab, 2, 0)","v":"Võru"},"küte",1,"Karu",14,{"$f":"VLOOKUP(P_liik, P_hinnad, P_sort+1, 0)","v":47},{"$f":"P_hind * P_kogus","v":658},{"$f":"MONTH(P_kuupäev)","v":8}]
[null,"P252","2013-10-30","Seen",{"$f":"VLOOKUP(P_ostja, o_tab, 2, 0)","v":"Võru"},"küte",1,"Ilves",23,{"$f":"VLOOKUP(P_liik, P_hinnad, P_sort+1, 0)","v":47},{"$f":"P_hind * P_kogus","v":1081},{"$f":"MONTH(P_kuupäev)","v":10}]
[null,"P285","2013-12-16","Seen",{"$f":"VLOOKUP(P_ostja, o_tab, 2, 0)","v":"Võru"},"küte",1,"Karu",33,{"$f":"VLOOKUP(P_liik, P_hinnad, P_sort+1, 0)","v":47},{"$f":"P_hind * P_kogus","v":1551},{"$f":"MONTH(P_kuupäev)","v":12}]
[null,null,null,null,null,"küte Total",null,null,{"$f":"SUBTOTAL(9,I619:I626)","v":295},null,{"$f":"SUBTOTAL(9,K619:K626)","v":13240}]
[null,"P003","2013-01-03","Seen",{"$f":"VLOOKUP(P_ostja, o_tab, 2, 0)","v":"Võru"},"lepp",2,"Karu",13,{"$f":"VLOOKUP(P_liik, P_hinnad, P_sort+1, 0)","v":59},{"$f":"P_hind * P_kogus","v":767},{"$f":"MONTH(P_kuupäev)","v":1}]
[null,"P048","2013-02-28","Seen",{"$f":"VLOOKUP(P_ostja, o_tab, 2, 0)","v":"Võru"},"lepp",3,"Siil",23,{"$f":"VLOOKUP(P_liik, P_hinnad, P_sort+1, 0)","v":52},{"$f":"P_hind * P_kogus","v":1196},{"$f":"MONTH(P_kuupäev)","v":2}]
[null,"P146","2013-06-20","Seen",{"$f":"VLOOKUP(P_ostja, o_tab, 2, 0)","v":"Võru"},"lepp",1,"Siil",24,{"$f":"VLOOKUP(P_liik, P_hinnad, P_sort+1, 0)","v":65},{"$f":"P_hind * P_kogus","v":1560},{"$f":"MONTH(P_kuupäev)","v":6}]
[null,"P155","2013-07-07","Seen",{"$f":"VLOOKUP(P_ostja, o_tab, 2, 0)","v":"Võru"},"lepp",1,"Ilves",63,{"$f":"VLOOKUP(P_liik, P_hinnad, P_sort+1, 0)","v":65},{"$f":"P_hind * P_kogus","v":4095},{"$f":"MONTH(P_kuupäev)","v":7}]
[null,null,null,null,null,"lepp Total",null,null,{"$f":"SUBTOTAL(9,I628:I631)","v":123},null,{"$f":"SUBTOTAL(9,K628:K631)","v":7618}]
[null,"P001","2013-01-02","Seen",{"$f":"VLOOKUP(P_ostja, o_tab, 2, 0)","v":"Võru"},"mänd",2,"Siil",28,{"$f":"VLOOKUP(P_liik, P_hinnad, P_sort+1, 0)","v":68},{"$f":"P_hind * P_kogus","v":1904},{"$f":"MONTH(P_kuupäev)","v":1}]
[null,"P021","2013-01-24","Seen",{"$f":"VLOOKUP(P_ostja, o_tab, 2, 0)","v":"Võru"},"mänd",1,"Jänes",73,{"$f":"VLOOKUP(P_liik, P_hinnad, P_sort+1, 0)","v":75},{"$f":"P_hind * P_kogus","v":5475},{"$f":"MONTH(P_kuupäev)","v":1}]
[null,"P063","2013-03-19","Seen",{"$f":"VLOOKUP(P_ostja, o_tab, 2, 0)","v":"Võru"},"mänd",2,"Siil",52,{"$f":"VLOOKUP(P_liik, P_hinnad, P_sort+1, 0)","v":68},{"$f":"P_hind * P_kogus","v":3536},{"$f":"MONTH(P_kuupäev)","v":3}]
[null,"P132","2013-05-30","Seen",{"$f":"VLOOKUP(P_ostja, o_tab, 2, 0)","v":"Võru"},"mänd",3,"Rebane",28,{"$f":"VLOOKUP(P_liik, P_hinnad, P_sort+1, 0)","v":60},{"$f":"P_hind * P_kogus","v":1680},{"$f":"MONTH(P_kuupäev)","v":5}]
[null,"P142","2013-06-14","Seen",{"$f":"VLOOKUP(P_ostja, o_tab, 2, 0)","v":"Võru"},"mänd",1,"Rebane",24,{"$f":"VLOOKUP(P_liik, P_hinnad, P_sort+1, 0)","v":75},{"$f":"P_hind * P_kogus","v":1800},{"$f":"MONTH(P_kuupäev)","v":6}]
[null,"P155","2013-07-07","Seen",{"$f":"VLOOKUP(P_ostja, o_tab, 2, 0)","v":"Võru"},"mänd",2,"Ilves",23,{"$f":"VLOOKUP(P_liik, P_hinnad, P_sort+1, 0)","v":68},{"$f":"P_hind * P_kogus","v":1564},{"$f":"MONTH(P_kuupäev)","v":7}]
[null,"P285","2013-12-16","Seen",{"$f":"VLOOKUP(P_ostja, o_tab, 2, 0)","v":"Võru"},"mänd",3,"Karu",60,{"$f":"VLOOKUP(P_liik, P_hinnad, P_sort+1, 0)","v":60},{"$f":"P_hind * P_kogus","v":3600},{"$f":"MONTH(P_kuupäev)","v":12}]
[null,null,null,null,null,"mänd Total",null,null,{"$f":"SUBTOTAL(9,I633:I639)","v":288},null,{"$f":"SUBTOTAL(9,K633:K639)","v":19559}]
[null,"P019","2013-01-20","Seen",{"$f":"VLOOKUP(P_ostja, o_tab, 2, 0)","v":"Võru"},"saar",1,"Hunt",69,{"$f":"VLOOKUP(P_liik, P_hinnad, P_sort+1, 0)","v":85},{"$f":"P_hind * P_kogus","v":5865},{"$f":"MONTH(P_kuupäev)","v":1}]
[null,"P043","2013-02-22","Seen",{"$f":"VLOOKUP(P_ostja, o_tab, 2, 0)","v":"Võru"},"saar",2,"Hunt",24,{"$f":"VLOOKUP(P_liik, P_hinnad, P_sort+1, 0)","v":77},{"$f":"P_hind * P_kogus","v":1848},{"$f":"MONTH(P_kuupäev)","v":2}]
[null,"P217","2013-09-23","Seen",{"$f":"VLOOKUP(P_ostja, o_tab, 2, 0)","v":"Võru"},"saar",2,"Siil",26,{"$f":"VLOOKUP(P_liik, P_hinnad, P_sort+1, 0)","v":77},{"$f":"P_hind * P_kogus","v":2002},{"$f":"MONTH(P_kuupäev)","v":9}]
[null,null,null,null,null,"saar Total",null,null,{"$f":"SUBTOTAL(9,I641:I643)","v":119},null,{"$f":"SUBTOTAL(9,K641:K643)","v":9715}]
[null,"P194","2013-08-27","Seen",{"$f":"VLOOKUP(P_ostja, o_tab, 2, 0)","v":"Võru"},"vaher",3,"Karu",69,{"$f":"VLOOKUP(P_liik, P_hinnad, P_sort+1, 0)","v":76},{"$f":"P_hind * P_kogus","v":5244},{"$f":"MONTH(P_kuupäev)","v":8}]
[null,null,null,null,null,"vaher Total",null,null,{"$f":"SUBTOTAL(9,I645:I645)","v":69},null,{"$f":"SUBTOTAL(9,K645:K645)","v":5244}]
[null,null,null,"Seen Total",null,null,null,null,{"$f":"SUBTOTAL(9,I606:I645)","v":1306},null,{"$f":"SUBTOTAL(9,K606:K645)","v":81455}]
[null,null,null,null,"Võru Total",null,null,null,{"$f":"SUBTOTAL(9,I589:I645)","v":1780},null,{"$f":"SUBTOTAL(9,K589:K645)","v":114479}]
[null,null,null,null,"Grand Total",null,null,null,{"$f":"SUBTOTAL(9,I9:I645)","v":17099},null,{"$f":"SUBTOTAL(9,K9:K645)","v":1121210}]

{"sheet":"Sort","index":8,"n_rows":40,"n_cols":14,"rows_kept":40,"cut":false,"hidden":false,"merged":[[0,9,0,10],[0,5,0,6]]}
[null,null,null,null,"veeb","klipp Sortimine",null,null,null,"Harjutustabelid"]
[null,null,null,null,null,null,null,null,null,"Töötajad","Puidu müük"]
[]
[null,null,null,null,null,null,null,null,"Arvutite müükide arvestus"]
[]
[null,null,null,null,null,null,null,null,"Kuupäev","Linn","Arvuti","Arv","Hind","Maksumus"]
[null,null,null,null,null,null,null,null,"2013-01-02","Tallinn","Frodo",2,{"$f":"VLOOKUP(Arvuti, Arvutid, 6, 0)","v":870},{"$f":"Hind * Arv","v":1740}]
[null,null,null,null,null,null,null,null,"2013-01-02","Valga","Balrog",1,419,419]
[null,null,null,null,null,null,null,null,"2013-01-03","Tallinn","Aragorn",3,499,1497]
[null,null,null,null,null,null,null,null,"2013-01-03","Tallinn","Balrog",3,419,1257]
[null,null,null,null,null,null,null,null,"2013-01-03","Võru","Gandalf",2,849,1698]
[null,null,null,null,null,null,null,null,"2013-01-04","Tallinn","Eldar",3,465,1395]
[null,null,null,null,null,null,null,null,"2013-01-04","Tartu","Balrog",5,419,2095]
[null,null,null,null,null,null,null,null,"2013-01-07","Pärnu","Eldar",3,465,1395]
[null,null,null,null,null,null,null,null,"2013-01-07","Tallinn","Faram",1,599,599]
[null,null,null,null,null,null,null,null,"2013-01-07","Valga","Balrog",6,419,2514]
[null,null,null,null,null,null,null,null,"2013-01-07","Valga","Frodo",1,870,870]
[null,null,null,null,null,null,null,null,"2013-01-09","Tallinn","Grimbold",6,1149,6894]
[null,null,null,null,null,null,null,null,"2013-01-10","Pärnu","Elend",1,920,920]
[null,null,null,null,null,null,null,null,"2013-01-10","Pärnu","Rohan",4,340,1360]
[null,null,null,null,null,null,null,null,"2013-01-10","Tartu","Sauron",2,339,678]
[null,null,null,null,null,null,null,null,"2013-01-11","Tallinn","Marvin",1,370,370]
[null,null,null,null,null,null,null,null,"2013-01-11","Tartu","Balrog",2,419,838]
[null,null,null,null,null,null,null,null,"2013-01-11","Valga","Aragorn",1,499,499]
[null,null,null,null,null,null,null,null,"2013-01-14","Pärnu","Gandalf",3,849,2547]
[null,null,null,null,null,null,null,null,"2013-01-14","Tartu","Frodo",4,870,3480]
[null,null,null,null,null,null,null,null,"2013-01-14","Valga","Kalvar",2,699,1398]
[null,null,null,null,null,null,null,null,"2013-01-16","Tallinn","Arven",5,369,1845]
[null,null,null,null,null,null,null,null,"2013-01-17","Tallinn","Kalvar",7,699,4893]
[null,null,null,null,null,null,null,null,"2013-01-17","Tartu","Aragorn",3,499,1497]
[null,null,null,null,null,null,null,null,"2013-01-18","Pärnu","Eldar",1,465,465]
[null,null,null,null,null,null,null,null,"2013-01-18","Tallinn","Aragorn",1,499,499]
[null,null,null,null,null,null,null,null,"2013-01-19","Tallinn","Faram",3,599,1797]
[null,null,null,null,null,null,null,null,"2013-01-19","Tartu","Kalvar",1,699,699]
[null,null,null,null,null,null,null,null,"2013-01-19","Võru","Elend",5,920,4600]
[null,null,null,null,null,null,null,null,"2013-01-20","Tallinn","Elend",2,920,1840]
[null,null,null,null,null,null,null,null,"2013-01-20","Võru","Sauron",3,339,1017]
[null,null,null,null,null,null,null,null,"2013-01-21","Pärnu","Arven",1,369,369]
[null,null,null,null,null,null,null,null,"2013-01-25","Võru","Sauron",1,339,339]
[null,null,null,null,null,null,null,null,"2013-01-26","Pärnu","Gandalf",2,849,1698]

{"sheet":"Päringud","index":9,"n_rows":1,"n_cols":5,"rows_kept":1,"cut":false,"hidden":false,"merged":[]}
[null,null,null,null,"veeb"]

{"sheet":"Filter","index":10,"n_rows":40,"n_cols":14,"rows_kept":40,"cut":false,"hidden":false,"merged":[[0,8,0,9],[0,5,0,6]]}
[null,null,null,null,"veeb","Klipp Autofilter",null,null,"Harjutustabelid"]
[null,null,null,null,null,null,null,null,"töötajad","puidu müük"]
[null,"Filter - harilik filter ehk autofilter",null,null,null,null,null,null,null,null,null,null,null,"NB! Subtotal"]
[null,null,null,null,null,null,null,null,"Arvutite müükide arvestus",null,null,{"$f":"SUBTOTAL(9, L7:L40)","v":90},{"$f":"SUBTOTAL(1, M7:M40)","v":611.85294117647061},{"$f":"SUBTOTAL(9, N7:N40)","v":54875}]
[]
[null,null,null,null,null,null,null,null,"Kuupäev","Linn","Arvuti","Arv","Hind","Maksumus"]
[null,null,null,null,null,null,null,null,"2013-01-03","Tallinn","Aragorn",2,{"$f":"VLOOKUP(Arvuti, Arvutid, 6, 0)","v":499},{"$f":"Hind*Arv","v":998}]
[null,null,null,null,null,null,null,null,"2013-01-03","Tallinn","Balrog",3,419,1257]
[null,null,null,null,null,null,null,null,"2013-01-09","Tallinn","Grimbold",6,1149,6894]
[null,null,null,null,null,null,null,null,"2013-01-04","Tallinn","Eldar",3,465,1395]
[null,null,null,null,null,null,null,null,"2013-01-07","Tallinn","Faram",1,599,599]
[null,null,null,null,null,null,null,null,"2013-01-02","Tallinn","Frodo",2,870,1740]
[null,null,null,null,null,null,null,null,"2013-01-11","Tallinn","Frodo",1,870,870]
[null,null,null,null,null,null,null,null,"2013-01-16","Tallinn","Arven",5,369,1845]
[null,null,null,null,null,null,null,null,"2013-01-07","Pärnu","Eldar",3,465,1395]
[null,null,null,null,null,null,null,null,"2013-01-17","Tallinn","Balrog",7,419,2933]
[null,null,null,null,null,null,null,null,"2013-01-26","Pärnu","Gandalf",2,849,1698]
[null,null,null,null,null,null,null,null,"2013-01-18","Tallinn","Aragorn",1,499,499]
[null,null,null,null,null,null,null,null,"2013-01-10","Pärnu","Elend",1,920,920]
[null,null,null,null,null,null,null,null,"2013-01-19","Tallinn","Frodo",3,870,2610]
[null,null,null,null,null,null,null,null,"2013-01-20","Tallinn","Elend",2,920,1840]
[null,null,null,null,null,null,null,null,"2013-01-10","Tartu","Sauron",2,339,678]
[null,null,null,null,null,null,null,null,"2013-01-11","Tartu","Balrog",2,419,838]
[null,null,null,null,null,null,null,null,"2013-01-14","Tartu","Frodo",4,870,3480]
[null,null,null,null,null,null,null,null,"2013-01-02","Valga","Balrog",1,419,419]
[null,null,null,null,null,null,null,null,"2013-01-14","Pärnu","Gandalf",3,849,2547]
[null,null,null,null,null,null,null,null,"2013-01-11","Valga","Aragorn",1,499,499]
[null,null,null,null,null,null,null,null,"2013-01-17","Tartu","Aragorn",3,499,1497]
[null,null,null,null,null,null,null,null,"2013-01-14","Valga","Kalvar",2,699,1398]
[null,null,null,null,null,null,null,null,"2013-01-07","Valga","Balrog",6,419,2514]
[null,null,null,null,null,null,null,null,"2013-01-07","Valga","Frodo",1,870,870]
[null,null,null,null,null,null,null,null,"2013-01-18","Pärnu","Eldar",1,{"$f":"VLOOKUP(Arvuti, Arvutid, 6, 0)","v":465},{"$f":"Hind*Arv","v":465}]
[null,null,null,null,null,null,null,null,"2013-01-10","Pärnu","Rohan",4,340,1360]
[null,null,null,null,null,null,null,null,"2013-01-19","Tartu","Kalvar",1,699,699]
[null,null,null,null,null,null,null,null,"2013-01-03","Võru","Gandalf",2,849,1698]
[null,null,null,null,null,null,null,null,"2013-01-19","Võru","Elend",5,920,4600]
[null,null,null,null,null,null,null,null,"2013-01-20","Võru","Sauron",3,339,1017]
[null,null,null,null,null,null,null,null,"2013-01-21","Pärnu","Arven",1,369,369]
[null,null,null,null,null,null,null,null,"2013-01-25","Võru","Sauron",1,339,339]
[null,null,null,null,null,null,null,null,"2013-01-04","Tartu","Balrog",5,419,2095]

{"sheet":"Aren_Filter","index":11,"n_rows":51,"n_cols":11,"rows_kept":51,"cut":false,"hidden":false,"merged":[[0,5,0,6],[1,3,1,4],[1,5,1,6]]}
[null,null,null,null,"veeb","klipp Arendatud filter 1",null,null,null,"Harjutustabelid:"]
[null,null,null,"klipp Arendatud filter 2",null,"klipp Arendatud filter 3",null,null,null,"Töötajad","Puidu müük"]
[]
[]
[null,"Arvutite müükide arvestus"]
[]
[null,"Linn",null,"Linn","Arvuti",null,"Maksumus"]
[null,"Pärnu",null,"Tallinn","Frodo",null,">2000"]
[]
[null,"Linn",null,"Linn","Arvuti","Arv"]
[null,"Tallinn",null,"Tallinn","Balrog",">1"]
[null,"Tartu",null,"Tartu","Balrog",">1"]
[null,"Võru"]
[null,null,null,"Arvuti","Kuupäev","Kuupäev"]
[null,"AM_AF",null,"Aragorn",">=10.01.13","<=20.01.13"]
[]
[null,"Kuupäev","Linn","Arvuti","Arv","Hind","Maksumus"]
[null,"2013-01-02","Tallinn","Frodo",3,{"$f":"VLOOKUP(Arvuti, Arvutid, 6, 0)","v":870},{"$f":"Hind*Arv","v":2610}]
[null,"2013-01-02","Valga","Balrog",1,419,419]
[null,"2013-01-03","Võru","Gandalf",2,849,1698]
[null,"2013-01-03","Tallinn","Balrog",3,419,1257]
[null,"2013-01-03","Tallinn","Aragorn",2,499,998]
[null,"2013-01-04","Tartu","Balrog",5,419,2095]
[null,"2013-01-04","Tallinn","Eldar",3,465,1395]
[null,"2013-01-07","Valga","Balrog",6,419,2514]
[null,"2013-01-07","Pärnu","Balrog",3,419,1257]
[null,"2013-01-07","Valga","Frodo",1,870,870]
[null,"2013-01-07","Tallinn","Frodo",1,870,870]
[null,"2013-01-09","Tallinn","Grimbold",6,1149,6894]
[null,"2013-01-10","Pärnu","Rohan",4,340,1360]
[null,"2013-01-10","Pärnu","Elend",1,920,920]
[null,"2013-01-10","Tartu","Sauron",2,339,678]
[null,"2013-01-11","Tartu","Balrog",2,419,838]
[null,"2013-01-11","Tallinn","Marvin",1,370,370]
[null,"2013-01-11","Valga","Aragorn",1,499,499]
[null,"2013-01-14","Tartu","Frodo",4,870,3480]
[null,"2013-01-14","Pärnu","Gandalf",3,849,2547]
[null,"2013-01-14","Valga","Kalvar",2,699,1398]
[null,"2013-01-16","Tallinn","Frodo",5,870,4350]
[null,"2013-01-17","Tallinn","Kalvar",7,699,4893]
[null,"2013-01-17","Tartu","Aragorn",3,499,1497]
[null,"2013-01-18","Tallinn","Aragorn",1,499,499]
[null,"2013-01-18","Pärnu","Eldar",1,465,465]
[null,"2013-01-19","Võru","Elend",5,920,4600]
[null,"2013-01-19","Tallinn","Faram",3,599,1797]
[null,"2013-01-19","Tartu","Kalvar",1,699,699]
[null,"2013-01-20","Tallinn","Elend",2,920,1840]
[null,"2013-01-20","Võru","Sauron",3,339,1017]
[null,"2013-01-21","Pärnu","Arven",1,369,369]
[null,"2013-01-25","Võru","Sauron",1,339,339]
[null,"2013-01-26","Pärnu","Gandalf",2,849,1698]

{"sheet":"Filter_PM_D","index":12,"n_rows":67,"n_cols":11,"rows_kept":67,"cut":false,"hidden":false,"merged":[]}
[]
[null,"Demo. Demo. Demo "]
[null,"Puidu müük. Väljavõtete tegemine maakondade ja puidu liikide lõikes"]
[]
[null,"Maakond","puidu liik",null,null,null,null,null,null,{"$f":"DSUM(PM, \"P_kogus\", Kriteerium)","v":3982},{"$f":"DSUM(PM, \"P_maks\",Kriteerium)","v":247548}]
[null,"P_maa","P_liik"]
[null,"Viljandi"]
[]
[null,null,null,null,"Kokku:",{"$f":"SUM(F13:F203)","v":1991},{"$f":"SUM(G13:G203)","v":123774}]
[]
[null,"Kuupäev","Arve","Müüja","Ostja","Kogus","Maksumus"]
[null,"P_kuupäev","P_arve","P_müüja","P_ostja","P_kogus","P_maks"]
[null,"2013-01-11","P011","Karu","Lepp",24,1920]
[null,"2013-01-11","P011","Jänes","Lepp",16,1216]
[null,"2013-01-25","P022","Karu","Kuusik",23,1610]
[null,"2013-01-25","P022","Karu","Kuusik",16,1120]
[null,"2013-01-25","P022","Karu","Kuusik",20,840]
[null,"2013-01-25","P023","Jänes","Kuusik",24,1920]
[null,"2013-01-27","P024","Karu","Lepp",51,5049]
[null,"2013-01-27","P025","Siil","Lepp",15,1200]
[null,"2013-02-13","P036","Karu","Luik",72,4608]
[null,"2013-02-13","P036","Ilves","Luik",53,3445]
[null,"2013-02-17","P037","Jänes","Kuusik",32,1440]
[null,"2013-02-27","P047","Hunt","Kuusik",28,1176]
[null,"2013-03-02","P053","Karu","Lepp",27,1350]
[null,"2013-03-02","P053","Hunt","Lepp",11,1045]
[null,"2013-03-05","P054","Karu","Lepp",177,7434]
[null,"2013-03-05","P054","Karu","Lepp",37,2183]
[null,"2013-03-15","P061","Siil","Lepp",23,1472]
[null,"2013-03-26","P072","Ilves","Lepp",8,680]
[null,"2013-04-02","P075","Ilves","Lepp",22,1386]
[null,"2013-04-02","P075","Ilves","Lepp",35,2975]
[null,"2013-04-25","P099","Hunt","Kuusik",31,2170]
[null,"2013-04-25","P099","Hunt","Kuusik",36,2340]
[null,"2013-05-03","P106","Ilves","Lepp",45,1800]
[null,"2013-05-03","P106","Ilves","Lepp",31,1302]
[null,"2013-05-03","P107","Rebane","Lepp",17,1020]
[null,"2013-05-15","P119","Karu","Lepp",19,1197]
[null,"2013-05-15","P120","Siil","Luik",33,1716]
[null,"2013-05-18","P124","Põder","Luik",32,3520]
[null,"2013-05-19","P125","Põder","Lepp",65,2600]
[null,"2013-06-04","P134","Siil","Lepp",31,2480]
[null,"2013-06-10","P138","Hunt","Lepp",54,4320]
[null,"2013-06-10","P138","Hunt","Lepp",25,1900]
[null,"2013-07-06","P154","Rebane","Luik",11,968]
[null,"2013-07-09","P157","Hunt","Kuusik",11,495]
[null,"2013-07-09","P157","Hunt","Kuusik",25,2000]
[null,"2013-08-01","P174","Hunt","Luik",12,960]
[null,"2013-08-21","P188","Hunt","Luik",61,4392]
[null,"2013-08-22","P189","Rebane","Kuusik",41,2132]
[null,"2013-08-22","P189","Rebane","Kuusik",10,650]
[null,"2013-08-24","P192","Põder","Kuusik",36,3564]
[null,"2013-09-04","P203","Põder","Lepp",13,975]
[null,"2013-09-12","P206","Ilves","Kuusik",70,3150]
[null,"2013-09-12","P206","Ilves","Kuusik",32,2240]
[null,"2013-09-22","P215","Ilves","Lepp",79,4977]
[null,"2013-09-22","P215","Ilves","Lepp",47,3290]
[null,"2013-10-05","P225","Siil","Lepp",29,1711]
[null,"2013-10-10","P231","Karu","Luik",46,2070]
[null,"2013-10-10","P231","Karu","Luik",71,2982]
[null,"2013-11-18","P264","Ilves","Kuusik",26,1040]
[null,"2013-11-18","P264","Ilves","Kuusik",32,2400]
[null,"2013-11-28","P270","Rebane","Kuusik",27,1404]
[null,"2013-12-05","P278","Jänes","Lepp",55,3520]
[null,"2013-12-27","P292","Hunt","Lepp",42,2100]
[null,"2013-12-27","P292","Hunt","Lepp",65,4875]
[null,"2013-12-30","P295","Karu","Lepp",17,1445]

{"sheet":"Kokku","index":13,"n_rows":1,"n_cols":5,"rows_kept":1,"cut":false,"hidden":false,"merged":[]}
[null,null,null,null,"veeb"]

{"sheet":"Vahekokku","index":14,"n_rows":40,"n_cols":11,"rows_kept":40,"cut":false,"hidden":false,"merged":[[0,9,0,10],[0,5,0,7]]}
[null,null,null,null,"veeb","Klipp Vahekokkuvõtted",null,null,null,"Harjutustabelid"]
[null,null,null,null,null,null,null,null,null,"töötajad","puidu müük"]
[]
[null,"Arvutite müükide arvestus"]
[]
[null,"Kuupäev","Linn","Arvuti","Arv","Hind","Maksumus"]
[null,"2013-01-07","Pärnu","Eldar",3,{"$f":"VLOOKUP(Arvuti, Arvutid, 6, 0)","v":465},{"$f":"Hind*Arv","v":1395}]
[null,"2013-01-10","Pärnu","Elend",1,920,920]
[null,"2013-01-10","Pärnu","Rohan",4,340,1360]
[null,"2013-01-14","Pärnu","Gandalf",3,849,2547]
[null,"2013-01-18","Pärnu","Eldar",1,465,465]
[null,"2013-01-21","Pärnu","Arven",2,369,738]
[null,"2013-01-26","Pärnu","Gandalf",2,849,1698]
[null,"2013-01-02","Tallinn","Frodo",2,870,1740]
[null,"2013-01-03","Tallinn","Aragorn",2,499,998]
[null,"2013-01-03","Tallinn","Balrog",3,419,1257]
[null,"2013-01-04","Tallinn","Eldar",3,465,1395]
[null,"2013-01-07","Tallinn","Faram",1,599,599]
[null,"2013-01-09","Tallinn","Grimbold",6,1149,6894]
[null,"2013-01-11","Tallinn","Frodo",1,870,870]
[null,"2013-01-16","Tallinn","Arven",5,369,1845]
[null,"2013-01-17","Tallinn","Balrog",7,419,2933]
[null,"2013-01-18","Tallinn","Aragorn",1,499,499]
[null,"2013-01-19","Tallinn","Frodo",3,870,2610]
[null,"2013-01-20","Tallinn","Elend",2,920,1840]
[null,"2013-01-04","Tartu","Balrog",5,419,2095]
[null,"2013-01-10","Tartu","Sauron",2,339,678]
[null,"2013-01-11","Tartu","Balrog",2,419,838]
[null,"2013-01-14","Tartu","Frodo",4,870,3480]
[null,"2013-01-17","Tartu","Aragorn",3,499,1497]
[null,"2013-01-19","Tartu","Kalvar",1,699,699]
[null,"2013-01-02","Valga","Balrog",1,419,419]
[null,"2013-01-07","Valga","Balrog",6,419,2514]
[null,"2013-01-07","Valga","Frodo",1,870,870]
[null,"2013-01-11","Valga","Aragorn",1,499,499]
[null,"2013-01-14","Valga","Kalvar",2,699,1398]
[null,"2013-01-03","Võru","Gandalf",2,849,1698]
[null,"2013-01-19","Võru","Elend",5,920,4600]
[null,"2013-01-20","Võru","Sauron",3,339,1017]
[null,"2013-01-25","Võru","Sauron",1,339,339]

{"sheet":"Risttabelid","index":15,"n_rows":40,"n_cols":14,"rows_kept":40,"cut":false,"hidden":false,"merged":[[0,5,0,6]]}
[null,null,null,null,"veeb","Klipp Risttabelid",null,null,null,"Harjutustabelid:"]
[null,null,null,null,null,null,null,null,null,"Töötajad","Puidu müük"]
[]
[null,null,null,null,null,null,null,null,"Arvutite müükide arvestus"]
[]
[null,null,null,null,null,null,null,null,"Kuupäev","Linn","Arvuti","Arv","Hind","Maksumus"]
[null,null,null,null,null,null,null,null,"2013-01-02","Valga","Balrog",2,{"$f":"VLOOKUP(Arvuti, Arvutid, 6, 0)","v":419},{"$f":"Hind*Arv","v":838}]
[null,null,null,null,null,null,null,null,"2013-01-03","Võru","Gandalf",3,{"$f":"VLOOKUP(Arvuti, Arvutid, 6, 0)","v":849},2547]
[null,null,null,null,null,null,null,null,"2013-01-03","Tallinn","Aragorn",2,499,998]
[null,null,null,null,null,null,null,null,"2013-01-03","Tallinn","Balrog",3,419,1257]
[null,null,null,null,null,null,null,null,"2013-01-09","Tallinn","Grimbold",6,1149,6894]
[null,null,null,null,null,null,null,null,"2013-01-19","Võru","Elend",5,920,4600]
[null,null,null,null,null,null,null,null,"2013-01-04","Tallinn","Eldar",3,465,1395]
[null,null,null,null,null,null,null,null,"2013-01-10","Tartu","Sauron",2,339,678]
[null,null,null,null,null,null,null,null,"2013-01-07","Pärnu","Eldar",3,465,1395]
[null,null,null,null,null,null,null,null,"2013-01-07","Tallinn","Faram",1,599,599]
[null,null,null,null,null,null,null,null,"2013-01-26","Pärnu","Gandalf",2,849,1698]
[null,null,null,null,null,null,null,null,"2013-01-11","Tartu","Balrog",2,419,838]
[null,null,null,null,null,null,null,null,"2013-01-10","Pärnu","Elend",1,920,920]
[null,null,null,null,null,null,null,null,"2013-01-02","Tallinn","Frodo",2,870,1740]
[null,null,null,null,null,null,null,null,"2013-01-11","Tallinn","Frodo",1,870,870]
[null,null,null,null,null,null,null,null,"2013-01-11","Valga","Aragorn",1,499,499]
[null,null,null,null,null,null,null,null,"2013-01-14","Tartu","Frodo",4,870,3480]
[null,null,null,null,null,null,null,null,"2013-01-16","Tallinn","Arven",5,369,1845]
[null,null,null,null,null,null,null,null,"2013-01-17","Tallinn","Balrog",7,419,2933]
[null,null,null,null,null,null,null,null,"2013-01-14","Pärnu","Gandalf",3,849,2547]
[null,null,null,null,null,null,null,null,"2013-01-14","Valga","Kalvar",2,699,1398]
[null,null,null,null,null,null,null,null,"2013-01-17","Tartu","Aragorn",3,499,1497]
[null,null,null,null,null,null,null,null,"2013-01-18","Tallinn","Aragorn",1,499,499]
[null,null,null,null,null,null,null,null,"2013-01-07","Valga","Balrog",6,419,2514]
[null,null,null,null,null,null,null,null,"2013-01-19","Tallinn","Frodo",3,870,2610]
[null,null,null,null,null,null,null,null,"2013-01-18","Pärnu","Eldar",1,465,465]
[null,null,null,null,null,null,null,null,"2013-01-10","Pärnu","Rohan",4,340,1360]
[null,null,null,null,null,null,null,null,"2013-01-19","Tartu","Kalvar",1,699,699]
[null,null,null,null,null,null,null,null,"2013-01-20","Tallinn","Elend",2,920,1840]
[null,null,null,null,null,null,null,null,"2013-01-07","Valga","Frodo",1,870,870]
[null,null,null,null,null,null,null,null,"2013-01-20","Võru","Sauron",3,339,1017]
[null,null,null,null,null,null,null,null,"2013-01-21","Pärnu","Arven",1,369,369]
[null,null,null,null,null,null,null,null,"2013-01-25","Võru","Sauron",1,339,339]
[null,null,null,null,null,null,null,null,"2013-01-04","Tartu","Balrog",5,419,2095]

{"sheet":"SumIF","index":16,"n_rows":41,"n_cols":15,"rows_kept":41,"cut":false,"hidden":false,"merged":[[0,5,0,6]]}
[null,null,null,null,"veeb","Klipp SumIF",null,null,null,"Harjutustabel",null,"Puidu müük"]
[]
[null,"Funktsioonid COUNTIF ja SUMIF ",null,null,null,null,null,null,null,"Arvutite müükide arvestus",null,null,null,"AM_SIF"]
[]
[null,null,null,null,null,null,null,null,null,"A_Kuupäev","A_Linn","A_Arvuti","A_Arv","A_Hind","A_Maksumus"]
[null,null,null,null,null,null,null,null,null,"2013-01-02","Tallinn","Frodo",2,{"$f":"VLOOKUP(A_Arvuti, Arvutid, 6, 0)","v":870},{"$f":"A_Hind*A_Arv","v":1740}]
[null,null,null,null,null,null,null,null,null,"2013-01-02","Valga","Balrog",1,419,419]
[null,null,null,null,null,null,null,null,null,"2013-01-03","Tallinn","Aragorn",2,499,998]
[null,null,null,null,null,null,null,null,null,"2013-01-03","Tallinn","Balrog",3,419,1257]
[null,null,null,null,null,null,null,null,null,"2013-01-03","Võru","Gandalf",2,849,1698]
[null,null,null,null,null,null,null,null,null,"2013-01-04","Tallinn","Eldar",3,465,1395]
[null,null,null,null,null,null,null,null,null,"2013-01-04","Tartu","Balrog",5,419,2095]
[null,null,null,null,null,null,null,null,null,"2013-01-07","Pärnu","Eldar",3,465,1395]
[null,null,null,null,null,null,null,null,null,"2013-01-07","Tallinn","Faram",1,599,599]
[null,null,null,null,null,null,null,null,null,"2013-01-07","Valga","Balrog",6,419,2514]
[null,null,null,null,null,null,null,null,null,"2013-01-07","Valga","Frodo",1,870,870]
[null,null,null,null,null,null,null,null,null,"2013-01-09","Tallinn","Grimbold",6,1149,6894]
[null,null,null,null,null,null,null,null,null,"2013-01-10","Pärnu","Elend",1,920,920]
[null,null,null,null,null,null,null,null,null,"2013-01-10","Pärnu","Rohan",4,340,1360]
[null,null,null,null,null,null,null,null,null,"2013-01-10","Tartu","Sauron",2,339,678]
[null,null,null,null,null,null,null,null,null,"2013-01-11","Tallinn","Frodo",1,870,870]
[null,"Arvud","arv",null,null,null,null,null,null,"2013-01-11","Tartu","Balrog",2,419,838]
[null,23,21,null,"Mitu korda esineb loetelus arv 13",null,null,null,null,"2013-01-11","Valga","Aragorn",1,499,499]
[null,-45,null,null,"Mitu korda esineb loetelus lahtris arv olev arv",null,null,null,null,"2013-01-14","Pärnu","Gandalf",3,849,2547]
[null,13,null,null,"Positiivsete arvude summa",null,null,null,null,"2013-01-14","Tartu","Frodo",4,870,3480]
[null,18,null,null,"Positiivsete arvude arv",null,null,null,null,"2013-01-14","Valga","Kalvar",2,699,1398]
[null,21,null,null,"Positiivsete arvude aritmeetiline keskmine",null,null,null,null,"2013-01-16","Tallinn","Arven",5,369,1845]
[null,13,null,null,"Mitu korda esineb loetelus arv 21",null,null,null,null,"2013-01-17","Tallinn","Balrog",7,419,2933]
[null,-16,null,null,"Negatiivsete arvude summa",null,null,null,null,"2013-01-17","Tartu","Aragorn",3,499,1497]
[null,21,null,null,"Negatiivsete arvude arv",null,null,null,null,"2013-01-18","Pärnu","Eldar",1,465,465]
[null,13,null,null,"Negatiivsete arvude aritmeetiline keskmine",null,null,null,null,"2013-01-18","Tallinn","Aragorn",1,499,499]
[null,null,null,null,null,null,null,null,null,"2013-01-19","Tallinn","Frodo",3,870,2610]
[null,null,null,null,null,null,null,null,null,"2013-01-19","Tartu","Kalvar",1,699,699]
[null,null,null,null,null,null,null,null,null,"2013-01-19","Võru","Elend",5,920,4600]
[null,null,null,null,null,null,null,null,null,"2013-01-20","Tallinn","Elend",2,920,1840]
[null,null,null,null,null,null,null,null,null,"2013-01-20","Võru","Sauron",3,339,1017]
[null,null,null,null,null,null,null,null,null,"2013-01-21","Pärnu","Arven",1,369,369]
[null,null,null,null,null,null,null,null,null,"2013-01-25","Võru","Sauron",1,339,339]
[null,null,null,null,null,null,null,null,null,"2013-01-26","Pärnu","Gandalf",2,849,1698]
[]
[null,null,null,null,null,null,null,null,null,null,null,null,{"$f":"SUM(M6:M40)","v":90},null,54875]

{"sheet":"D_Fumkts","index":17,"n_rows":41,"n_cols":14,"rows_kept":41,"cut":false,"hidden":false,"merged":[]}
[]
[]
[]
[]
[null,null,null,null,null,null,null,null,"Müükide arvestus",null,null,{"$f":"SUBTOTAL(9, L8:L42)","v":90},null,{"$f":"SUBTOTAL(9, N8:N42)","v":54875}]
[]
[null,null,null,null,null,null,null,null,"Kuupäev","Linn","Arvuti","Arv","Hind","Maksumus"]
[null,null,null,null,null,null,null,null,"2013-01-02","Tallinn","Frodo",2,{"$f":"VLOOKUP(Arvuti, Arvutid, 6, 0)","v":870},{"$f":"Hind*Arv","v":1740}]
[null,null,null,null,null,null,null,null,"2013-01-02","Valga","Balrog",1,419,419]
[null,null,null,null,null,null,null,null,"2013-01-03","Tallinn","Aragorn",2,499,998]
[null,null,null,null,null,null,null,null,"2013-01-03","Tallinn","Balrog",3,419,1257]
[null,null,null,null,null,null,null,null,"2013-01-03","Võru","Gandalf",2,849,1698]
[null,null,null,null,null,null,null,null,"2013-01-04","Tallinn","Eldar",3,465,1395]
[null,null,null,null,null,null,null,null,"2013-01-04","Tartu","Balrog",5,419,2095]
[null,null,null,null,null,null,null,null,"2013-01-07","Pärnu","Eldar",3,465,1395]
[null,null,null,null,null,null,null,null,"2013-01-07","Tallinn","Faram",1,599,599]
[null,null,null,null,null,null,null,null,"2013-01-07","Valga","Balrog",6,419,2514]
[null,null,null,null,null,null,null,null,"2013-01-07","Valga","Frodo",1,870,870]
[null,null,null,null,null,null,null,null,"2013-01-09","Tallinn","Grimbold",6,1149,6894]
[null,null,null,null,null,null,null,null,"2013-01-10","Pärnu","Elend",1,920,920]
[null,null,null,null,null,null,null,null,"2013-01-10","Pärnu","Rohan",4,340,1360]
[null,null,null,null,null,null,null,null,"2013-01-10","Tartu","Sauron",2,339,678]
[null,"Antud linnades müüdud arvutite arv ja maksumus",null,null,null,null,null,null,"2013-01-11","Tallinn","Frodo",1,870,870]
[null,"Linn",null,null,null,"Arv","Maksumus",null,"2013-01-11","Tartu","Balrog",2,419,838]
[null,"Tallinn",null,null,null,{"$f":"DSUM(AM_1, \"Arv\", B24:B26)","v":53},{"$f":"DSUM(AM_1, \"Maksumus\", B24:B26)","v":32767},null,"2013-01-11","Valga","Aragorn",1,499,499]
[null,"Tartu",null,null,null,null,null,null,"2013-01-14","Pärnu","Gandalf",3,849,2547]
[null,null,null,null,null,null,null,null,"2013-01-14","Tartu","Frodo",4,870,3480]
[null,null,null,null,null,null,null,null,"2013-01-14","Valga","Kalvar",2,699,1398]
[null,"Linn","Arvuti",null,null,"Arv","Maksumus",null,"2013-01-16","Tallinn","Arven",5,369,1845]
[null,"Tallinn","Aragorn",null,null,{"$f":"DSUM(AM_1, \"Arv\", B29:C30)","v":3},{"$f":"DSUM(AM_1, \"Maksumus\", B29:C30)","v":1497},null,"2013-01-17","Tallinn","Balrog",7,419,2933]
[null,null,null,null,null,null,null,null,"2013-01-17","Tartu","Aragorn",3,499,1497]
[null,null,null,null,null,null,null,null,"2013-01-18","Pärnu","Eldar",1,465,465]
[null,"Arvuti","Kuupäev","Kuupäev",null,"Arv","Maksumus",null,"2013-01-18","Tallinn","Aragorn",1,499,499]
[null,"Aragorn",">=01.01.13","<=15.01.13",null,{"$f":"DSUM(AM_1, \"Arv\", B33:D34)","v":3},{"$f":"DSUM(AM_1, \"Maksumus\", B33:D34)","v":1497},null,"2013-01-19","Tallinn","Frodo",3,870,2610]
[null,null,null,null,null,null,null,null,"2013-01-19","Tartu","Kalvar",1,699,699]
[null,null,null,null,null,null,null,null,"2013-01-19","Võru","Elend",5,920,4600]
[null,null,null,null,null,null,null,null,"2013-01-20","Tallinn","Elend",2,920,1840]
[null,null,null,null,null,null,null,null,"2013-01-20","Võru","Sauron",3,339,1017]
[null,null,null,null,null,null,null,null,"2013-01-21","Pärnu","Arven",1,369,369]
[null,null,null,null,null,null,null,null,"2013-01-25","Võru","Sauron",1,339,339]
[null,null,null,null,null,null,null,null,"2013-01-26","Pärnu","Gandalf",2,849,1698]

{"sheet":"P_abi","index":18,"n_rows":53,"n_cols":5,"rows_kept":53,"cut":false,"hidden":false,"merged":[[3,1,4,1],[3,2,3,4]]}
[]
[null,"Puidu hinnkiri"]
[]
[null,"Liik","Sort"]
[null,null,1,2,3]
[null,"haab",50,45,40]
[null,"kask",70,63,56]
[null,"kuusk",80,72,64]
[null,"küte",47,42,38]
[null,"lepp",65,59,52]
[null,"mänd",75,68,60]
[null,"saar",85,77,68]
[null,"tamm",110,99,88]
[null,"vaher",95,86,76]
[]
[]
[]
[null,"P_müüjad",null,"Maakonnad"]
[null,"Karu",null,"Harju"]
[null,"Hunt",null,"Lääne"]
[null,"Jänes",null,"Paide"]
[null,"Rebane",null,"Pärnu"]
[null,"Siil",null,"Rapla"]
[null,"Põder",null,"Valga"]
[null,"Ilves",null,"Viljandi"]
[null,null,null,"Võru"]
[]
[]
[null,"P_ostjad","Maakond"]
[null,"Haab","Pärnu"]
[null,"Ilves","Lääne"]
[null,"Juur","Pärnu"]
[null,"Kaasik","Pärnu"]
[null,"Karu","Lääne"]
[null,"Kask","Pärnu"]
[null,"Kass","Paide"]
[null,"Kaun","Pärnu"]
[null,"Kuusik","Viljandi"]
[null,"Kuusk","Lääne"]
[null,"Känd","Harju"]
[null,"Lepik","Paide"]
[null,"Lepp","Viljandi"]
[null,"Lind","Valga"]
[null,"Luik","Viljandi"]
[null,"Mänd","Harju"]
[null,"Paju","Võru"]
[null,"Pihel","Rapla"]
[null,"Saar","Valga"]
[null,"Seen","Võru"]
[null,"Tuvi","Harju"]
[null,"Vaher","Rapla"]
[null,"Varblane","Harju"]
[null,"Vares","Rapla"]