{"text_format":"1","workbook":"xlsx","n_sheets":4,"sheets":["Viitenumber","tudengid","testid","testid (2)"],"not_rendered":{"charts":0,"images":0,"macros":1,"external_links":0,"defined_names":12,"comments":0,"pivot_tables":2},"unopened":[],"bounds":{"document_bytes":16777216,"sheet_cells":100000,"rows_first":2000,"rows_last":500,"rows_between":2000,"halvings":0,"cell_chars":16384,"cell_head_chars":4096},"cells_cut":0,"cells_raw":0,"read":"whole","date_system":"1900"}

{"sheet":"Viitenumber","index":0,"n_rows":17,"n_cols":4,"rows_kept":17,"cut":false,"hidden":false,"merged":[]}
[]
[]
[]
[]
[]
[]
[]
[]
[null,"Algne number","Kontrolljärk","Viitenumber"]
[null,3698525,{"$f":"kontroll_nr(B10)","v":4},{"$f":"IFERROR(viitenumber(B10),\"\")","v":36985254}]
[null,201911458,{"$f":"kontroll_nr(B11)","v":7},{"$f":"IFERROR(viitenumber(B11),\"\")","v":2019114587}]
[null,369,{"$f":"kontroll_nr(B12)","v":6},{"$f":"IFERROR(viitenumber(B12),\"\")","v":3696}]
[null,"A1458",{"$f":"kontroll_nr(B13)","v":{"$error":"#VALUE!"}},{"$f":"IFERROR(viitenumber(B13),\"\")","v":""}]
[null,20085789125,{"$f":"kontroll_nr(B14)","v":9},{"$f":"IFERROR(viitenumber(B14),\"\")","v":200857891259}]
[null,25874,{"$f":"kontroll_nr(B15)","v":2},{"$f":"IFERROR(viitenumber(B15),\"\")","v":258742}]
[null,134589,{"$f":"kontroll_nr(B16)","v":0},{"$f":"IFERROR(viitenumber(B16),\"\")","v":1345890}]
[null,1,{"$f":"kontroll_nr(B17)","v":3},{"$f":"IFERROR(viitenumber(B17),\"\")","v":13}]

{"sheet":"tudengid","index":1,"n_rows":39,"n_cols":4,"rows_kept":39,"cut":false,"hidden":false,"merged":[]}
[]
[]
[]
["Rühm","Eesnimi","Perenimi","Nimi"]
["R2","Katrin","Laurits",{"$f":"Eesnimi & \" \" &Perenimi","v":"Katrin Laurits"}]
["R1","Anette","Lepp","Anette Lepp"]
["R3","Reimo","Kala","Reimo Kala"]
["R3","Egert","Vint","Egert Vint"]
["R2","Carmen","Sõrmus","Carmen Sõrmus"]
["R2","Armin","Kaasik","Armin Kaasik"]
["R3","Jana","Kiisk","Jana Kiisk"]
["R1","Kaspar","Raude","Kaspar Raude"]
["R3","Karin","Saar","Karin Saar"]
["R2","Hanna","Laid","Hanna Laid"]
["R1","Mihkel","Kulp","Mihkel Kulp"]
["R1","Markus","Niidas","Markus Niidas"]
["R2","Alari","Suur","Alari Suur"]
["R1","Erik","Pärn","Erik Pärn"]
["R1","Martin","Aavik","Martin Aavik"]
["R3","Maarja","Pihlak","Maarja Pihlak"]
["R2","Urmas","Lõhmus","Urmas Lõhmus"]
["R3","Lauri","Vahtra","Lauri Vahtra"]
["R1","Emili","Loorits","Emili Loorits"]
["R2","Jaagup","Kivi","Jaagup Kivi"]
["R3","Joonas","Haljas","Joonas Haljas"]
["R1","Robert","Lentso","Robert Lentso"]
["R3","Viktoria","Lumi","Viktoria Lumi"]
["R2","Sander","Kell","Sander Kell"]
["R1","Hans","Kukk","Hans Kukk"]
["R2","Diana","Taal","Diana Taal"]
["R3","Kertu","Heinsoo","Kertu Heinsoo"]
["R3","Tarvo","Järv","Tarvo Järv"]
["R1","Paul","Hein","Paul Hein"]
["R1","Artur","Piiri","Artur Piiri"]
["R2","Getlin","Allas","Getlin Allas"]
["R1","Brita","Kaljula","Brita Kaljula"]
["R1","Anna","Koel","Anna Koel"]
["R3","Kristina","Merila","Kristina Merila"]
["R2","Rasmus","Kroon","Rasmus Kroon"]

{"sheet":"testid","index":2,"n_rows":1173,"n_cols":35,"rows_kept":1173,"cut":false,"hidden":false,"merged":[]}
[]
[null,null,null,null,null,null,null,null,"1. Leida iga tudengi iga testi kolme viimase testisoorituse aritmeetiline keskmine",null,null,null,null,null,null,"1. Leida iga tudengi iga testi kolme viimase testisoorituse aritmeetiline keskmine"]
[null,null,null,null,null,null,null,null,null,null,null,null,null,null,null,"(valemiga)",null,null,null,null,{"$f":"_xlfn.FORMULATEXT(U7)","v":"=INDEX(Rühm;MATCH(P7;Harjutus14.xlsm!Nimi;0))"}]
["Test","Nimi","Aeg","Tulemus","Jnr","Rühm",null,null,"Jnr","(Multiple Items)",null,null,null,null,null,null,{"$f":"_xlfn.FORMULATEXT(Q7)","v":"=AVERAGEIFS(Tulemus;Nimi;$P7;Test;Q$6;Jnr;\"<=3\")"},null,null,null,null,null,null,"2. Iga tudengi iga testi parim tulemus (liigendtabeliga)",null,null,null,null,null,null,"2. Iga tudengi iga testi parim tulemus (valemiga)"]
["Test02","Robert Lentso","2019-11-12T13:16:35.251",37,{"$f":"COUNTIFS(Test,A5,Nimi,B5,Aeg,\">=\"&C5)","v":8}]
["Test01","Robert Lentso","2019-11-30T09:20:24.603",22,{"$f":"COUNTIFS(Test,A6,Nimi,B6,Aeg,\">=\"&C6)","v":1},null,null,null,"Average of Tulemus","Column Labels",null,null,null,null,null,"Nimi","Test01","Test02","Test03","Test04","Rühm",null,null,"Max. of Tulemus","Column Labels",null,null,null,null,null,"Nimi","Test01","Test02","Test03","Test04"]
["Test03","Sander Kell","2019-11-14T08:35:59.974",55,{"$f":"COUNTIFS(Test,A7,Nimi,B7,Aeg,\">=\"&C7)","v":2},null,null,null,"Row Labels","Test01","Test02","Test03","Test04","Grand Total",null,"Karin Saar",{"$f":"AVERAGEIFS(Tulemus,Nimi,$P7,Test,Q$6,Jnr,\"<=3\")","v":92},{"$f":"AVERAGEIFS(Tulemus,Nimi,$P7,Test,R$6,Jnr,\"<=3\")","v":58.333333333333336},{"$f":"AVERAGEIFS(Tulemus,Nimi,$P7,Test,S$6,Jnr,\"<=3\")","v":71.333333333333329},{"$f":"AVERAGEIFS(Tulemus,Nimi,$P7,Test,T$6,Jnr,\"<=3\")","v":65},{"$f":"INDEX(Rühm,MATCH(P7,[0]!Nimi,0))","v":"R3"},null,null,"Row Labels","Test01","Test02","Test03","Test04","Grand Total",null,"Alari Suur",{"$f":"_xlfn.MAXIFS(Tulemus,Nimi,$AE7,Test,AF$6)","v":96},{"$f":"_xlfn.MAXIFS(Tulemus,Nimi,$AE7,Test,AG$6)","v":91},{"$f":"_xlfn.MAXIFS(Tulemus,Nimi,$AE7,Test,AH$6)","v":88},{"$f":"_xlfn.MAXIFS(Tulemus,Nimi,$AE7,Test,AI$6)","v":93}]
["Test04","Kristina Merila","2019-11-21T20:48:11.179",78,{"$f":"COUNTIFS(Test,A8,Nimi,B8,Aeg,\">=\"&C8)","v":5},null,null,null,"Alari Suur",79,68.666666666666671,61,56,66.166666666666671,null,"Maarja Pihlak",{"$f":"AVERAGEIFS(Tulemus,Nimi,$P8,Test,Q$6,Jnr,\"<=3\")","v":92},{"$f":"AVERAGEIFS(Tulemus,Nimi,$P8,Test,R$6,Jnr,\"<=3\")","v":69},{"$f":"AVERAGEIFS(Tulemus,Nimi,$P8,Test,S$6,Jnr,\"<=3\")","v":79.666666666666671},{"$f":"AVERAGEIFS(Tulemus,Nimi,$P8,Test,T$6,Jnr,\"<=3\")","v":62.666666666666664},{"$f":"INDEX(Rühm,MATCH(P8,[0]!Nimi,0))","v":"R3"},null,null,"Alari Suur",96,91,88,93,96,null,"Anette Lepp",{"$f":"_xlfn.MAXIFS(Tulemus,Nimi,$AE8,Test,AF$6)","v":94},{"$f":"_xlfn.MAXIFS(Tulemus,Nimi,$AE8,Test,AG$6)","v":99},{"$f":"_xlfn.MAXIFS(Tulemus,Nimi,$AE8,Test,AH$6)","v":97},{"$f":"_xlfn.MAXIFS(Tulemus,Nimi,$AE8,Test,AI$6)","v":80}]
["Test01","Kertu Heinsoo","2019-11-28T19:05:40.022",70,{"$f":"COUNTIFS(Test,A9,Nimi,B9,Aeg,\">=\"&C9)","v":3},null,null,null,"Anette Lepp",76.333333333333329,63.333333333333336,71,37.666666666666664,62.083333333333336,null,"Jaagup Kivi",{"$f":"AVERAGEIFS(Tulemus,Nimi,$P9,Test,Q$6,Jnr,\"<=3\")","v":85.666666666666671},{"$f":"AVERAGEIFS(Tulemus,Nimi,$P9,Test,R$6,Jnr,\"<=3\")","v":70.666666666666671},{"$f":"AVERAGEIFS(Tulemus,Nimi,$P9,Test,S$6,Jnr,\"<=3\")","v":54.333333333333336},{"$f":"AVERAGEIFS(Tulemus,Nimi,$P9,Test,T$6,Jnr,\"<=3\")","v":65},{"$f":"INDEX(Rühm,MATCH(P9,[0]!Nimi,0))","v":"R2"},null,null,"Anette Lepp",94,99,97,80,99,null,"Anna Koel",{"$f":"_xlfn.MAXIFS(Tulemus,Nimi,$AE9,Test,AF$6)","v":72},{"$f":"_xlfn.MAXIFS(Tulemus,Nimi,$AE9,Test,AG$6)","v":99},{"$f":"_xlfn.MAXIFS(Tulemus,Nimi,$AE9,Test,AH$6)","v":81},{"$f":"_xlfn.MAXIFS(Tulemus,Nimi,$AE9,Test,AI$6)","v":100}]
["Test03","Kertu Heinsoo","2019-11-20T20:41:35.651",75,{"$f":"COUNTIFS(Test,A10,Nimi,B10,Aeg,\">=\"&C10)","v":6},null,null,null,"Anna Koel",51.333333333333336,50,48.333333333333336,59.666666666666664,52.333333333333336,null,"Brita Kaljula",{"$f":"AVERAGEIFS(Tulemus,Nimi,$P10,Test,Q$6,Jnr,\"<=3\")","v":83},{"$f":"AVERAGEIFS(Tulemus,Nimi,$P10,Test,R$6,Jnr,\"<=3\")","v":62.666666666666664},{"$f":"AVERAGEIFS(Tulemus,Nimi,$P10,Test,S$6,Jnr,\"<=3\")","v":54.333333333333336},{"$f":"AVERAGEIFS(Tulemus,Nimi,$P10,Test,T$6,Jnr,\"<=3\")","v":43.666666666666664},{"$f":"INDEX(Rühm,MATCH(P10,[0]!Nimi,0))","v":"R1"},null,null,"Anna Koel",72,99,81,100,100,null,"Armin Kaasik",{"$f":"_xlfn.MAXIFS(Tulemus,Nimi,$AE10,Test,AF$6)","v":95},{"$f":"_xlfn.MAXIFS(Tulemus,Nimi,$AE10,Test,AG$6)","v":79},{"$f":"_xlfn.MAXIFS(Tulemus,Nimi,$AE10,Test,AH$6)","v":100},{"$f":"_xlfn.MAXIFS(Tulemus,Nimi,$AE10,Test,AI$6)","v":56}]
["Test01","Urmas Lõhmus","2019-11-13T14:20:00.655",45,{"$f":"COUNTIFS(Test,A11,Nimi,B11,Aeg,\">=\"&C11)","v":4},null,null,null,"Armin Kaasik",75,46.666666666666664,61.666666666666664,42,56.333333333333336,null,"Alari Suur",{"$f":"AVERAGEIFS(Tulemus,Nimi,$P11,Test,Q$6,Jnr,\"<=3\")","v":79},{"$f":"AVERAGEIFS(Tulemus,Nimi,$P11,Test,R$6,Jnr,\"<=3\")","v":68.666666666666671},{"$f":"AVERAGEIFS(Tulemus,Nimi,$P11,Test,S$6,Jnr,\"<=3\")","v":61},{"$f":"AVERAGEIFS(Tulemus,Nimi,$P11,Test,T$6,Jnr,\"<=3\")","v":56},{"$f":"INDEX(Rühm,MATCH(P11,[0]!Nimi,0))","v":"R2"},null,null,"Armin Kaasik",95,79,100,56,100,null,"Artur Piiri",{"$f":"_xlfn.MAXIFS(Tulemus,Nimi,$AE11,Test,AF$6)","v":98},{"$f":"_xlfn.MAXIFS(Tulemus,Nimi,$AE11,Test,AG$6)","v":97},{"$f":"_xlfn.MAXIFS(Tulemus,Nimi,$AE11,Test,AH$6)","v":99},{"$f":"_xlfn.MAXIFS(Tulemus,Nimi,$AE11,Test,AI$6)","v":93}]
["Test04","Robert Lentso","2019-11-17T20:51:19.625",59,{"$f":"COUNTIFS(Test,A12,Nimi,B12,Aeg,\">=\"&C12)","v":3},null,null,null,"Artur Piiri",68.333333333333329,84.333333333333329,56.666666666666664,88,74.333333333333329,null,"Joonas Haljas",{"$f":"AVERAGEIFS(Tulemus,Nimi,$P12,Test,Q$6,Jnr,\"<=3\")","v":78.333333333333329},{"$f":"AVERAGEIFS(Tulemus,Nimi,$P12,Test,R$6,Jnr,\"<=3\")","v":35.666666666666664},{"$f":"AVERAGEIFS(Tulemus,Nimi,$P12,Test,S$6,Jnr,\"<=3\")","v":66.666666666666671},{"$f":"AVERAGEIFS(Tulemus,Nimi,$P12,Test,T$6,Jnr,\"<=3\")","v":57},{"$f":"INDEX(Rühm,MATCH(P12,[0]!Nimi,0))","v":"R3"},null,null,"Artur Piiri",98,97,99,93,99,null,"Brita Kaljula",{"$f":"_xlfn.MAXIFS(Tulemus,Nimi,$AE12,Test,AF$6)","v":99},{"$f":"_xlfn.MAXIFS(Tulemus,Nimi,$AE12,Test,AG$6)","v":100},{"$f":"_xlfn.MAXIFS(Tulemus,Nimi,$AE12,Test,AH$6)","v":97},{"$f":"_xlfn.MAXIFS(Tulemus,Nimi,$AE12,Test,AI$6)","v":100}]
["Test03","Joonas Haljas","2019-11-23T08:56:43.995",40,{"$f":"COUNTIFS(Test,A13,Nimi,B13,Aeg,\">=\"&C13)","v":2},null,null,null,"Brita Kaljula",83,62.666666666666664,54.333333333333336,43.666666666666664,60.916666666666664,null,"Anette Lepp",{"$f":"AVERAGEIFS(Tulemus,Nimi,$P13,Test,Q$6,Jnr,\"<=3\")","v":76.333333333333329},{"$f":"AVERAGEIFS(Tulemus,Nimi,$P13,Test,R$6,Jnr,\"<=3\")","v":63.333333333333336},{"$f":"AVERAGEIFS(Tulemus,Nimi,$P13,Test,S$6,Jnr,\"<=3\")","v":71},{"$f":"AVERAGEIFS(Tulemus,Nimi,$P13,Test,T$6,Jnr,\"<=3\")","v":37.666666666666664},{"$f":"INDEX(Rühm,MATCH(P13,[0]!Nimi,0))","v":"R1"},null,null,"Brita Kaljula",99,100,97,100,100,null,"Carmen Sõrmus",{"$f":"_xlfn.MAXIFS(Tulemus,Nimi,$AE13,Test,AF$6)","v":70},{"$f":"_xlfn.MAXIFS(Tulemus,Nimi,$AE13,Test,AG$6)","v":97},{"$f":"_xlfn.MAXIFS(Tulemus,Nimi,$AE13,Test,AH$6)","v":67},{"$f":"_xlfn.MAXIFS(Tulemus,Nimi,$AE13,Test,AI$6)","v":86}]
["Test04","Urmas Lõhmus","2019-11-23T15:08:20.630",96,{"$f":"COUNTIFS(Test,A14,Nimi,B14,Aeg,\">=\"&C14)","v":2},null,null,null,"Carmen Sõrmus",31.333333333333332,57.333333333333336,45.666666666666664,73.333333333333329,51.916666666666664,null,"Armin Kaasik",{"$f":"AVERAGEIFS(Tulemus,Nimi,$P14,Test,Q$6,Jnr,\"<=3\")","v":75},{"$f":"AVERAGEIFS(Tulemus,Nimi,$P14,Test,R$6,Jnr,\"<=3\")","v":46.666666666666664},{"$f":"AVERAGEIFS(Tulemus,Nimi,$P14,Test,S$6,Jnr,\"<=3\")","v":61.666666666666664},{"$f":"AVERAGEIFS(Tulemus,Nimi,$P14,Test,T$6,Jnr,\"<=3\")","v":42},{"$f":"INDEX(Rühm,MATCH(P14,[0]!Nimi,0))","v":"R2"},null,null,"Carmen Sõrmus",70,97,67,86,97,null,"Diana Taal",{"$f":"_xlfn.MAXIFS(Tulemus,Nimi,$AE14,Test,AF$6)","v":86},{"$f":"_xlfn.MAXIFS(Tulemus,Nimi,$AE14,Test,AG$6)","v":93},{"$f":"_xlfn.MAXIFS(Tulemus,Nimi,$AE14,Test,AH$6)","v":95},{"$f":"_xlfn.MAXIFS(Tulemus,Nimi,$AE14,Test,AI$6)","v":93}]
["Test02","Robert Lentso","2019-11-13T17:35:12.257",68,{"$f":"COUNTIFS(Test,A15,Nimi,B15,Aeg,\">=\"&C15)","v":7},null,null,null,"Diana Taal",53,79.333333333333329,62.666666666666664,78,68.25,null,"Hans Kukk",{"$f":"AVERAGEIFS(Tulemus,Nimi,$P15,Test,Q$6,Jnr,\"<=3\")","v":75},{"$f":"AVERAGEIFS(Tulemus,Nimi,$P15,Test,R$6,Jnr,\"<=3\")","v":58.666666666666664},{"$f":"AVERAGEIFS(Tulemus,Nimi,$P15,Test,S$6,Jnr,\"<=3\")","v":69.666666666666671},{"$f":"AVERAGEIFS(Tulemus,Nimi,$P15,Test,T$6,Jnr,\"<=3\")","v":53},{"$f":"INDEX(Rühm,MATCH(P15,[0]!Nimi,0))","v":"R1"},null,null,"Diana Taal",86,93,95,93,95,null,"Egert Vint",{"$f":"_xlfn.MAXIFS(Tulemus,Nimi,$AE15,Test,AF$6)","v":100},{"$f":"_xlfn.MAXIFS(Tulemus,Nimi,$AE15,Test,AG$6)","v":81},{"$f":"_xlfn.MAXIFS(Tulemus,Nimi,$AE15,Test,AH$6)","v":84},{"$f":"_xlfn.MAXIFS(Tulemus,Nimi,$AE15,Test,AI$6)","v":78}]
["Test03","Kristina Merila","2019-11-15T16:15:08.575",59,{"$f":"COUNTIFS(Test,A16,Nimi,B16,Aeg,\">=\"&C16)","v":6},null,null,null,"Egert Vint",44,41.666666666666664,64,38.333333333333336,47,null,"Reimo Kala",{"$f":"AVERAGEIFS(Tulemus,Nimi,$P16,Test,Q$6,Jnr,\"<=3\")","v":75},{"$f":"AVERAGEIFS(Tulemus,Nimi,$P16,Test,R$6,Jnr,\"<=3\")","v":79.666666666666671},{"$f":"AVERAGEIFS(Tulemus,Nimi,$P16,Test,S$6,Jnr,\"<=3\")","v":51.666666666666664},{"$f":"AVERAGEIFS(Tulemus,Nimi,$P16,Test,T$6,Jnr,\"<=3\")","v":76.333333333333329},{"$f":"INDEX(Rühm,MATCH(P16,[0]!Nimi,0))","v":"R3"},null,null,"Egert Vint",100,81,84,78,100,null,"Emili Loorits",{"$f":"_xlfn.MAXIFS(Tulemus,Nimi,$AE16,Test,AF$6)","v":69},{"$f":"_xlfn.MAXIFS(Tulemus,Nimi,$AE16,Test,AG$6)","v":100},{"$f":"_xlfn.MAXIFS(Tulemus,Nimi,$AE16,Test,AH$6)","v":85},{"$f":"_xlfn.MAXIFS(Tulemus,Nimi,$AE16,Test,AI$6)","v":84}]
["Test02","Hans Kukk","2019-11-01T10:22:42.466",26,{"$f":"COUNTIFS(Test,A17,Nimi,B17,Aeg,\">=\"&C17)","v":9},null,null,null,"Emili Loorits",56.333333333333336,74.666666666666671,31.666666666666668,44,51.666666666666664,null,"Erik Pärn",{"$f":"AVERAGEIFS(Tulemus,Nimi,$P17,Test,Q$6,Jnr,\"<=3\")","v":71.333333333333329},{"$f":"AVERAGEIFS(Tulemus,Nimi,$P17,Test,R$6,Jnr,\"<=3\")","v":59},{"$f":"AVERAGEIFS(Tulemus,Nimi,$P17,Test,S$6,Jnr,\"<=3\")","v":66},{"$f":"AVERAGEIFS(Tulemus,Nimi,$P17,Test,T$6,Jnr,\"<=3\")","v":86.666666666666671},{"$f":"INDEX(Rühm,MATCH(P17,[0]!Nimi,0))","v":"R1"},null,null,"Emili Loorits",69,100,85,84,100,null,"Erik Pärn",{"$f":"_xlfn.MAXIFS(Tulemus,Nimi,$AE17,Test,AF$6)","v":93},{"$f":"_xlfn.MAXIFS(Tulemus,Nimi,$AE17,Test,AG$6)","v":94},{"$f":"_xlfn.MAXIFS(Tulemus,Nimi,$AE17,Test,AH$6)","v":84},{"$f":"_xlfn.MAXIFS(Tulemus,Nimi,$AE17,Test,AI$6)","v":98}]
["Test03","Rasmus Kroon","2019-11-11T14:22:22.170",73,{"$f":"COUNTIFS(Test,A18,Nimi,B18,Aeg,\">=\"&C18)","v":7},null,null,null,"Erik Pärn",71.333333333333329,59,66,86.666666666666671,70.75,null,"Hanna Laid",{"$f":"AVERAGEIFS(Tulemus,Nimi,$P18,Test,Q$6,Jnr,\"<=3\")","v":70.333333333333329},{"$f":"AVERAGEIFS(Tulemus,Nimi,$P18,Test,R$6,Jnr,\"<=3\")","v":53.666666666666664},{"$f":"AVERAGEIFS(Tulemus,Nimi,$P18,Test,S$6,Jnr,\"<=3\")","v":69.666666666666671},{"$f":"AVERAGEIFS(Tulemus,Nimi,$P18,Test,T$6,Jnr,\"<=3\")","v":49.333333333333336},{"$f":"INDEX(Rühm,MATCH(P18,[0]!Nimi,0))","v":"R2"},null,null,"Erik Pärn",93,94,84,98,98,null,"Getlin Allas",{"$f":"_xlfn.MAXIFS(Tulemus,Nimi,$AE18,Test,AF$6)","v":97},{"$f":"_xlfn.MAXIFS(Tulemus,Nimi,$AE18,Test,AG$6)","v":92},{"$f":"_xlfn.MAXIFS(Tulemus,Nimi,$AE18,Test,AH$6)","v":85},{"$f":"_xlfn.MAXIFS(Tulemus,Nimi,$AE18,Test,AI$6)","v":98}]
["Test01","Maarja Pihlak","2019-11-29T09:41:58.019",89,{"$f":"COUNTIFS(Test,A19,Nimi,B19,Aeg,\">=\"&C19)","v":1},null,null,null,"Getlin Allas",67.333333333333329,62.666666666666664,63.666666666666664,51.666666666666664,61.333333333333336,null,"Artur Piiri",{"$f":"AVERAGEIFS(Tulemus,Nimi,$P19,Test,Q$6,Jnr,\"<=3\")","v":68.333333333333329},{"$f":"AVERAGEIFS(Tulemus,Nimi,$P19,Test,R$6,Jnr,\"<=3\")","v":84.333333333333329},{"$f":"AVERAGEIFS(Tulemus,Nimi,$P19,Test,S$6,Jnr,\"<=3\")","v":56.666666666666664},{"$f":"AVERAGEIFS(Tulemus,Nimi,$P19,Test,T$6,Jnr,\"<=3\")","v":88},{"$f":"INDEX(Rühm,MATCH(P19,[0]!Nimi,0))","v":"R1"},null,null,"Getlin Allas",97,92,85,98,98,null,"Hanna Laid",{"$f":"_xlfn.MAXIFS(Tulemus,Nimi,$AE19,Test,AF$6)","v":92},{"$f":"_xlfn.MAXIFS(Tulemus,Nimi,$AE19,Test,AG$6)","v":84},{"$f":"_xlfn.MAXIFS(Tulemus,Nimi,$AE19,Test,AH$6)","v":99},{"$f":"_xlfn.MAXIFS(Tulemus,Nimi,$AE19,Test,AI$6)","v":99}]
["Test01","Sander Kell","2019-11-09T13:18:08.716",30,{"$f":"COUNTIFS(Test,A20,Nimi,B20,Aeg,\">=\"&C20)","v":9},null,null,null,"Hanna Laid",70.333333333333329,53.666666666666664,69.666666666666671,49.333333333333336,60.75,null,"Getlin Allas",{"$f":"AVERAGEIFS(Tulemus,Nimi,$P20,Test,Q$6,Jnr,\"<=3\")","v":67.333333333333329},{"$f":"AVERAGEIFS(Tulemus,Nimi,$P20,Test,R$6,Jnr,\"<=3\")","v":62.666666666666664},{"$f":"AVERAGEIFS(Tulemus,Nimi,$P20,Test,S$6,Jnr,\"<=3\")","v":63.666666666666664},{"$f":"AVERAGEIFS(Tulemus,Nimi,$P20,Test,T$6,Jnr,\"<=3\")","v":51.666666666666664},{"$f":"INDEX(Rühm,MATCH(P20,[0]!Nimi,0))","v":"R2"},null,null,"Hanna Laid",92,84,99,99,99,null,"Hans Kukk",{"$f":"_xlfn.MAXIFS(Tulemus,Nimi,$AE20,Test,AF$6)","v":100},{"$f":"_xlfn.MAXIFS(Tulemus,Nimi,$AE20,Test,AG$6)","v":97},{"$f":"_xlfn.MAXIFS(Tulemus,Nimi,$AE20,Test,AH$6)","v":100},{"$f":"_xlfn.MAXIFS(Tulemus,Nimi,$AE20,Test,AI$6)","v":96}]
["Test04","Joonas Haljas","2019-11-22T16:27:02.789",57,{"$f":"COUNTIFS(Test,A21,Nimi,B21,Aeg,\">=\"&C21)","v":1},null,null,null,"Hans Kukk",75,58.666666666666664,69.666666666666671,53,64.083333333333329,null,"Rasmus Kroon",{"$f":"AVERAGEIFS(Tulemus,Nimi,$P21,Test,Q$6,Jnr,\"<=3\")","v":66},{"$f":"AVERAGEIFS(Tulemus,Nimi,$P21,Test,R$6,Jnr,\"<=3\")","v":61.333333333333336},{"$f":"AVERAGEIFS(Tulemus,Nimi,$P21,Test,S$6,Jnr,\"<=3\")","v":35.333333333333336},{"$f":"AVERAGEIFS(Tulemus,Nimi,$P21,Test,T$6,Jnr,\"<=3\")","v":84},{"$f":"INDEX(Rühm,MATCH(P21,[0]!Nimi,0))","v":"R2"},null,null,"Hans Kukk",100,97,100,96,100,null,"Jaagup Kivi",{"$f":"_xlfn.MAXIFS(Tulemus,Nimi,$AE21,Test,AF$6)","v":98},{"$f":"_xlfn.MAXIFS(Tulemus,Nimi,$AE21,Test,AG$6)","v":97},{"$f":"_xlfn.MAXIFS(Tulemus,Nimi,$AE21,Test,AH$6)","v":87},{"$f":"_xlfn.MAXIFS(Tulemus,Nimi,$AE21,Test,AI$6)","v":93}]
["Test02","Reimo Kala","2019-11-22T16:20:40.046",87,{"$f":"COUNTIFS(Test,A22,Nimi,B22,Aeg,\">=\"&C22)","v":2},null,null,null,"Jaagup Kivi",85.666666666666671,70.666666666666671,54.333333333333336,65,68.916666666666671,null,"Kertu Heinsoo",{"$f":"AVERAGEIFS(Tulemus,Nimi,$P22,Test,Q$6,Jnr,\"<=3\")","v":61.666666666666664},{"$f":"AVERAGEIFS(Tulemus,Nimi,$P22,Test,R$6,Jnr,\"<=3\")","v":55.666666666666664},{"$f":"AVERAGEIFS(Tulemus,Nimi,$P22,Test,S$6,Jnr,\"<=3\")","v":44},{"$f":"AVERAGEIFS(Tulemus,Nimi,$P22,Test,T$6,Jnr,\"<=3\")","v":54},{"$f":"INDEX(Rühm,MATCH(P22,[0]!Nimi,0))","v":"R3"},null,null,"Jaagup Kivi",98,97,87,93,98,null,"Jana Kiisk",{"$f":"_xlfn.MAXIFS(Tulemus,Nimi,$AE22,Test,AF$6)","v":84},{"$f":"_xlfn.MAXIFS(Tulemus,Nimi,$AE22,Test,AG$6)","v":91},{"$f":"_xlfn.MAXIFS(Tulemus,Nimi,$AE22,Test,AH$6)","v":90},{"$f":"_xlfn.MAXIFS(Tulemus,Nimi,$AE22,Test,AI$6)","v":91}]
["Test02","Urmas Lõhmus","2019-11-02T10:17:31.185",45,{"$f":"COUNTIFS(Test,A23,Nimi,B23,Aeg,\">=\"&C23)","v":10},null,null,null,"Jana Kiisk",54,63,64.666666666666671,91,63.6,null,"Tarvo Järv",{"$f":"AVERAGEIFS(Tulemus,Nimi,$P23,Test,Q$6,Jnr,\"<=3\")","v":61.666666666666664},{"$f":"AVERAGEIFS(Tulemus,Nimi,$P23,Test,R$6,Jnr,\"<=3\")","v":49.333333333333336},{"$f":"AVERAGEIFS(Tulemus,Nimi,$P23,Test,S$6,Jnr,\"<=3\")","v":53.333333333333336},{"$f":"AVERAGEIFS(Tulemus,Nimi,$P23,Test,T$6,Jnr,\"<=3\")","v":91},{"$f":"INDEX(Rühm,MATCH(P23,[0]!Nimi,0))","v":"R3"},null,null,"Jana Kiisk",84,91,90,91,91,null,"Joonas Haljas",{"$f":"_xlfn.MAXIFS(Tulemus,Nimi,$AE23,Test,AF$6)","v":92},{"$f":"_xlfn.MAXIFS(Tulemus,Nimi,$AE23,Test,AG$6)","v":98},{"$f":"_xlfn.MAXIFS(Tulemus,Nimi,$AE23,Test,AH$6)","v":99},{"$f":"_xlfn.MAXIFS(Tulemus,Nimi,$AE23,Test,AI$6)","v":86}]
["Test03","Martin Aavik","2019-11-25T21:13:36.966",63,{"$f":"COUNTIFS(Test,A24,Nimi,B24,Aeg,\">=\"&C24)","v":3},null,null,null,"Joonas Haljas",78.333333333333329,35.666666666666664,66.666666666666671,57,59.416666666666664,null,"Urmas Lõhmus",{"$f":"AVERAGEIFS(Tulemus,Nimi,$P24,Test,Q$6,Jnr,\"<=3\")","v":60.666666666666664},{"$f":"AVERAGEIFS(Tulemus,Nimi,$P24,Test,R$6,Jnr,\"<=3\")","v":45},{"$f":"AVERAGEIFS(Tulemus,Nimi,$P24,Test,S$6,Jnr,\"<=3\")","v":57.333333333333336},{"$f":"AVERAGEIFS(Tulemus,Nimi,$P24,Test,T$6,Jnr,\"<=3\")","v":77},{"$f":"INDEX(Rühm,MATCH(P24,[0]!Nimi,0))","v":"R2"},null,null,"Joonas Haljas",92,98,99,86,99,null,"Karin Saar",{"$f":"_xlfn.MAXIFS(Tulemus,Nimi,$AE24,Test,AF$6)","v":95},{"$f":"_xlfn.MAXIFS(Tulemus,Nimi,$AE24,Test,AG$6)","v":80},{"$f":"_xlfn.MAXIFS(Tulemus,Nimi,$AE24,Test,AH$6)","v":96},{"$f":"_xlfn.MAXIFS(Tulemus,Nimi,$AE24,Test,AI$6)","v":98}]
["Test02","Lauri Vahtra","2019-11-25T17:23:27.962",27,{"$f":"COUNTIFS(Test,A25,Nimi,B25,Aeg,\">=\"&C25)","v":3},null,null,null,"Karin Saar",92,58.333333333333336,71.333333333333329,65,71.666666666666671,null,"Sander Kell",{"$f":"AVERAGEIFS(Tulemus,Nimi,$P25,Test,Q$6,Jnr,\"<=3\")","v":59.333333333333336},{"$f":"AVERAGEIFS(Tulemus,Nimi,$P25,Test,R$6,Jnr,\"<=3\")","v":43.666666666666664},{"$f":"AVERAGEIFS(Tulemus,Nimi,$P25,Test,S$6,Jnr,\"<=3\")","v":69.333333333333329},{"$f":"AVERAGEIFS(Tulemus,Nimi,$P25,Test,T$6,Jnr,\"<=3\")","v":42.333333333333336},{"$f":"INDEX(Rühm,MATCH(P25,[0]!Nimi,0))","v":"R2"},null,null,"Karin Saar",95,80,96,98,98,null,"Kaspar Raude",{"$f":"_xlfn.MAXIFS(Tulemus,Nimi,$AE25,Test,AF$6)","v":95},{"$f":"_xlfn.MAXIFS(Tulemus,Nimi,$AE25,Test,AG$6)","v":94},{"$f":"_xlfn.MAXIFS(Tulemus,Nimi,$AE25,Test,AH$6)","v":91},{"$f":"_xlfn.MAXIFS(Tulemus,Nimi,$AE25,Test,AI$6)","v":89}]
["Test01","Getlin Allas","2019-11-11T21:10:26.773",41,{"$f":"COUNTIFS(Test,A26,Nimi,B26,Aeg,\">=\"&C26)","v":8},null,null,null,"Kaspar Raude",47,79.333333333333329,70,63,64.833333333333329,null,"Emili Loorits",{"$f":"AVERAGEIFS(Tulemus,Nimi,$P26,Test,Q$6,Jnr,\"<=3\")","v":56.333333333333336},{"$f":"AVERAGEIFS(Tulemus,Nimi,$P26,Test,R$6,Jnr,\"<=3\")","v":74.666666666666671},{"$f":"AVERAGEIFS(Tulemus,Nimi,$P26,Test,S$6,Jnr,\"<=3\")","v":31.666666666666668},{"$f":"AVERAGEIFS(Tulemus,Nimi,$P26,Test,T$6,Jnr,\"<=3\")","v":44},{"$f":"INDEX(Rühm,MATCH(P26,[0]!Nimi,0))","v":"R1"},null,null,"Kaspar Raude",95,94,91,89,95,null,"Katrin Laurits",{"$f":"_xlfn.MAXIFS(Tulemus,Nimi,$AE26,Test,AF$6)","v":98},{"$f":"_xlfn.MAXIFS(Tulemus,Nimi,$AE26,Test,AG$6)","v":84},{"$f":"_xlfn.MAXIFS(Tulemus,Nimi,$AE26,Test,AH$6)","v":99},{"$f":"_xlfn.MAXIFS(Tulemus,Nimi,$AE26,Test,AI$6)","v":97}]
["Test01","Karin Saar","2019-11-24T08:00:23.699",88,{"$f":"COUNTIFS(Test,A27,Nimi,B27,Aeg,\">=\"&C27)","v":2},null,null,null,"Katrin Laurits",46.333333333333336,39,78,64,56.833333333333336,null,"Jana Kiisk",{"$f":"AVERAGEIFS(Tulemus,Nimi,$P27,Test,Q$6,Jnr,\"<=3\")","v":54},{"$f":"AVERAGEIFS(Tulemus,Nimi,$P27,Test,R$6,Jnr,\"<=3\")","v":63},{"$f":"AVERAGEIFS(Tulemus,Nimi,$P27,Test,S$6,Jnr,\"<=3\")","v":64.666666666666671},{"$f":"AVERAGEIFS(Tulemus,Nimi,$P27,Test,T$6,Jnr,\"<=3\")","v":91},{"$f":"INDEX(Rühm,MATCH(P27,[0]!Nimi,0))","v":"R3"},null,null,"Katrin Laurits",98,84,99,97,99,null,"Kertu Heinsoo",{"$f":"_xlfn.MAXIFS(Tulemus,Nimi,$AE27,Test,AF$6)","v":90},{"$f":"_xlfn.MAXIFS(Tulemus,Nimi,$AE27,Test,AG$6)","v":82},{"$f":"_xlfn.MAXIFS(Tulemus,Nimi,$AE27,Test,AH$6)","v":95},{"$f":"_xlfn.MAXIFS(Tulemus,Nimi,$AE27,Test,AI$6)","v":100}]
["Test01","Egert Vint","2019-11-30T14:29:20.273",29,{"$f":"COUNTIFS(Test,A28,Nimi,B28,Aeg,\">=\"&C28)","v":1},null,null,null,"Kertu Heinsoo",61.666666666666664,55.666666666666664,44,54,53.833333333333336,null,"Diana Taal",{"$f":"AVERAGEIFS(Tulemus,Nimi,$P28,Test,Q$6,Jnr,\"<=3\")","v":53},{"$f":"AVERAGEIFS(Tulemus,Nimi,$P28,Test,R$6,Jnr,\"<=3\")","v":79.333333333333329},{"$f":"AVERAGEIFS(Tulemus,Nimi,$P28,Test,S$6,Jnr,\"<=3\")","v":62.666666666666664},{"$f":"AVERAGEIFS(Tulemus,Nimi,$P28,Test,T$6,Jnr,\"<=3\")","v":78},{"$f":"INDEX(Rühm,MATCH(P28,[0]!Nimi,0))","v":"R2"},null,null,"Kertu Heinsoo",90,82,95,100,100,null,"Kristina Merila",{"$f":"_xlfn.MAXIFS(Tulemus,Nimi,$AE28,Test,AF$6)","v":72},{"$f":"_xlfn.MAXIFS(Tulemus,Nimi,$AE28,Test,AG$6)","v":99},{"$f":"_xlfn.MAXIFS(Tulemus,Nimi,$AE28,Test,AH$6)","v":97},{"$f":"_xlfn.MAXIFS(Tulemus,Nimi,$AE28,Test,AI$6)","v":94}]
["Test04","Hanna Laid","2019-11-16T11:05:59.488",36,{"$f":"COUNTIFS(Test,A29,Nimi,B29,Aeg,\">=\"&C29)","v":6},null,null,null,"Kristina Merila",45,57.333333333333336,72.333333333333329,39,53.416666666666664,null,"Lauri Vahtra",{"$f":"AVERAGEIFS(Tulemus,Nimi,$P29,Test,Q$6,Jnr,\"<=3\")","v":52.666666666666664},{"$f":"AVERAGEIFS(Tulemus,Nimi,$P29,Test,R$6,Jnr,\"<=3\")","v":67.666666666666671},{"$f":"AVERAGEIFS(Tulemus,Nimi,$P29,Test,S$6,Jnr,\"<=3\")","v":65.333333333333329},{"$f":"AVERAGEIFS(Tulemus,Nimi,$P29,Test,T$6,Jnr,\"<=3\")","v":50},{"$f":"INDEX(Rühm,MATCH(P29,[0]!Nimi,0))","v":"R3"},null,null,"Kristina Merila",72,99,97,94,99,null,"Lauri Vahtra",{"$f":"_xlfn.MAXIFS(Tulemus,Nimi,$AE29,Test,AF$6)","v":98},{"$f":"_xlfn.MAXIFS(Tulemus,Nimi,$AE29,Test,AG$6)","v":93},{"$f":"_xlfn.MAXIFS(Tulemus,Nimi,$AE29,Test,AH$6)","v":99},{"$f":"_xlfn.MAXIFS(Tulemus,Nimi,$AE29,Test,AI$6)","v":97}]
["Test02","Maarja Pihlak","2019-11-03T11:24:19.446",81,{"$f":"COUNTIFS(Test,A30,Nimi,B30,Aeg,\">=\"&C30)","v":10},null,null,null,"Lauri Vahtra",52.666666666666664,67.666666666666671,65.333333333333329,50,58.916666666666664,null,"Paul Hein",{"$f":"AVERAGEIFS(Tulemus,Nimi,$P30,Test,Q$6,Jnr,\"<=3\")","v":52.333333333333336},{"$f":"AVERAGEIFS(Tulemus,Nimi,$P30,Test,R$6,Jnr,\"<=3\")","v":65},{"$f":"AVERAGEIFS(Tulemus,Nimi,$P30,Test,S$6,Jnr,\"<=3\")","v":56.666666666666664},{"$f":"AVERAGEIFS(Tulemus,Nimi,$P30,Test,T$6,Jnr,\"<=3\")","v":49.666666666666664},{"$f":"INDEX(Rühm,MATCH(P30,[0]!Nimi,0))","v":"R1"},null,null,"Lauri Vahtra",98,93,99,97,99,null,"Maarja Pihlak",{"$f":"_xlfn.MAXIFS(Tulemus,Nimi,$AE30,Test,AF$6)","v":99},{"$f":"_xlfn.MAXIFS(Tulemus,Nimi,$AE30,Test,AG$6)","v":97},{"$f":"_xlfn.MAXIFS(Tulemus,Nimi,$AE30,Test,AH$6)","v":87},{"$f":"_xlfn.MAXIFS(Tulemus,Nimi,$AE30,Test,AI$6)","v":91}]
["Test02","Alari Suur","2019-11-14T12:26:57.555",41,{"$f":"COUNTIFS(Test,A31,Nimi,B31,Aeg,\">=\"&C31)","v":5},null,null,null,"Maarja Pihlak",92,69,79.666666666666671,62.666666666666664,75.833333333333329,null,"Anna Koel",{"$f":"AVERAGEIFS(Tulemus,Nimi,$P31,Test,Q$6,Jnr,\"<=3\")","v":51.333333333333336},{"$f":"AVERAGEIFS(Tulemus,Nimi,$P31,Test,R$6,Jnr,\"<=3\")","v":50},{"$f":"AVERAGEIFS(Tulemus,Nimi,$P31,Test,S$6,Jnr,\"<=3\")","v":48.333333333333336},{"$f":"AVERAGEIFS(Tulemus,Nimi,$P31,Test,T$6,Jnr,\"<=3\")","v":59.666666666666664},{"$f":"INDEX(Rühm,MATCH(P31,[0]!Nimi,0))","v":"R1"},null,null,"Maarja Pihlak",99,97,87,91,99,null,"Markus Niidas",{"$f":"_xlfn.MAXIFS(Tulemus,Nimi,$AE31,Test,AF$6)","v":51},{"$f":"_xlfn.MAXIFS(Tulemus,Nimi,$AE31,Test,AG$6)","v":89},{"$f":"_xlfn.MAXIFS(Tulemus,Nimi,$AE31,Test,AH$6)","v":79},{"$f":"_xlfn.MAXIFS(Tulemus,Nimi,$AE31,Test,AI$6)","v":92}]
["Test01","Anette Lepp","2019-11-10T23:07:57.484",43,{"$f":"COUNTIFS(Test,A32,Nimi,B32,Aeg,\">=\"&C32)","v":5},null,null,null,"Markus Niidas",39.666666666666664,77.666666666666671,57,67.666666666666671,60.5,null,"Mihkel Kulp",{"$f":"AVERAGEIFS(Tulemus,Nimi,$P32,Test,Q$6,Jnr,\"<=3\")","v":48.333333333333336},{"$f":"AVERAGEIFS(Tulemus,Nimi,$P32,Test,R$6,Jnr,\"<=3\")","v":75.666666666666671},{"$f":"AVERAGEIFS(Tulemus,Nimi,$P32,Test,S$6,Jnr,\"<=3\")","v":87},{"$f":"AVERAGEIFS(Tulemus,Nimi,$P32,Test,T$6,Jnr,\"<=3\")","v":83},{"$f":"INDEX(Rühm,MATCH(P32,[0]!Nimi,0))","v":"R1"},null,null,"Markus Niidas",51,89,79,92,92,null,"Martin Aavik",{"$f":"_xlfn.MAXIFS(Tulemus,Nimi,$AE32,Test,AF$6)","v":91},{"$f":"_xlfn.MAXIFS(Tulemus,Nimi,$AE32,Test,AG$6)","v":89},{"$f":"_xlfn.MAXIFS(Tulemus,Nimi,$AE32,Test,AH$6)","v":98},{"$f":"_xlfn.MAXIFS(Tulemus,Nimi,$AE32,Test,AI$6)","v":99}]
["Test01","Carmen Sõrmus","2019-11-17T08:44:30.313",32,{"$f":"COUNTIFS(Test,A33,Nimi,B33,Aeg,\">=\"&C33)","v":3},null,null,null,"Martin Aavik",41.333333333333336,46.666666666666664,59.333333333333336,76.666666666666671,56,null,"Kaspar Raude",{"$f":"AVERAGEIFS(Tulemus,Nimi,$P33,Test,Q$6,Jnr,\"<=3\")","v":47},{"$f":"AVERAGEIFS(Tulemus,Nimi,$P33,Test,R$6,Jnr,\"<=3\")","v":79.333333333333329},{"$f":"AVERAGEIFS(Tulemus,Nimi,$P33,Test,S$6,Jnr,\"<=3\")","v":70},{"$f":"AVERAGEIFS(Tulemus,Nimi,$P33,Test,T$6,Jnr,\"<=3\")","v":63},{"$f":"INDEX(Rühm,MATCH(P33,[0]!Nimi,0))","v":"R1"},null,null,"Martin Aavik",91,89,98,99,99,null,"Mihkel Kulp",{"$f":"_xlfn.MAXIFS(Tulemus,Nimi,$AE33,Test,AF$6)","v":88},{"$f":"_xlfn.MAXIFS(Tulemus,Nimi,$AE33,Test,AG$6)","v":92},{"$f":"_xlfn.MAXIFS(Tulemus,Nimi,$AE33,Test,AH$6)","v":94},{"$f":"_xlfn.MAXIFS(Tulemus,Nimi,$AE33,Test,AI$6)","v":95}]
["Test04","Rasmus Kroon","2019-11-06T09:20:30.688",95,{"$f":"COUNTIFS(Test,A34,Nimi,B34,Aeg,\">=\"&C34)","v":3},null,null,null,"Mihkel Kulp",48.333333333333336,75.666666666666671,87,83,73.5,null,"Viktoria Lumi",{"$f":"AVERAGEIFS(Tulemus,Nimi,$P34,Test,Q$6,Jnr,\"<=3\")","v":46.666666666666664},{"$f":"AVERAGEIFS(Tulemus,Nimi,$P34,Test,R$6,Jnr,\"<=3\")","v":63.333333333333336},{"$f":"AVERAGEIFS(Tulemus,Nimi,$P34,Test,S$6,Jnr,\"<=3\")","v":80},{"$f":"AVERAGEIFS(Tulemus,Nimi,$P34,Test,T$6,Jnr,\"<=3\")","v":62.333333333333336},{"$f":"INDEX(Rühm,MATCH(P34,[0]!Nimi,0))","v":"R3"},null,null,"Mihkel Kulp",88,92,94,95,95,null,"Paul Hein",{"$f":"_xlfn.MAXIFS(Tulemus,Nimi,$AE34,Test,AF$6)","v":97},{"$f":"_xlfn.MAXIFS(Tulemus,Nimi,$AE34,Test,AG$6)","v":88},{"$f":"_xlfn.MAXIFS(Tulemus,Nimi,$AE34,Test,AH$6)","v":97},{"$f":"_xlfn.MAXIFS(Tulemus,Nimi,$AE34,Test,AI$6)","v":83}]
["Test01","Viktoria Lumi","2019-11-18T17:25:51.432",93,{"$f":"COUNTIFS(Test,A35,Nimi,B35,Aeg,\">=\"&C35)","v":3},null,null,null,"Paul Hein",52.333333333333336,65,56.666666666666664,49.666666666666664,55.916666666666664,null,"Katrin Laurits",{"$f":"AVERAGEIFS(Tulemus,Nimi,$P35,Test,Q$6,Jnr,\"<=3\")","v":46.333333333333336},{"$f":"AVERAGEIFS(Tulemus,Nimi,$P35,Test,R$6,Jnr,\"<=3\")","v":39},{"$f":"AVERAGEIFS(Tulemus,Nimi,$P35,Test,S$6,Jnr,\"<=3\")","v":78},{"$f":"AVERAGEIFS(Tulemus,Nimi,$P35,Test,T$6,Jnr,\"<=3\")","v":64},{"$f":"INDEX(Rühm,MATCH(P35,[0]!Nimi,0))","v":"R2"},null,null,"Paul Hein",97,88,97,83,97,null,"Rasmus Kroon",{"$f":"_xlfn.MAXIFS(Tulemus,Nimi,$AE35,Test,AF$6)","v":83},{"$f":"_xlfn.MAXIFS(Tulemus,Nimi,$AE35,Test,AG$6)","v":95},{"$f":"_xlfn.MAXIFS(Tulemus,Nimi,$AE35,Test,AH$6)","v":73},{"$f":"_xlfn.MAXIFS(Tulemus,Nimi,$AE35,Test,AI$6)","v":95}]
["Test03","Markus Niidas","2019-11-03T13:01:48.405",66,{"$f":"COUNTIFS(Test,A36,Nimi,B36,Aeg,\">=\"&C36)","v":4},null,null,null,"Rasmus Kroon",66,61.333333333333336,35.333333333333336,84,61.666666666666664,null,"Kristina Merila",{"$f":"AVERAGEIFS(Tulemus,Nimi,$P36,Test,Q$6,Jnr,\"<=3\")","v":45},{"$f":"AVERAGEIFS(Tulemus,Nimi,$P36,Test,R$6,Jnr,\"<=3\")","v":57.333333333333336},{"$f":"AVERAGEIFS(Tulemus,Nimi,$P36,Test,S$6,Jnr,\"<=3\")","v":72.333333333333329},{"$f":"AVERAGEIFS(Tulemus,Nimi,$P36,Test,T$6,Jnr,\"<=3\")","v":39},{"$f":"INDEX(Rühm,MATCH(P36,[0]!Nimi,0))","v":"R3"},null,null,"Rasmus Kroon",83,95,73,95,95,null,"Reimo Kala",{"$f":"_xlfn.MAXIFS(Tulemus,Nimi,$AE36,Test,AF$6)","v":95},{"$f":"_xlfn.MAXIFS(Tulemus,Nimi,$AE36,Test,AG$6)","v":90},{"$f":"_xlfn.MAXIFS(Tulemus,Nimi,$AE36,Test,AH$6)","v":98},{"$f":"_xlfn.MAXIFS(Tulemus,Nimi,$AE36,Test,AI$6)","v":92}]
["Test01","Urmas Lõhmus","2019-11-23T17:32:21.250",69,{"$f":"COUNTIFS(Test,A37,Nimi,B37,Aeg,\">=\"&C37)","v":1},null,null,null,"Reimo Kala",75,79.666666666666671,51.666666666666664,76.333333333333329,70.666666666666671,null,"Egert Vint",{"$f":"AVERAGEIFS(Tulemus,Nimi,$P37,Test,Q$6,Jnr,\"<=3\")","v":44},{"$f":"AVERAGEIFS(Tulemus,Nimi,$P37,Test,R$6,Jnr,\"<=3\")","v":41.666666666666664},{"$f":"AVERAGEIFS(Tulemus,Nimi,$P37,Test,S$6,Jnr,\"<=3\")","v":64},{"$f":"AVERAGEIFS(Tulemus,Nimi,$P37,Test,T$6,Jnr,\"<=3\")","v":38.333333333333336},{"$f":"INDEX(Rühm,MATCH(P37,[0]!Nimi,0))","v":"R3"},null,null,"Reimo Kala",95,90,98,92,98,null,"Robert Lentso",{"$f":"_xlfn.MAXIFS(Tulemus,Nimi,$AE37,Test,AF$6)","v":76},{"$f":"_xlfn.MAXIFS(Tulemus,Nimi,$AE37,Test,AG$6)","v":99},{"$f":"_xlfn.MAXIFS(Tulemus,Nimi,$AE37,Test,AH$6)","v":85},{"$f":"_xlfn.MAXIFS(Tulemus,Nimi,$AE37,Test,AI$6)","v":97}]
["Test02","Lauri Vahtra","2019-11-08T19:49:14.237",47,{"$f":"COUNTIFS(Test,A38,Nimi,B38,Aeg,\">=\"&C38)","v":9},null,null,null,"Robert Lentso",35.666666666666664,63.333333333333336,49,69,54.25,null,"Martin Aavik",{"$f":"AVERAGEIFS(Tulemus,Nimi,$P38,Test,Q$6,Jnr,\"<=3\")","v":41.333333333333336},{"$f":"AVERAGEIFS(Tulemus,Nimi,$P38,Test,R$6,Jnr,\"<=3\")","v":46.666666666666664},{"$f":"AVERAGEIFS(Tulemus,Nimi,$P38,Test,S$6,Jnr,\"<=3\")","v":59.333333333333336},{"$f":"AVERAGEIFS(Tulemus,Nimi,$P38,Test,T$6,Jnr,\"<=3\")","v":76.666666666666671},{"$f":"INDEX(Rühm,MATCH(P38,[0]!Nimi,0))","v":"R1"},null,null,"Robert Lentso",76,99,85,97,99,null,"Sander Kell",{"$f":"_xlfn.MAXIFS(Tulemus,Nimi,$AE38,Test,AF$6)","v":94},{"$f":"_xlfn.MAXIFS(Tulemus,Nimi,$AE38,Test,AG$6)","v":86},{"$f":"_xlfn.MAXIFS(Tulemus,Nimi,$AE38,Test,AH$6)","v":93},{"$f":"_xlfn.MAXIFS(Tulemus,Nimi,$AE38,Test,AI$6)","v":93}]
["Test04","Kristina Merila","2019-11-27T19:38:03.161",27,{"$f":"COUNTIFS(Test,A39,Nimi,B39,Aeg,\">=\"&C39)","v":3},null,null,null,"Sander Kell",59.333333333333336,43.666666666666664,69.333333333333329,42.333333333333336,53.666666666666664,null,"Markus Niidas",{"$f":"AVERAGEIFS(Tulemus,Nimi,$P39,Test,Q$6,Jnr,\"<=3\")","v":39.666666666666664},{"$f":"AVERAGEIFS(Tulemus,Nimi,$P39,Test,R$6,Jnr,\"<=3\")","v":77.666666666666671},{"$f":"AVERAGEIFS(Tulemus,Nimi,$P39,Test,S$6,Jnr,\"<=3\")","v":57},{"$f":"AVERAGEIFS(Tulemus,Nimi,$P39,Test,T$6,Jnr,\"<=3\")","v":67.666666666666671},{"$f":"INDEX(Rühm,MATCH(P39,[0]!Nimi,0))","v":"R1"},null,null,"Sander Kell",94,86,93,93,94,null,"Tarvo Järv",{"$f":"_xlfn.MAXIFS(Tulemus,Nimi,$AE39,Test,AF$6)","v":87},{"$f":"_xlfn.MAXIFS(Tulemus,Nimi,$AE39,Test,AG$6)","v":97},{"$f":"_xlfn.MAXIFS(Tulemus,Nimi,$AE39,Test,AH$6)","v":97},{"$f":"_xlfn.MAXIFS(Tulemus,Nimi,$AE39,Test,AI$6)","v":99}]
["Test03","Robert Lentso","2019-11-16T21:01:02.483",85,{"$f":"COUNTIFS(Test,A40,Nimi,B40,Aeg,\">=\"&C40)","v":9},null,null,null,"Tarvo Järv",61.666666666666664,49.333333333333336,53.333333333333336,91,63.833333333333336,null,"Robert Lentso",{"$f":"AVERAGEIFS(Tulemus,Nimi,$P40,Test,Q$6,Jnr,\"<=3\")","v":35.666666666666664},{"$f":"AVERAGEIFS(Tulemus,Nimi,$P40,Test,R$6,Jnr,\"<=3\")","v":63.333333333333336},{"$f":"AVERAGEIFS(Tulemus,Nimi,$P40,Test,S$6,Jnr,\"<=3\")","v":49},{"$f":"AVERAGEIFS(Tulemus,Nimi,$P40,Test,T$6,Jnr,\"<=3\")","v":69},{"$f":"INDEX(Rühm,MATCH(P40,[0]!Nimi,0))","v":"R1"},null,null,"Tarvo Järv",87,97,97,99,99,null,"Urmas Lõhmus",{"$f":"_xlfn.MAXIFS(Tulemus,Nimi,$AE40,Test,AF$6)","v":73},{"$f":"_xlfn.MAXIFS(Tulemus,Nimi,$AE40,Test,AG$6)","v":89},{"$f":"_xlfn.MAXIFS(Tulemus,Nimi,$AE40,Test,AH$6)","v":99},{"$f":"_xlfn.MAXIFS(Tulemus,Nimi,$AE40,Test,AI$6)","v":96}]
["Test01","Anette Lepp","2019-11-10T12:18:50.568",66,{"$f":"COUNTIFS(Test,A41,Nimi,B41,Aeg,\">=\"&C41)","v":6},null,null,null,"Urmas Lõhmus",60.666666666666664,45,57.333333333333336,77,60,null,"Carmen Sõrmus",{"$f":"AVERAGEIFS(Tulemus,Nimi,$P41,Test,Q$6,Jnr,\"<=3\")","v":31.333333333333332},{"$f":"AVERAGEIFS(Tulemus,Nimi,$P41,Test,R$6,Jnr,\"<=3\")","v":57.333333333333336},{"$f":"AVERAGEIFS(Tulemus,Nimi,$P41,Test,S$6,Jnr,\"<=3\")","v":45.666666666666664},{"$f":"AVERAGEIFS(Tulemus,Nimi,$P41,Test,T$6,Jnr,\"<=3\")","v":73.333333333333329},{"$f":"INDEX(Rühm,MATCH(P41,[0]!Nimi,0))","v":"R2"},null,null,"Urmas Lõhmus",73,89,99,96,99,null,"Viktoria Lumi",{"$f":"_xlfn.MAXIFS(Tulemus,Nimi,$AE41,Test,AF$6)","v":93},{"$f":"_xlfn.MAXIFS(Tulemus,Nimi,$AE41,Test,AG$6)","v":98},{"$f":"_xlfn.MAXIFS(Tulemus,Nimi,$AE41,Test,AH$6)","v":100},{"$f":"_xlfn.MAXIFS(Tulemus,Nimi,$AE41,Test,AI$6)","v":98}]
["Test04","Kertu Heinsoo","2019-11-01T17:20:52.084",25,{"$f":"COUNTIFS(Test,A42,Nimi,B42,Aeg,\">=\"&C42)","v":9},null,null,null,"Viktoria Lumi",46.666666666666664,63.333333333333336,80,62.333333333333336,63.083333333333336,null,null,null,null,null,null,null,null,null,"Viktoria Lumi",93,98,100,98,100]
["Test02","Markus Niidas","2019-11-07T13:03:59.704",26,{"$f":"COUNTIFS(Test,A43,Nimi,B43,Aeg,\">=\"&C43)","v":7},null,null,null,"Grand Total",61.228571428571428,60.828571428571429,61.38095238095238,62.04854368932039,61.368421052631582,null,null,null,null,null,null,null,null,null,"Grand Total",100,100,100,100,100]
["Test01","Kaspar Raude","2019-11-10T09:32:52.618",70,{"$f":"COUNTIFS(Test,A44,Nimi,B44,Aeg,\">=\"&C44)","v":5}]
["Test04","Hanna Laid","2019-11-19T15:29:08.312",52,{"$f":"COUNTIFS(Test,A45,Nimi,B45,Aeg,\">=\"&C45)","v":4}]
["Test04","Viktoria Lumi","2019-11-26T17:49:25.919",98,{"$f":"COUNTIFS(Test,A46,Nimi,B46,Aeg,\">=\"&C46)","v":2},null,null,null,"3. Leida igast rühmast esimeses testis kolme viimase katse keskmisena parima tulemuse saanud tudeng."]
["Test02","Tarvo Järv","2019-11-15T17:04:37.910",45,{"$f":"COUNTIFS(Test,A47,Nimi,B47,Aeg,\">=\"&C47)","v":8}]
["Test02","Tarvo Järv","2019-11-25T16:48:34.680",48,{"$f":"COUNTIFS(Test,A48,Nimi,B48,Aeg,\">=\"&C48)","v":4},null,null,null,"Rühm","Parim keskmine","Tudeng (index+match)"]
["Test04","Kaspar Raude","2019-11-03T14:36:34.996",65,{"$f":"COUNTIFS(Test,A49,Nimi,B49,Aeg,\">=\"&C49)","v":8},null,null,null,"R1",{"$f":"_xlfn.MAXIFS(Test01,Rühm_2,I49)","v":83}]
["Test01","Armin Kaasik","2019-11-06T12:10:20.256",95,{"$f":"COUNTIFS(Test,A50,Nimi,B50,Aeg,\">=\"&C50)","v":5},null,null,null,"R2",{"$f":"_xlfn.MAXIFS(Test01,Rühm_2,I50)","v":85.666666666666671}]
["Test04","Hans Kukk","2019-11-26T21:49:28.605",73,{"$f":"COUNTIFS(Test,A51,Nimi,B51,Aeg,\">=\"&C51)","v":4},null,null,null,"R3",{"$f":"_xlfn.MAXIFS(Test01,Rühm_2,I51)","v":92}]
["Test01","Sander Kell","2019-11-04T22:27:01.154",30,{"$f":"COUNTIFS(Test,A52,Nimi,B52,Aeg,\">=\"&C52)","v":10}]
["Test02","Tarvo Järv","2019-11-08T19:47:42.241",64,{"$f":"COUNTIFS(Test,A53,Nimi,B53,Aeg,\">=\"&C53)","v":10}]
["Test03","Katrin Laurits","2019-11-15T13:04:57.541",41,{"$f":"COUNTIFS(Test,A54,Nimi,B54,Aeg,\">=\"&C54)","v":5}]
["Test01","Diana Taal","2019-11-01T12:10:37.538",86,{"$f":"COUNTIFS(Test,A55,Nimi,B55,Aeg,\">=\"&C55)","v":8}]
["Test04","Brita Kaljula","2019-11-08T08:30:49.316",30,{"$f":"COUNTIFS(Test,A56,Nimi,B56,Aeg,\">=\"&C56)","v":8}]
["Test02","Emili Loorits","2019-11-19T19:00:03.572",92,{"$f":"COUNTIFS(Test,A57,Nimi,B57,Aeg,\">=\"&C57)","v":4}]
["Test04","Viktoria Lumi","2019-11-04T17:02:17.438",79,{"$f":"COUNTIFS(Test,A58,Nimi,B58,Aeg,\">=\"&C58)","v":7}]
["Test01","Alari Suur","2019-11-20T19:46:51.184",43,{"$f":"COUNTIFS(Test,A59,Nimi,B59,Aeg,\">=\"&C59)","v":4}]
["Test04","Jaagup Kivi","2019-11-14T11:07:38.995",72,{"$f":"COUNTIFS(Test,A60,Nimi,B60,Aeg,\">=\"&C60)","v":7}]
["Test03","Robert Lentso","2019-11-29T23:36:45.387",24,{"$f":"COUNTIFS(Test,A61,Nimi,B61,Aeg,\">=\"&C61)","v":3}]
["Test01","Jaagup Kivi","2019-11-14T13:05:29.465",29,{"$f":"COUNTIFS(Test,A62,Nimi,B62,Aeg,\">=\"&C62)","v":4}]
["Test02","Anette Lepp","2019-11-02T23:02:55.140",70,{"$f":"COUNTIFS(Test,A63,Nimi,B63,Aeg,\">=\"&C63)","v":6}]
["Test01","Tarvo Järv","2019-11-06T15:43:19.934",87,{"$f":"COUNTIFS(Test,A64,Nimi,B64,Aeg,\">=\"&C64)","v":4}]
["Test04","Getlin Allas","2019-11-11T10:28:27.646",28,{"$f":"COUNTIFS(Test,A65,Nimi,B65,Aeg,\">=\"&C65)","v":3}]
["Test03","Anette Lepp","2019-11-28T18:36:14.503",97,{"$f":"COUNTIFS(Test,A66,Nimi,B66,Aeg,\">=\"&C66)","v":3}]
["Test02","Rasmus Kroon","2019-11-11T11:13:28.317",45,{"$f":"COUNTIFS(Test,A67,Nimi,B67,Aeg,\">=\"&C67)","v":6}]
["Test03","Maarja Pihlak","2019-11-22T17:55:23.982",87,{"$f":"COUNTIFS(Test,A68,Nimi,B68,Aeg,\">=\"&C68)","v":3}]
["Test01","Kristina Merila","2019-11-14T14:52:28.851",72,{"$f":"COUNTIFS(Test,A69,Nimi,B69,Aeg,\">=\"&C69)","v":1}]
["Test04","Lauri Vahtra","2019-11-24T23:10:52.883",33,{"$f":"COUNTIFS(Test,A70,Nimi,B70,Aeg,\">=\"&C70)","v":2}]
["Test04","Brita Kaljula","2019-11-25T10:04:14.109",60,{"$f":"COUNTIFS(Test,A71,Nimi,B71,Aeg,\">=\"&C71)","v":2}]
["Test04","Robert Lentso","2019-11-10T15:07:43.267",52,{"$f":"COUNTIFS(Test,A72,Nimi,B72,Aeg,\">=\"&C72)","v":6}]
["Test02","Joonas Haljas","2019-11-24T11:24:39.626",55,{"$f":"COUNTIFS(Test,A73,Nimi,B73,Aeg,\">=\"&C73)","v":4}]
["Test04","Mihkel Kulp","2019-11-26T15:44:50.085",88,{"$f":"COUNTIFS(Test,A74,Nimi,B74,Aeg,\">=\"&C74)","v":1}]
["Test03","Viktoria Lumi","2019-11-22T21:30:12.893",98,{"$f":"COUNTIFS(Test,A75,Nimi,B75,Aeg,\">=\"&C75)","v":4}]
["Test03","Tarvo Järv","2019-11-16T15:42:06.281",24,{"$f":"COUNTIFS(Test,A76,Nimi,B76,Aeg,\">=\"&C76)","v":4}]
["Test04","Anette Lepp","2019-11-08T12:53:06.590",74,{"$f":"COUNTIFS(Test,A77,Nimi,B77,Aeg,\">=\"&C77)","v":9}]
["Test01","Rasmus Kroon","2019-11-01T23:48:33.011",83,{"$f":"COUNTIFS(Test,A78,Nimi,B78,Aeg,\">=\"&C78)","v":11}]
["Test01","Artur Piiri","2019-11-18T10:58:29.104",98,{"$f":"COUNTIFS(Test,A79,Nimi,B79,Aeg,\">=\"&C79)","v":2}]
["Test02","Erik Pärn","2019-11-01T21:18:20.191",71,{"$f":"COUNTIFS(Test,A80,Nimi,B80,Aeg,\">=\"&C80)","v":15}]
["Test01","Armin Kaasik","2019-11-22T22:30:37.591",84,{"$f":"COUNTIFS(Test,A81,Nimi,B81,Aeg,\">=\"&C81)","v":3}]
["Test01","Jana Kiisk","2019-11-29T11:20:48.827",53,{"$f":"COUNTIFS(Test,A82,Nimi,B82,Aeg,\">=\"&C82)","v":2}]
["Test02","Markus Niidas","2019-11-29T16:10:32.418",87,{"$f":"COUNTIFS(Test,A83,Nimi,B83,Aeg,\">=\"&C83)","v":1}]
["Test03","Diana Taal","2019-11-24T14:27:31.071",95,{"$f":"COUNTIFS(Test,A84,Nimi,B84,Aeg,\">=\"&C84)","v":3}]
["Test04","Hanna Laid","2019-11-15T17:54:59.868",34,{"$f":"COUNTIFS(Test,A85,Nimi,B85,Aeg,\">=\"&C85)","v":8}]
["Test04","Paul Hein","2019-11-20T15:38:03.244",44,{"$f":"COUNTIFS(Test,A86,Nimi,B86,Aeg,\">=\"&C86)","v":1}]
["Test03","Jaagup Kivi","2019-11-16T16:21:24.109",27,{"$f":"COUNTIFS(Test,A87,Nimi,B87,Aeg,\">=\"&C87)","v":6}]
["Test02","Viktoria Lumi","2019-11-23T11:45:25.515",89,{"$f":"COUNTIFS(Test,A88,Nimi,B88,Aeg,\">=\"&C88)","v":2}]
["Test02","Anna Koel","2019-11-05T13:18:36.109",25,{"$f":"COUNTIFS(Test,A89,Nimi,B89,Aeg,\">=\"&C89)","v":5}]
["Test04","Hans Kukk","2019-11-26T18:55:40.466",66,{"$f":"COUNTIFS(Test,A90,Nimi,B90,Aeg,\">=\"&C90)","v":5}]
["Test03","Reimo Kala","2019-11-19T14:51:21.555",26,{"$f":"COUNTIFS(Test,A91,Nimi,B91,Aeg,\">=\"&C91)","v":2}]
["Test04","Alari Suur","2019-11-23T08:33:36.310",65,{"$f":"COUNTIFS(Test,A92,Nimi,B92,Aeg,\">=\"&C92)","v":3}]
["Test02","Brita Kaljula","2019-11-11T12:18:53.300",24,{"$f":"COUNTIFS(Test,A93,Nimi,B93,Aeg,\">=\"&C93)","v":5}]
["Test02","Egert Vint","2019-11-06T17:07:34.860",37,{"$f":"COUNTIFS(Test,A94,Nimi,B94,Aeg,\">=\"&C94)","v":6}]
["Test02","Mihkel Kulp","2019-11-25T22:48:53.848",43,{"$f":"COUNTIFS(Test,A95,Nimi,B95,Aeg,\">=\"&C95)","v":5}]
["Test02","Diana Taal","2019-11-25T18:09:02.690",93,{"$f":"COUNTIFS(Test,A96,Nimi,B96,Aeg,\">=\"&C96)","v":2}]
["Test02","Getlin Allas","2019-11-28T10:20:51.957",59,{"$f":"COUNTIFS(Test,A97,Nimi,B97,Aeg,\">=\"&C97)","v":1}]
["Test01","Tarvo Järv","2019-11-11T12:35:57.181",66,{"$f":"COUNTIFS(Test,A98,Nimi,B98,Aeg,\">=\"&C98)","v":2}]
["Test01","Carmen Sõrmus","2019-11-09T23:11:27.574",55,{"$f":"COUNTIFS(Test,A99,Nimi,B99,Aeg,\">=\"&C99)","v":6}]
["Test01","Kaspar Raude","2019-11-08T17:08:49.728",61,{"$f":"COUNTIFS(Test,A100,Nimi,B100,Aeg,\">=\"&C100)","v":6}]
["Test04","Kaspar Raude","2019-11-05T23:39:20.081",31,{"$f":"COUNTIFS(Test,A101,Nimi,B101,Aeg,\">=\"&C101)","v":6}]
["Test03","Martin Aavik","2019-11-02T18:30:33.260",23,{"$f":"COUNTIFS(Test,A102,Nimi,B102,Aeg,\">=\"&C102)","v":15}]
["Test02","Mihkel Kulp","2019-11-28T21:32:53.818",92,{"$f":"COUNTIFS(Test,A103,Nimi,B103,Aeg,\">=\"&C103)","v":2}]
["Test03","Tarvo Järv","2019-11-07T09:18:25.008",97,{"$f":"COUNTIFS(Test,A104,Nimi,B104,Aeg,\">=\"&C104)","v":9}]
["Test02","Armin Kaasik","2019-11-14T20:43:09.474",23,{"$f":"COUNTIFS(Test,A105,Nimi,B105,Aeg,\">=\"&C105)","v":6}]
["Test03","Urmas Lõhmus","2019-11-12T09:38:19.905",24,{"$f":"COUNTIFS(Test,A106,Nimi,B106,Aeg,\">=\"&C106)","v":6}]
["Test04","Jaagup Kivi","2019-11-30T22:52:37.393",82,{"$f":"COUNTIFS(Test,A107,Nimi,B107,Aeg,\">=\"&C107)","v":2}]
["Test01","Armin Kaasik","2019-11-27T21:55:55.696",87,{"$f":"COUNTIFS(Test,A108,Nimi,B108,Aeg,\">=\"&C108)","v":1}]
["Test03","Brita Kaljula","2019-11-22T10:11:56.271",92,{"$f":"COUNTIFS(Test,A109,Nimi,B109,Aeg,\">=\"&C109)","v":4}]
["Test03","Hans Kukk","2019-11-16T11:50:16.527",71,{"$f":"COUNTIFS(Test,A110,Nimi,B110,Aeg,\">=\"&C110)","v":8}]
["Test03","Jana Kiisk","2019-11-04T12:24:03.817",39,{"$f":"COUNTIFS(Test,A111,Nimi,B111,Aeg,\">=\"&C111)","v":7}]
["Test04","Martin Aavik","2019-11-20T10:51:47.910",99,{"$f":"COUNTIFS(Test,A112,Nimi,B112,Aeg,\">=\"&C112)","v":3}]
["Test02","Katrin Laurits","2019-11-15T08:40:33.908",84,{"$f":"COUNTIFS(Test,A113,Nimi,B113,Aeg,\">=\"&C113)","v":5}]
["Test02","Maarja Pihlak","2019-11-21T18:37:39.613",55,{"$f":"COUNTIFS(Test,A114,Nimi,B114,Aeg,\">=\"&C114)","v":3}]
["Test04","Paul Hein","2019-11-17T12:43:23.509",83,{"$f":"COUNTIFS(Test,A115,Nimi,B115,Aeg,\">=\"&C115)","v":2}]
["Test02","Maarja Pihlak","2019-11-22T20:37:05.053",84,{"$f":"COUNTIFS(Test,A116,Nimi,B116,Aeg,\">=\"&C116)","v":2}]
["Test04","Viktoria Lumi","2019-11-24T21:35:52.299",52,{"$f":"COUNTIFS(Test,A117,Nimi,B117,Aeg,\">=\"&C117)","v":4}]
["Test04","Alari Suur","2019-11-03T17:13:56.298",66,{"$f":"COUNTIFS(Test,A118,Nimi,B118,Aeg,\">=\"&C118)","v":9}]
["Test02","Katrin Laurits","2019-11-07T23:11:38.610",62,{"$f":"COUNTIFS(Test,A119,Nimi,B119,Aeg,\">=\"&C119)","v":6}]
["Test02","Paul Hein","2019-11-23T22:54:27.058",49,{"$f":"COUNTIFS(Test,A120,Nimi,B120,Aeg,\">=\"&C120)","v":3}]
["Test02","Kristina Merila","2019-11-15T21:39:52.344",52,{"$f":"COUNTIFS(Test,A121,Nimi,B121,Aeg,\">=\"&C121)","v":6}]
["Test03","Getlin Allas","2019-11-01T21:21:23.168",79,{"$f":"COUNTIFS(Test,A122,Nimi,B122,Aeg,\">=\"&C122)","v":9}]
["Test04","Carmen Sõrmus","2019-11-04T12:56:59.157",86,{"$f":"COUNTIFS(Test,A123,Nimi,B123,Aeg,\">=\"&C123)","v":3}]
["Test04","Kertu Heinsoo","2019-11-25T12:41:03.433",25,{"$f":"COUNTIFS(Test,A124,Nimi,B124,Aeg,\">=\"&C124)","v":2}]
["Test04","Karin Saar","2019-11-04T10:04:34.492",32,{"$f":"COUNTIFS(Test,A125,Nimi,B125,Aeg,\">=\"&C125)","v":9}]
["Test03","Kristina Merila","2019-11-01T16:42:02.460",34,{"$f":"COUNTIFS(Test,A126,Nimi,B126,Aeg,\">=\"&C126)","v":9}]
["Test02","Emili Loorits","2019-11-11T17:46:54.434",84,{"$f":"COUNTIFS(Test,A127,Nimi,B127,Aeg,\">=\"&C127)","v":8}]
["Test04","Tarvo Järv","2019-11-04T11:43:29.423",85,{"$f":"COUNTIFS(Test,A128,Nimi,B128,Aeg,\">=\"&C128)","v":8}]
["Test04","Urmas Lõhmus","2019-11-25T23:16:05.398",85,{"$f":"COUNTIFS(Test,A129,Nimi,B129,Aeg,\">=\"&C129)","v":1}]
["Test04","Joonas Haljas","2019-11-01T13:09:36.835",28,{"$f":"COUNTIFS(Test,A130,Nimi,B130,Aeg,\">=\"&C130)","v":7}]
["Test04","Alari Suur","2019-11-18T18:09:08.869",20,{"$f":"COUNTIFS(Test,A131,Nimi,B131,Aeg,\">=\"&C131)","v":7}]
["Test03","Getlin Allas","2019-11-07T10:16:15.309",35,{"$f":"COUNTIFS(Test,A132,Nimi,B132,Aeg,\">=\"&C132)","v":6}]
["Test02","Anette Lepp","2019-11-17T15:22:08.392",52,{"$f":"COUNTIFS(Test,A133,Nimi,B133,Aeg,\">=\"&C133)","v":3}]
["Test02","Kristina Merila","2019-11-15T17:59:01.733",59,{"$f":"COUNTIFS(Test,A134,Nimi,B134,Aeg,\">=\"&C134)","v":7}]
["Test03","Getlin Allas","2019-11-14T08:50:00.581",37,{"$f":"COUNTIFS(Test,A135,Nimi,B135,Aeg,\">=\"&C135)","v":5}]
["Test01","Sander Kell","2019-11-28T13:40:17.971",52,{"$f":"COUNTIFS(Test,A136,Nimi,B136,Aeg,\">=\"&C136)","v":2}]
["Test02","Viktoria Lumi","2019-11-20T08:21:57.267",73,{"$f":"COUNTIFS(Test,A137,Nimi,B137,Aeg,\">=\"&C137)","v":3}]
["Test04","Alari Suur","2019-11-19T23:03:32.204",35,{"$f":"COUNTIFS(Test,A138,Nimi,B138,Aeg,\">=\"&C138)","v":6}]
["Test02","Markus Niidas","2019-11-18T10:56:39.202",50,{"$f":"COUNTIFS(Test,A139,Nimi,B139,Aeg,\">=\"&C139)","v":5}]
["Test04","Diana Taal","2019-11-09T14:33:14.092",85,{"$f":"COUNTIFS(Test,A140,Nimi,B140,Aeg,\">=\"&C140)","v":7}]
["Test02","Maarja Pihlak","2019-11-10T16:22:13.249",31,{"$f":"COUNTIFS(Test,A141,Nimi,B141,Aeg,\">=\"&C141)","v":7}]
["Test04","Artur Piiri","2019-11-04T16:55:50.081",22,{"$f":"COUNTIFS(Test,A142,Nimi,B142,Aeg,\">=\"&C142)","v":7}]
["Test02","Robert Lentso","2019-11-29T19:52:59.877",85,{"$f":"COUNTIFS(Test,A143,Nimi,B143,Aeg,\">=\"&C143)","v":2}]
["Test03","Kertu Heinsoo","2019-11-07T22:05:38.694",72,{"$f":"COUNTIFS(Test,A144,Nimi,B144,Aeg,\">=\"&C144)","v":13}]
["Test02","Sander Kell","2019-11-27T19:24:57.675",23,{"$f":"COUNTIFS(Test,A145,Nimi,B145,Aeg,\">=\"&C145)","v":1}]
["Test03","Artur Piiri","2019-11-18T18:39:09.688",26,{"$f":"COUNTIFS(Test,A146,Nimi,B146,Aeg,\">=\"&C146)","v":5}]
["Test01","Reimo Kala","2019-11-13T12:39:48.620",91,{"$f":"COUNTIFS(Test,A147,Nimi,B147,Aeg,\">=\"&C147)","v":4}]
["Test02","Maarja Pihlak","2019-11-04T20:58:10.732",71,{"$f":"COUNTIFS(Test,A148,Nimi,B148,Aeg,\">=\"&C148)","v":9}]
["Test02","Jana Kiisk","2019-11-17T11:56:09.027",26,{"$f":"COUNTIFS(Test,A149,Nimi,B149,Aeg,\">=\"&C149)","v":6}]
["Test01","Martin Aavik","2019-11-12T16:40:37.776",33,{"$f":"COUNTIFS(Test,A150,Nimi,B150,Aeg,\">=\"&C150)","v":8}]
["Test03","Kertu Heinsoo","2019-11-26T16:39:22.651",60,{"$f":"COUNTIFS(Test,A151,Nimi,B151,Aeg,\">=\"&C151)","v":2}]
["Test01","Artur Piiri","2019-11-28T17:52:28.280",78,{"$f":"COUNTIFS(Test,A152,Nimi,B152,Aeg,\">=\"&C152)","v":1}]
["Test04","Brita Kaljula","2019-11-02T15:57:33.053",100,{"$f":"COUNTIFS(Test,A153,Nimi,B153,Aeg,\">=\"&C153)","v":10}]
["Test03","Tarvo Järv","2019-11-21T17:38:41.594",69,{"$f":"COUNTIFS(Test,A154,Nimi,B154,Aeg,\">=\"&C154)","v":1}]
["Test02","Erik Pärn","2019-11-24T22:47:55.696",55,{"$f":"COUNTIFS(Test,A155,Nimi,B155,Aeg,\">=\"&C155)","v":4}]
["Test02","Kristina Merila","2019-11-29T10:47:29.306",83,{"$f":"COUNTIFS(Test,A156,Nimi,B156,Aeg,\">=\"&C156)","v":1}]
["Test02","Tarvo Järv","2019-11-13T13:05:21.533",87,{"$f":"COUNTIFS(Test,A157,Nimi,B157,Aeg,\">=\"&C157)","v":9}]
["Test03","Kertu Heinsoo","2019-11-04T13:22:43.512",48,{"$f":"COUNTIFS(Test,A158,Nimi,B158,Aeg,\">=\"&C158)","v":14}]
["Test01","Kertu Heinsoo","2019-11-20T23:09:53.955",52,{"$f":"COUNTIFS(Test,A159,Nimi,B159,Aeg,\">=\"&C159)","v":5}]
["Test01","Hanna Laid","2019-11-19T12:40:09.048",92,{"$f":"COUNTIFS(Test,A160,Nimi,B160,Aeg,\">=\"&C160)","v":6}]
["Test02","Emili Loorits","2019-11-01T19:30:00.732",89,{"$f":"COUNTIFS(Test,A161,Nimi,B161,Aeg,\">=\"&C161)","v":11}]
["Test03","Alari Suur","2019-11-03T10:22:53.782",81,{"$f":"COUNTIFS(Test,A162,Nimi,B162,Aeg,\">=\"&C162)","v":8}]
["Test03","Carmen Sõrmus","2019-11-09T22:21:38.750",46,{"$f":"COUNTIFS(Test,A163,Nimi,B163,Aeg,\">=\"&C163)","v":6}]
["Test04","Urmas Lõhmus","2019-11-12T17:48:20.799",32,{"$f":"COUNTIFS(Test,A164,Nimi,B164,Aeg,\">=\"&C164)","v":5}]
["Test03","Katrin Laurits","2019-11-28T14:38:45.536",49,{"$f":"COUNTIFS(Test,A165,Nimi,B165,Aeg,\">=\"&C165)","v":1}]
["Test01","Tarvo Järv","2019-11-08T21:24:09.366",40,{"$f":"COUNTIFS(Test,A166,Nimi,B166,Aeg,\">=\"&C166)","v":3}]
["Test04","Lauri Vahtra","2019-11-18T11:42:19.225",90,{"$f":"COUNTIFS(Test,A167,Nimi,B167,Aeg,\">=\"&C167)","v":3}]
["Test04","Anna Koel","2019-11-27T19:23:51.203",66,{"$f":"COUNTIFS(Test,A168,Nimi,B168,Aeg,\">=\"&C168)","v":5}]
["Test04","Tarvo Järv","2019-11-02T13:21:11.477",60,{"$f":"COUNTIFS(Test,A169,Nimi,B169,Aeg,\">=\"&C169)","v":9}]
["Test02","Anna Koel","2019-11-28T09:54:05.430",32,{"$f":"COUNTIFS(Test,A170,Nimi,B170,Aeg,\">=\"&C170)","v":1}]
["Test03","Artur Piiri","2019-11-25T11:25:27.279",35,{"$f":"COUNTIFS(Test,A171,Nimi,B171,Aeg,\">=\"&C171)","v":1}]
["Test02","Egert Vint","2019-11-02T22:50:38.213",81,{"$f":"COUNTIFS(Test,A172,Nimi,B172,Aeg,\">=\"&C172)","v":8}]
["Test03","Kertu Heinsoo","2019-11-13T19:31:17.253",63,{"$f":"COUNTIFS(Test,A173,Nimi,B173,Aeg,\">=\"&C173)","v":8}]
["Test03","Lauri Vahtra","2019-11-06T09:33:37.903",25,{"$f":"COUNTIFS(Test,A174,Nimi,B174,Aeg,\">=\"&C174)","v":10}]
["Test02","Joonas Haljas","2019-11-08T10:33:20.504",25,{"$f":"COUNTIFS(Test,A175,Nimi,B175,Aeg,\">=\"&C175)","v":10}]
["Test03","Brita Kaljula","2019-11-16T08:19:11.680",57,{"$f":"COUNTIFS(Test,A176,Nimi,B176,Aeg,\">=\"&C176)","v":6}]
["Test02","Emili Loorits","2019-11-11T20:52:58.476",72,{"$f":"COUNTIFS(Test,A177,Nimi,B177,Aeg,\">=\"&C177)","v":7}]
["Test04","Armin Kaasik","2019-11-25T19:39:25.035",54,{"$f":"COUNTIFS(Test,A178,Nimi,B178,Aeg,\">=\"&C178)","v":3}]
["Test01","Emili Loorits","2019-11-17T19:27:05.584",62,{"$f":"COUNTIFS(Test,A179,Nimi,B179,Aeg,\">=\"&C179)","v":3}]
["Test03","Getlin Allas","2019-11-24T15:10:58.980",65,{"$f":"COUNTIFS(Test,A180,Nimi,B180,Aeg,\">=\"&C180)","v":1}]
["Test03","Joonas Haljas","2019-11-16T15:29:16.307",43,{"$f":"COUNTIFS(Test,A181,Nimi,B181,Aeg,\">=\"&C181)","v":6}]
["Test02","Mihkel Kulp","2019-11-01T13:03:03.548",37,{"$f":"COUNTIFS(Test,A182,Nimi,B182,Aeg,\">=\"&C182)","v":11}]
["Test02","Hanna Laid","2019-11-03T08:57:56.563",56,{"$f":"COUNTIFS(Test,A183,Nimi,B183,Aeg,\">=\"&C183)","v":3}]
["Test01","Viktoria Lumi","2019-11-06T10:19:12.386",86,{"$f":"COUNTIFS(Test,A184,Nimi,B184,Aeg,\">=\"&C184)","v":7}]
["Test04","Hanna Laid","2019-11-03T15:47:04.312",32,{"$f":"COUNTIFS(Test,A185,Nimi,B185,Aeg,\">=\"&C185)","v":15}]
["Test03","Getlin Allas","2019-11-19T23:46:40.880",74,{"$f":"COUNTIFS(Test,A186,Nimi,B186,Aeg,\">=\"&C186)","v":3}]
["Test04","Karin Saar","2019-11-13T22:53:57.480",21,{"$f":"COUNTIFS(Test,A187,Nimi,B187,Aeg,\">=\"&C187)","v":4}]
["Test02","Kristina Merila","2019-11-09T09:30:06.068",38,{"$f":"COUNTIFS(Test,A188,Nimi,B188,Aeg,\">=\"&C188)","v":12}]
["Test01","Maarja Pihlak","2019-11-15T17:42:36.640",45,{"$f":"COUNTIFS(Test,A189,Nimi,B189,Aeg,\">=\"&C189)","v":5}]
["Test01","Kertu Heinsoo","2019-11-30T22:23:05.473",47,{"$f":"COUNTIFS(Test,A190,Nimi,B190,Aeg,\">=\"&C190)","v":1}]
["Test01","Kristina Merila","2019-11-13T08:08:38.401",26,{"$f":"COUNTIFS(Test,A191,Nimi,B191,Aeg,\">=\"&C191)","v":3}]
["Test01","Martin Aavik","2019-11-22T09:07:55.238",48,{"$f":"COUNTIFS(Test,A192,Nimi,B192,Aeg,\">=\"&C192)","v":4}]
["Test02","Anna Koel","2019-11-07T09:56:49.567",61,{"$f":"COUNTIFS(Test,A193,Nimi,B193,Aeg,\">=\"&C193)","v":4}]
["Test04","Getlin Allas","2019-11-24T16:32:33.448",38,{"$f":"COUNTIFS(Test,A194,Nimi,B194,Aeg,\">=\"&C194)","v":2}]
["Test02","Diana Taal","2019-11-18T08:09:05.990",46,{"$f":"COUNTIFS(Test,A195,Nimi,B195,Aeg,\">=\"&C195)","v":4}]
["Test04","Hanna Laid","2019-11-23T23:06:37.372",57,{"$f":"COUNTIFS(Test,A196,Nimi,B196,Aeg,\">=\"&C196)","v":3}]
["Test02","Emili Loorits","2019-11-23T22:01:46.344",51,{"$f":"COUNTIFS(Test,A197,Nimi,B197,Aeg,\">=\"&C197)","v":2}]
["Test01","Lauri Vahtra","2019-11-01T22:28:04.754",64,{"$f":"COUNTIFS(Test,A198,Nimi,B198,Aeg,\">=\"&C198)","v":4}]
["Test02","Brita Kaljula","2019-11-24T09:26:52.902",83,{"$f":"COUNTIFS(Test,A199,Nimi,B199,Aeg,\">=\"&C199)","v":2}]
["Test01","Katrin Laurits","2019-11-22T22:30:32.207",75,{"$f":"COUNTIFS(Test,A200,Nimi,B200,Aeg,\">=\"&C200)","v":1}]
["Test01","Reimo Kala","2019-11-20T21:18:40.694",41,{"$f":"COUNTIFS(Test,A201,Nimi,B201,Aeg,\">=\"&C201)","v":1}]
["Test02","Sander Kell","2019-11-05T09:02:04.211",60,{"$f":"COUNTIFS(Test,A202,Nimi,B202,Aeg,\">=\"&C202)","v":9}]
["Test01","Lauri Vahtra","2019-11-07T11:23:24.923",35,{"$f":"COUNTIFS(Test,A203,Nimi,B203,Aeg,\">=\"&C203)","v":3}]
["Test02","Karin Saar","2019-11-11T16:51:06.062",51,{"$f":"COUNTIFS(Test,A204,Nimi,B204,Aeg,\">=\"&C204)","v":7}]
["Test02","Brita Kaljula","2019-11-06T13:47:31.633",100,{"$f":"COUNTIFS(Test,A205,Nimi,B205,Aeg,\">=\"&C205)","v":8}]
["Test01","Hanna Laid","2019-11-20T09:30:42.188",81,{"$f":"COUNTIFS(Test,A206,Nimi,B206,Aeg,\">=\"&C206)","v":5}]
["Test02","Joonas Haljas","2019-11-18T10:40:58.136",98,{"$f":"COUNTIFS(Test,A207,Nimi,B207,Aeg,\">=\"&C207)","v":6}]
["Test03","Tarvo Järv","2019-11-18T22:00:02.101",48,{"$f":"COUNTIFS(Test,A208,Nimi,B208,Aeg,\">=\"&C208)","v":3}]
["Test02","Egert Vint","2019-11-23T15:00:39.795",40,{"$f":"COUNTIFS(Test,A209,Nimi,B209,Aeg,\">=\"&C209)","v":1}]
["Test03","Erik Pärn","2019-11-14T12:08:58.125",45,{"$f":"COUNTIFS(Test,A210,Nimi,B210,Aeg,\">=\"&C210)","v":5}]
["Test01","Karin Saar","2019-11-22T18:37:41.144",95,{"$f":"COUNTIFS(Test,A211,Nimi,B211,Aeg,\">=\"&C211)","v":3}]
["Test01","Urmas Lõhmus","2019-11-14T17:17:27.217",71,{"$f":"COUNTIFS(Test,A212,Nimi,B212,Aeg,\">=\"&C212)","v":3}]
["Test02","Robert Lentso","2019-11-30T23:44:35.957",84,{"$f":"COUNTIFS(Test,A213,Nimi,B213,Aeg,\">=\"&C213)","v":1}]
["Test02","Hanna Laid","2019-11-19T18:48:05.611",84,{"$f":"COUNTIFS(Test,A214,Nimi,B214,Aeg,\">=\"&C214)","v":1}]
["Test03","Emili Loorits","2019-11-02T22:06:58.760",85,{"$f":"COUNTIFS(Test,A215,Nimi,B215,Aeg,\">=\"&C215)","v":5}]
["Test01","Armin Kaasik","2019-11-12T12:27:25.392",44,{"$f":"COUNTIFS(Test,A216,Nimi,B216,Aeg,\">=\"&C216)","v":4}]
["Test02","Reimo Kala","2019-11-05T21:53:48.497",51,{"$f":"COUNTIFS(Test,A217,Nimi,B217,Aeg,\">=\"&C217)","v":5}]
["Test04","Rasmus Kroon","2019-11-09T12:00:20.809",92,{"$f":"COUNTIFS(Test,A218,Nimi,B218,Aeg,\">=\"&C218)","v":2}]
["Test03","Brita Kaljula","2019-11-26T08:06:08.801",36,{"$f":"COUNTIFS(Test,A219,Nimi,B219,Aeg,\">=\"&C219)","v":2}]
["Test01","Jaagup Kivi","2019-11-23T15:10:15.393",87,{"$f":"COUNTIFS(Test,A220,Nimi,B220,Aeg,\">=\"&C220)","v":2}]
["Test02","Erik Pärn","2019-11-20T23:06:51.128",94,{"$f":"COUNTIFS(Test,A221,Nimi,B221,Aeg,\">=\"&C221)","v":6}]
["Test03","Jaagup Kivi","2019-11-15T14:24:26.149",87,{"$f":"COUNTIFS(Test,A222,Nimi,B222,Aeg,\">=\"&C222)","v":8}]
["Test04","Kaspar Raude","2019-11-07T19:28:08.703",87,{"$f":"COUNTIFS(Test,A223,Nimi,B223,Aeg,\">=\"&C223)","v":5}]
["Test03","Sander Kell","2019-11-09T13:49:15.486",77,{"$f":"COUNTIFS(Test,A224,Nimi,B224,Aeg,\">=\"&C224)","v":4}]
["Test02","Joonas Haljas","2019-11-29T09:43:35.393",51,{"$f":"COUNTIFS(Test,A225,Nimi,B225,Aeg,\">=\"&C225)","v":2}]
["Test03","Urmas Lõhmus","2019-11-08T20:17:01.805",99,{"$f":"COUNTIFS(Test,A226,Nimi,B226,Aeg,\">=\"&C226)","v":8}]
["Test04","Kertu Heinsoo","2019-11-07T21:06:00.666",61,{"$f":"COUNTIFS(Test,A227,Nimi,B227,Aeg,\">=\"&C227)","v":5}]
["Test04","Martin Aavik","2019-11-28T19:44:12.980",84,{"$f":"COUNTIFS(Test,A228,Nimi,B228,Aeg,\">=\"&C228)","v":1}]
["Test04","Egert Vint","2019-11-27T11:44:49.921",35,{"$f":"COUNTIFS(Test,A229,Nimi,B229,Aeg,\">=\"&C229)","v":1}]
["Test02","Getlin Allas","2019-11-24T13:15:48.906",71,{"$f":"COUNTIFS(Test,A230,Nimi,B230,Aeg,\">=\"&C230)","v":4}]
["Test01","Armin Kaasik","2019-11-02T17:43:45.010",77,{"$f":"COUNTIFS(Test,A231,Nimi,B231,Aeg,\">=\"&C231)","v":6}]
["Test01","Reimo Kala","2019-11-19T10:18:32.173",89,{"$f":"COUNTIFS(Test,A232,Nimi,B232,Aeg,\">=\"&C232)","v":3}]
["Test03","Hans Kukk","2019-11-27T20:58:59.960",51,{"$f":"COUNTIFS(Test,A233,Nimi,B233,Aeg,\">=\"&C233)","v":4}]
["Test02","Kristina Merila","2019-11-16T15:06:23.968",73,{"$f":"COUNTIFS(Test,A234,Nimi,B234,Aeg,\">=\"&C234)","v":4}]
["Test02","Maarja Pihlak","2019-11-01T10:10:07.908",97,{"$f":"COUNTIFS(Test,A235,Nimi,B235,Aeg,\">=\"&C235)","v":11}]
["Test03","Lauri Vahtra","2019-11-09T09:03:18.909",58,{"$f":"COUNTIFS(Test,A236,Nimi,B236,Aeg,\">=\"&C236)","v":7}]
["Test02","Jana Kiisk","2019-11-11T17:05:12.773",37,{"$f":"COUNTIFS(Test,A237,Nimi,B237,Aeg,\">=\"&C237)","v":7}]
["Test02","Getlin Allas","2019-11-03T12:35:38.461",35,{"$f":"COUNTIFS(Test,A238,Nimi,B238,Aeg,\">=\"&C238)","v":13}]
["Test02","Maarja Pihlak","2019-11-19T10:00:00.201",45,{"$f":"COUNTIFS(Test,A239,Nimi,B239,Aeg,\">=\"&C239)","v":4}]
["Test01","Anette Lepp","2019-11-07T15:04:56.018",63,{"$f":"COUNTIFS(Test,A240,Nimi,B240,Aeg,\">=\"&C240)","v":7}]
["Test02","Viktoria Lumi","2019-11-13T17:32:32.522",77,{"$f":"COUNTIFS(Test,A241,Nimi,B241,Aeg,\">=\"&C241)","v":6}]
["Test04","Anette Lepp","2019-11-06T08:51:36.932",22,{"$f":"COUNTIFS(Test,A242,Nimi,B242,Aeg,\">=\"&C242)","v":10}]
["Test04","Anna Koel","2019-11-23T11:26:03.532",43,{"$f":"COUNTIFS(Test,A243,Nimi,B243,Aeg,\">=\"&C243)","v":8}]
["Test01","Reimo Kala","2019-11-08T14:31:45.646",38,{"$f":"COUNTIFS(Test,A244,Nimi,B244,Aeg,\">=\"&C244)","v":7}]
["Test04","Jaagup Kivi","2019-11-01T08:04:11.164",72,{"$f":"COUNTIFS(Test,A245,Nimi,B245,Aeg,\">=\"&C245)","v":14}]
["Test02","Erik Pärn","2019-11-26T14:19:45.904",73,{"$f":"COUNTIFS(Test,A246,Nimi,B246,Aeg,\">=\"&C246)","v":2}]
["Test01","Anette Lepp","2019-11-01T21:01:08.587",80,{"$f":"COUNTIFS(Test,A247,Nimi,B247,Aeg,\">=\"&C247)","v":12}]
["Test04","Tarvo Järv","2019-11-30T17:11:17.226",81,{"$f":"COUNTIFS(Test,A248,Nimi,B248,Aeg,\">=\"&C248)","v":1}]
["Test03","Maarja Pihlak","2019-11-24T14:56:08.406",84,{"$f":"COUNTIFS(Test,A249,Nimi,B249,Aeg,\">=\"&C249)","v":2}]
["Test02","Kertu Heinsoo","2019-11-19T18:15:21.990",62,{"$f":"COUNTIFS(Test,A250,Nimi,B250,Aeg,\">=\"&C250)","v":4}]
["Test02","Viktoria Lumi","2019-11-03T16:46:57.446",38,{"$f":"COUNTIFS(Test,A251,Nimi,B251,Aeg,\">=\"&C251)","v":11}]
["Test03","Alari Suur","2019-11-24T21:23:39.521",55,{"$f":"COUNTIFS(Test,A252,Nimi,B252,Aeg,\">=\"&C252)","v":2}]
["Test03","Tarvo Järv","2019-11-13T20:37:33.708",62,{"$f":"COUNTIFS(Test,A253,Nimi,B253,Aeg,\">=\"&C253)","v":7}]
["Test01","Alari Suur","2019-11-18T17:00:07.126",22,{"$f":"COUNTIFS(Test,A254,Nimi,B254,Aeg,\">=\"&C254)","v":5}]
["Test03","Hans Kukk","2019-11-30T13:30:38.512",78,{"$f":"COUNTIFS(Test,A255,Nimi,B255,Aeg,\">=\"&C255)","v":1}]
["Test04","Lauri Vahtra","2019-11-12T09:34:53.105",62,{"$f":"COUNTIFS(Test,A256,Nimi,B256,Aeg,\">=\"&C256)","v":6}]
["Test02","Sander Kell","2019-11-13T18:19:03.776",50,{"$f":"COUNTIFS(Test,A257,Nimi,B257,Aeg,\">=\"&C257)","v":6}]
["Test01","Lauri Vahtra","2019-11-27T13:57:22.505",98,{"$f":"COUNTIFS(Test,A258,Nimi,B258,Aeg,\">=\"&C258)","v":1}]
["Test01","Markus Niidas","2019-11-27T17:09:34.639",26,{"$f":"COUNTIFS(Test,A259,Nimi,B259,Aeg,\">=\"&C259)","v":2}]
["Test01","Maarja Pihlak","2019-11-22T12:34:24.357",60,{"$f":"COUNTIFS(Test,A260,Nimi,B260,Aeg,\">=\"&C260)","v":4}]
["Test01","Hanna Laid","2019-11-23T18:51:57.535",37,{"$f":"COUNTIFS(Test,A261,Nimi,B261,Aeg,\">=\"&C261)","v":3}]
["Test02","Rasmus Kroon","2019-11-29T14:22:49.607",33,{"$f":"COUNTIFS(Test,A262,Nimi,B262,Aeg,\">=\"&C262)","v":1}]
["Test01","Martin Aavik","2019-11-29T22:47:56.400",40,{"$f":"COUNTIFS(Test,A263,Nimi,B263,Aeg,\">=\"&C263)","v":1}]
["Test04","Kristina Merila","2019-11-05T22:01:37.046",89,{"$f":"COUNTIFS(Test,A264,Nimi,B264,Aeg,\">=\"&C264)","v":10}]
["Test04","Egert Vint","2019-11-08T18:09:13.176",73,{"$f":"COUNTIFS(Test,A265,Nimi,B265,Aeg,\">=\"&C265)","v":6}]
["Test02","Lauri Vahtra","2019-11-30T11:27:06.027",93,{"$f":"COUNTIFS(Test,A266,Nimi,B266,Aeg,\">=\"&C266)","v":1}]
["Test01","Getlin Allas","2019-11-16T15:09:29.581",80,{"$f":"COUNTIFS(Test,A267,Nimi,B267,Aeg,\">=\"&C267)","v":4}]
["Test01","Anette Lepp","2019-11-13T08:18:54.141",42,{"$f":"COUNTIFS(Test,A268,Nimi,B268,Aeg,\">=\"&C268)","v":4}]
["Test04","Tarvo Järv","2019-11-14T20:36:27.817",59,{"$f":"COUNTIFS(Test,A269,Nimi,B269,Aeg,\">=\"&C269)","v":4}]
["Test02","Karin Saar","2019-11-17T10:12:45.487",35,{"$f":"COUNTIFS(Test,A270,Nimi,B270,Aeg,\">=\"&C270)","v":2}]
["Test04","Hans Kukk","2019-11-04T09:03:27.630",96,{"$f":"COUNTIFS(Test,A271,Nimi,B271,Aeg,\">=\"&C271)","v":9}]
["Test01","Erik Pärn","2019-11-26T23:25:54.457",36,{"$f":"COUNTIFS(Test,A272,Nimi,B272,Aeg,\">=\"&C272)","v":4}]
["Test02","Robert Lentso","2019-11-16T22:58:58.232",67,{"$f":"COUNTIFS(Test,A273,Nimi,B273,Aeg,\">=\"&C273)","v":5}]
["Test03","Hanna Laid","2019-11-12T13:00:31.891",96,{"$f":"COUNTIFS(Test,A274,Nimi,B274,Aeg,\">=\"&C274)","v":5}]
["Test04","Urmas Lõhmus","2019-11-04T16:08:25.026",87,{"$f":"COUNTIFS(Test,A275,Nimi,B275,Aeg,\">=\"&C275)","v":7}]
["Test01","Sander Kell","2019-11-18T13:31:07.386",74,{"$f":"COUNTIFS(Test,A276,Nimi,B276,Aeg,\">=\"&C276)","v":5}]
["Test02","Emili Loorits","2019-11-02T09:21:37.935",76,{"$f":"COUNTIFS(Test,A277,Nimi,B277,Aeg,\">=\"&C277)","v":10}]
["Test04","Hanna Laid","2019-11-14T23:22:09.569",47,{"$f":"COUNTIFS(Test,A278,Nimi,B278,Aeg,\">=\"&C278)","v":9}]
["Test03","Katrin Laurits","2019-11-01T18:51:52.050",94,{"$f":"COUNTIFS(Test,A279,Nimi,B279,Aeg,\">=\"&C279)","v":8}]
["Test01","Alari Suur","2019-11-07T17:21:13.536",85,{"$f":"COUNTIFS(Test,A280,Nimi,B280,Aeg,\">=\"&C280)","v":9}]
["Test03","Getlin Allas","2019-11-19T13:27:17.989",55,{"$f":"COUNTIFS(Test,A281,Nimi,B281,Aeg,\">=\"&C281)","v":4}]
["Test01","Karin Saar","2019-11-07T08:26:39.509",74,{"$f":"COUNTIFS(Test,A282,Nimi,B282,Aeg,\">=\"&C282)","v":8}]
["Test03","Anette Lepp","2019-11-30T22:23:26.186",52,{"$f":"COUNTIFS(Test,A283,Nimi,B283,Aeg,\">=\"&C283)","v":1}]
["Test02","Getlin Allas","2019-11-04T08:40:49.696",92,{"$f":"COUNTIFS(Test,A284,Nimi,B284,Aeg,\">=\"&C284)","v":12}]
["Test04","Maarja Pihlak","2019-11-25T17:10:55.311",41,{"$f":"COUNTIFS(Test,A285,Nimi,B285,Aeg,\">=\"&C285)","v":1}]
["Test03","Paul Hein","2019-11-25T23:54:31.669",97,{"$f":"COUNTIFS(Test,A286,Nimi,B286,Aeg,\">=\"&C286)","v":5}]
["Test01","Egert Vint","2019-11-10T11:05:36.158",63,{"$f":"COUNTIFS(Test,A287,Nimi,B287,Aeg,\">=\"&C287)","v":6}]
["Test02","Sander Kell","2019-11-03T12:50:22.460",49,{"$f":"COUNTIFS(Test,A288,Nimi,B288,Aeg,\">=\"&C288)","v":10}]
["Test01","Getlin Allas","2019-11-18T18:11:24.131",42,{"$f":"COUNTIFS(Test,A289,Nimi,B289,Aeg,\">=\"&C289)","v":2}]
["Test04","Hans Kukk","2019-11-28T21:13:32.619",52,{"$f":"COUNTIFS(Test,A290,Nimi,B290,Aeg,\">=\"&C290)","v":1}]
["Test01","Hans Kukk","2019-11-06T09:12:26.824",65,{"$f":"COUNTIFS(Test,A291,Nimi,B291,Aeg,\">=\"&C291)","v":6}]
["Test03","Karin Saar","2019-11-10T14:58:20.221",81,{"$f":"COUNTIFS(Test,A292,Nimi,B292,Aeg,\">=\"&C292)","v":5}]
["Test02","Markus Niidas","2019-11-22T20:34:31.240",66,{"$f":"COUNTIFS(Test,A293,Nimi,B293,Aeg,\">=\"&C293)","v":2}]
["Test01","Kaspar Raude","2019-11-17T16:33:09.881",95,{"$f":"COUNTIFS(Test,A294,Nimi,B294,Aeg,\">=\"&C294)","v":4}]
["Test03","Artur Piiri","2019-11-15T22:33:17.133",33,{"$f":"COUNTIFS(Test,A295,Nimi,B295,Aeg,\">=\"&C295)","v":8}]
["Test03","Joonas Haljas","2019-11-04T11:38:26.307",38,{"$f":"COUNTIFS(Test,A296,Nimi,B296,Aeg,\">=\"&C296)","v":8}]
["Test02","Kristina Merila","2019-11-09T20:11:53.375",24,{"$f":"COUNTIFS(Test,A297,Nimi,B297,Aeg,\">=\"&C297)","v":11}]
["Test04","Paul Hein","2019-11-15T20:06:26.415",22,{"$f":"COUNTIFS(Test,A298,Nimi,B298,Aeg,\">=\"&C298)","v":3}]
["Test03","Kaspar Raude","2019-11-08T09:34:29.637",29,{"$f":"COUNTIFS(Test,A299,Nimi,B299,Aeg,\">=\"&C299)","v":3}]
["Test02","Alari Suur","2019-11-08T21:14:04.222",86,{"$f":"COUNTIFS(Test,A300,Nimi,B300,Aeg,\">=\"&C300)","v":7}]
["Test01","Robert Lentso","2019-11-28T16:26:06.399",55,{"$f":"COUNTIFS(Test,A301,Nimi,B301,Aeg,\">=\"&C301)","v":2}]
["Test03","Hanna Laid","2019-11-07T09:02:33.831",53,{"$f":"COUNTIFS(Test,A302,Nimi,B302,Aeg,\">=\"&C302)","v":6}]
["Test04","Karin Saar","2019-11-13T09:23:25.356",98,{"$f":"COUNTIFS(Test,A303,Nimi,B303,Aeg,\">=\"&C303)","v":6}]
["Test03","Lauri Vahtra","2019-11-06T21:40:34.662",92,{"$f":"COUNTIFS(Test,A304,Nimi,B304,Aeg,\">=\"&C304)","v":9}]
["Test01","Sander Kell","2019-11-11T11:28:50.370",77,{"$f":"COUNTIFS(Test,A305,Nimi,B305,Aeg,\">=\"&C305)","v":8}]
["Test04","Kristina Merila","2019-11-28T21:02:45.049",70,{"$f":"COUNTIFS(Test,A306,Nimi,B306,Aeg,\">=\"&C306)","v":2}]
["Test03","Robert Lentso","2019-11-28T20:42:23.383",68,{"$f":"COUNTIFS(Test,A307,Nimi,B307,Aeg,\">=\"&C307)","v":4}]
["Test04","Diana Taal","2019-11-28T14:29:33.431",80,{"$f":"COUNTIFS(Test,A308,Nimi,B308,Aeg,\">=\"&C308)","v":1}]
["Test02","Markus Niidas","2019-11-09T20:03:05.742",61,{"$f":"COUNTIFS(Test,A309,Nimi,B309,Aeg,\">=\"&C309)","v":6}]
["Test01","Viktoria Lumi","2019-11-20T19:48:49.123",26,{"$f":"COUNTIFS(Test,A310,Nimi,B310,Aeg,\">=\"&C310)","v":1}]
["Test01","Sander Kell","2019-11-02T12:48:19.036",55,{"$f":"COUNTIFS(Test,A311,Nimi,B311,Aeg,\">=\"&C311)","v":11}]
["Test02","Karin Saar","2019-11-13T22:57:21.662",34,{"$f":"COUNTIFS(Test,A312,Nimi,B312,Aeg,\">=\"&C312)","v":5}]
["Test02","Sander Kell","2019-11-25T09:44:25.716",86,{"$f":"COUNTIFS(Test,A313,Nimi,B313,Aeg,\">=\"&C313)","v":4}]
["Test02","Brita Kaljula","2019-11-08T21:54:47.300",84,{"$f":"COUNTIFS(Test,A314,Nimi,B314,Aeg,\">=\"&C314)","v":6}]
["Test02","Kaspar Raude","2019-11-12T15:11:21.941",94,{"$f":"COUNTIFS(Test,A315,Nimi,B315,Aeg,\">=\"&C315)","v":1}]
["Test04","Armin Kaasik","2019-11-08T10:03:44.338",30,{"$f":"COUNTIFS(Test,A316,Nimi,B316,Aeg,\">=\"&C316)","v":7}]
["Test03","Alari Suur","2019-11-14T20:08:50.786",63,{"$f":"COUNTIFS(Test,A317,Nimi,B317,Aeg,\">=\"&C317)","v":4}]
["Test02","Urmas Lõhmus","2019-11-08T09:05:29.853",46,{"$f":"COUNTIFS(Test,A318,Nimi,B318,Aeg,\">=\"&C318)","v":8}]
["Test03","Urmas Lõhmus","2019-11-10T20:55:13.997",43,{"$f":"COUNTIFS(Test,A319,Nimi,B319,Aeg,\">=\"&C319)","v":7}]
["Test04","Tarvo Järv","2019-11-10T17:52:56.156",72,{"$f":"COUNTIFS(Test,A320,Nimi,B320,Aeg,\">=\"&C320)","v":6}]
["Test04","Jana Kiisk","2019-11-26T16:45:24.264",91,{"$f":"COUNTIFS(Test,A321,Nimi,B321,Aeg,\">=\"&C321)","v":1}]
["Test04","Katrin Laurits","2019-11-15T15:06:27.432",92,{"$f":"COUNTIFS(Test,A322,Nimi,B322,Aeg,\">=\"&C322)","v":6}]
["Test01","Joonas Haljas","2019-11-30T18:03:35.030",81,{"$f":"COUNTIFS(Test,A323,Nimi,B323,Aeg,\">=\"&C323)","v":1}]
["Test03","Rasmus Kroon","2019-11-25T09:39:25.147",49,{"$f":"COUNTIFS(Test,A324,Nimi,B324,Aeg,\">=\"&C324)","v":3}]
["Test02","Anette Lepp","2019-11-21T22:44:11.810",88,{"$f":"COUNTIFS(Test,A325,Nimi,B325,Aeg,\">=\"&C325)","v":1}]
["Test03","Kertu Heinsoo","2019-11-22T15:34:38.715",95,{"$f":"COUNTIFS(Test,A326,Nimi,B326,Aeg,\">=\"&C326)","v":5}]
["Test02","Viktoria Lumi","2019-11-15T16:44:39.887",76,{"$f":"COUNTIFS(Test,A327,Nimi,B327,Aeg,\">=\"&C327)","v":5}]
["Test01","Artur Piiri","2019-11-01T14:58:44.699",79,{"$f":"COUNTIFS(Test,A328,Nimi,B328,Aeg,\">=\"&C328)","v":4}]
["Test04","Artur Piiri","2019-11-17T08:25:09.783",40,{"$f":"COUNTIFS(Test,A329,Nimi,B329,Aeg,\">=\"&C329)","v":4}]
["Test03","Lauri Vahtra","2019-11-26T15:13:22.436",94,{"$f":"COUNTIFS(Test,A330,Nimi,B330,Aeg,\">=\"&C330)","v":1}]
["Test01","Egert Vint","2019-11-22T10:23:23.826",34,{"$f":"COUNTIFS(Test,A331,Nimi,B331,Aeg,\">=\"&C331)","v":3}]
["Test03","Artur Piiri","2019-11-17T13:38:40.054",93,{"$f":"COUNTIFS(Test,A332,Nimi,B332,Aeg,\">=\"&C332)","v":6}]
["Test04","Hans Kukk","2019-11-08T08:34:48.314",89,{"$f":"COUNTIFS(Test,A333,Nimi,B333,Aeg,\">=\"&C333)","v":7}]
["Test02","Erik Pärn","2019-11-06T17:46:41.163",51,{"$f":"COUNTIFS(Test,A334,Nimi,B334,Aeg,\">=\"&C334)","v":11}]
["Test04","Artur Piiri","2019-11-10T15:28:33.743",77,{"$f":"COUNTIFS(Test,A335,Nimi,B335,Aeg,\">=\"&C335)","v":5}]
["Test02","Martin Aavik","2019-11-17T08:08:55.516",63,{"$f":"COUNTIFS(Test,A336,Nimi,B336,Aeg,\">=\"&C336)","v":3}]
["Test04","Kertu Heinsoo","2019-11-04T21:53:06.203",55,{"$f":"COUNTIFS(Test,A337,Nimi,B337,Aeg,\">=\"&C337)","v":8}]
["Test03","Kaspar Raude","2019-11-03T23:33:13.333",34,{"$f":"COUNTIFS(Test,A338,Nimi,B338,Aeg,\">=\"&C338)","v":5}]
["Test01","Maarja Pihlak","2019-11-26T16:53:34.006",99,{"$f":"COUNTIFS(Test,A339,Nimi,B339,Aeg,\">=\"&C339)","v":2}]
["Test02","Viktoria Lumi","2019-11-18T15:44:19.906",98,{"$f":"COUNTIFS(Test,A340,Nimi,B340,Aeg,\">=\"&C340)","v":4}]
["Test04","Anette Lepp","2019-11-12T14:45:06.704",40,{"$f":"COUNTIFS(Test,A341,Nimi,B341,Aeg,\">=\"&C341)","v":5}]
["Test02","Martin Aavik","2019-11-19T12:11:42.442",49,{"$f":"COUNTIFS(Test,A342,Nimi,B342,Aeg,\">=\"&C342)","v":1}]
["Test01","Martin Aavik","2019-11-22T18:33:15.463",52,{"$f":"COUNTIFS(Test,A343,Nimi,B343,Aeg,\">=\"&C343)","v":3}]
["Test02","Paul Hein","2019-11-24T19:17:17.190",83,{"$f":"COUNTIFS(Test,A344,Nimi,B344,Aeg,\">=\"&C344)","v":2}]
["Test03","Jaagup Kivi","2019-11-17T08:58:10.973",59,{"$f":"COUNTIFS(Test,A345,Nimi,B345,Aeg,\">=\"&C345)","v":5}]
["Test04","Maarja Pihlak","2019-11-13T23:46:04.859",91,{"$f":"COUNTIFS(Test,A346,Nimi,B346,Aeg,\">=\"&C346)","v":6}]
["Test03","Martin Aavik","2019-11-02T20:18:01.669",93,{"$f":"COUNTIFS(Test,A347,Nimi,B347,Aeg,\">=\"&C347)","v":14}]
["Test04","Maarja Pihlak","2019-11-06T16:02:27.904",40,{"$f":"COUNTIFS(Test,A348,Nimi,B348,Aeg,\">=\"&C348)","v":10}]
["Test03","Getlin Allas","2019-11-05T20:13:14.726",38,{"$f":"COUNTIFS(Test,A349,Nimi,B349,Aeg,\">=\"&C349)","v":8}]
["Test03","Urmas Lõhmus","2019-11-08T13:57:11.465",85,{"$f":"COUNTIFS(Test,A350,Nimi,B350,Aeg,\">=\"&C350)","v":9}]
["Test03","Reimo Kala","2019-11-18T20:08:30.435",31,{"$f":"COUNTIFS(Test,A351,Nimi,B351,Aeg,\">=\"&C351)","v":3}]
["Test03","Joonas Haljas","2019-11-30T14:47:28.180",62,{"$f":"COUNTIFS(Test,A352,Nimi,B352,Aeg,\">=\"&C352)","v":1}]
["Test04","Anette Lepp","2019-11-15T11:09:02.721",30,{"$f":"COUNTIFS(Test,A353,Nimi,B353,Aeg,\">=\"&C353)","v":4}]
["Test03","Urmas Lõhmus","2019-11-06T10:38:40.023",74,{"$f":"COUNTIFS(Test,A354,Nimi,B354,Aeg,\">=\"&C354)","v":10}]
["Test03","Joonas Haljas","2019-11-22T22:59:05.188",98,{"$f":"COUNTIFS(Test,A355,Nimi,B355,Aeg,\">=\"&C355)","v":3}]
["Test02","Alari Suur","2019-11-27T22:38:28.671",91,{"$f":"COUNTIFS(Test,A356,Nimi,B356,Aeg,\">=\"&C356)","v":1}]
["Test03","Reimo Kala","2019-11-11T13:19:25.242",97,{"$f":"COUNTIFS(Test,A357,Nimi,B357,Aeg,\">=\"&C357)","v":4}]
["Test01","Kertu Heinsoo","2019-11-18T18:42:58.809",89,{"$f":"COUNTIFS(Test,A358,Nimi,B358,Aeg,\">=\"&C358)","v":7}]
["Test01","Emili Loorits","2019-11-26T10:01:18.219",38,{"$f":"COUNTIFS(Test,A359,Nimi,B359,Aeg,\">=\"&C359)","v":1}]
["Test04","Erik Pärn","2019-11-13T10:37:20.017",45,{"$f":"COUNTIFS(Test,A360,Nimi,B360,Aeg,\">=\"&C360)","v":6}]
["Test02","Carmen Sõrmus","2019-11-13T10:24:01.372",97,{"$f":"COUNTIFS(Test,A361,Nimi,B361,Aeg,\">=\"&C361)","v":7}]
["Test04","Lauri Vahtra","2019-11-06T08:52:24.461",96,{"$f":"COUNTIFS(Test,A362,Nimi,B362,Aeg,\">=\"&C362)","v":8}]
["Test02","Egert Vint","2019-11-19T09:42:55.596",31,{"$f":"COUNTIFS(Test,A363,Nimi,B363,Aeg,\">=\"&C363)","v":2}]
["Test01","Martin Aavik","2019-11-06T23:09:38.819",74,{"$f":"COUNTIFS(Test,A364,Nimi,B364,Aeg,\">=\"&C364)","v":9}]
["Test02","Diana Taal","2019-11-24T23:38:08.364",71,{"$f":"COUNTIFS(Test,A365,Nimi,B365,Aeg,\">=\"&C365)","v":3}]
["Test01","Artur Piiri","2019-11-17T20:43:25.410",29,{"$f":"COUNTIFS(Test,A366,Nimi,B366,Aeg,\">=\"&C366)","v":3}]
["Test01","Mihkel Kulp","2019-11-25T08:08:17.260",54,{"$f":"COUNTIFS(Test,A367,Nimi,B367,Aeg,\">=\"&C367)","v":3}]
["Test03","Urmas Lõhmus","2019-11-28T16:22:17.438",46,{"$f":"COUNTIFS(Test,A368,Nimi,B368,Aeg,\">=\"&C368)","v":1}]
["Test02","Robert Lentso","2019-11-26T21:26:50.317",21,{"$f":"COUNTIFS(Test,A369,Nimi,B369,Aeg,\">=\"&C369)","v":3}]
["Test03","Jaagup Kivi","2019-11-17T18:14:35.353",42,{"$f":"COUNTIFS(Test,A370,Nimi,B370,Aeg,\">=\"&C370)","v":4}]
["Test03","Anette Lepp","2019-11-07T18:14:22.195",92,{"$f":"COUNTIFS(Test,A371,Nimi,B371,Aeg,\">=\"&C371)","v":11}]
["Test01","Kaspar Raude","2019-11-24T10:49:38.599",33,{"$f":"COUNTIFS(Test,A372,Nimi,B372,Aeg,\">=\"&C372)","v":2}]
["Test01","Sander Kell","2019-11-17T20:05:43.153",68,{"$f":"COUNTIFS(Test,A373,Nimi,B373,Aeg,\">=\"&C373)","v":6}]
["Test01","Mihkel Kulp","2019-11-12T11:43:45.816",77,{"$f":"COUNTIFS(Test,A374,Nimi,B374,Aeg,\">=\"&C374)","v":5}]
["Test04","Carmen Sõrmus","2019-11-25T20:29:12.185",62,{"$f":"COUNTIFS(Test,A375,Nimi,B375,Aeg,\">=\"&C375)","v":1}]
["Test03","Diana Taal","2019-11-21T17:48:12.547",64,{"$f":"COUNTIFS(Test,A376,Nimi,B376,Aeg,\">=\"&C376)","v":5}]
["Test01","Brita Kaljula","2019-11-02T10:17:08.710",99,{"$f":"COUNTIFS(Test,A377,Nimi,B377,Aeg,\">=\"&C377)","v":10}]
["Test02","Erik Pärn","2019-11-16T20:56:07.631",84,{"$f":"COUNTIFS(Test,A378,Nimi,B378,Aeg,\">=\"&C378)","v":8}]
["Test02","Paul Hein","2019-11-17T11:17:45.292",69,{"$f":"COUNTIFS(Test,A379,Nimi,B379,Aeg,\">=\"&C379)","v":5}]
["Test03","Erik Pärn","2019-11-12T16:12:02.061",83,{"$f":"COUNTIFS(Test,A380,Nimi,B380,Aeg,\">=\"&C380)","v":6}]
["Test04","Kertu Heinsoo","2019-11-07T12:57:32.760",100,{"$f":"COUNTIFS(Test,A381,Nimi,B381,Aeg,\">=\"&C381)","v":7}]
["Test03","Egert Vint","2019-11-17T13:10:11.245",80,{"$f":"COUNTIFS(Test,A382,Nimi,B382,Aeg,\">=\"&C382)","v":3}]
["Test03","Diana Taal","2019-11-20T18:46:48.627",85,{"$f":"COUNTIFS(Test,A383,Nimi,B383,Aeg,\">=\"&C383)","v":7}]
["Test02","Paul Hein","2019-11-06T09:28:49.975",39,{"$f":"COUNTIFS(Test,A384,Nimi,B384,Aeg,\">=\"&C384)","v":8}]
["Test03","Reimo Kala","2019-11-21T14:05:31.166",98,{"$f":"COUNTIFS(Test,A385,Nimi,B385,Aeg,\">=\"&C385)","v":1}]
["Test02","Carmen Sõrmus","2019-11-05T17:08:43.875",89,{"$f":"COUNTIFS(Test,A386,Nimi,B386,Aeg,\">=\"&C386)","v":8}]
["Test02","Rasmus Kroon","2019-11-16T20:34:22.921",92,{"$f":"COUNTIFS(Test,A387,Nimi,B387,Aeg,\">=\"&C387)","v":5}]
["Test02","Martin Aavik","2019-11-15T17:46:33.483",49,{"$f":"COUNTIFS(Test,A388,Nimi,B388,Aeg,\">=\"&C388)","v":4}]
["Test02","Kristina Merila","2019-11-12T10:04:30.834",47,{"$f":"COUNTIFS(Test,A389,Nimi,B389,Aeg,\">=\"&C389)","v":9}]
["Test03","Kristina Merila","2019-11-25T17:23:10.128",81,{"$f":"COUNTIFS(Test,A390,Nimi,B390,Aeg,\">=\"&C390)","v":2}]
["Test02","Kristina Merila","2019-11-08T20:20:46.311",21,{"$f":"COUNTIFS(Test,A391,Nimi,B391,Aeg,\">=\"&C391)","v":13}]
["Test03","Hanna Laid","2019-11-14T11:42:05.611",84,{"$f":"COUNTIFS(Test,A392,Nimi,B392,Aeg,\">=\"&C392)","v":4}]
["Test01","Alari Suur","2019-11-17T11:51:42.802",46,{"$f":"COUNTIFS(Test,A393,Nimi,B393,Aeg,\">=\"&C393)","v":6}]
["Test03","Kristina Merila","2019-11-20T10:09:49.643",97,{"$f":"COUNTIFS(Test,A394,Nimi,B394,Aeg,\">=\"&C394)","v":4}]
["Test03","Robert Lentso","2019-11-20T14:21:04.479",24,{"$f":"COUNTIFS(Test,A395,Nimi,B395,Aeg,\">=\"&C395)","v":8}]
["Test02","Diana Taal","2019-11-16T09:15:29.769",38,{"$f":"COUNTIFS(Test,A396,Nimi,B396,Aeg,\">=\"&C396)","v":6}]
["Test04","Anette Lepp","2019-11-26T09:11:15.915",23,{"$f":"COUNTIFS(Test,A397,Nimi,B397,Aeg,\">=\"&C397)","v":2}]
["Test04","Egert Vint","2019-11-04T17:24:39.785",60,{"$f":"COUNTIFS(Test,A398,Nimi,B398,Aeg,\">=\"&C398)","v":8}]
["Test03","Maarja Pihlak","2019-11-28T17:29:21.495",68,{"$f":"COUNTIFS(Test,A399,Nimi,B399,Aeg,\">=\"&C399)","v":1}]
["Test02","Brita Kaljula","2019-11-15T16:55:14.887",30,{"$f":"COUNTIFS(Test,A400,Nimi,B400,Aeg,\">=\"&C400)","v":3}]
["Test03","Hans Kukk","2019-11-09T22:56:40.665",31,{"$f":"COUNTIFS(Test,A401,Nimi,B401,Aeg,\">=\"&C401)","v":9}]
["Test01","Emili Loorits","2019-11-21T18:32:31.398",69,{"$f":"COUNTIFS(Test,A402,Nimi,B402,Aeg,\">=\"&C402)","v":2}]
["Test03","Urmas Lõhmus","2019-11-23T12:38:08.781",75,{"$f":"COUNTIFS(Test,A403,Nimi,B403,Aeg,\">=\"&C403)","v":3}]
["Test02","Carmen Sõrmus","2019-11-25T15:22:15.192",55,{"$f":"COUNTIFS(Test,A404,Nimi,B404,Aeg,\">=\"&C404)","v":1}]
["Test01","Rasmus Kroon","2019-11-21T14:27:48.297",74,{"$f":"COUNTIFS(Test,A405,Nimi,B405,Aeg,\">=\"&C405)","v":6}]
["Test02","Jana Kiisk","2019-11-04T21:21:26.022",79,{"$f":"COUNTIFS(Test,A406,Nimi,B406,Aeg,\">=\"&C406)","v":11}]
["Test04","Viktoria Lumi","2019-11-01T17:23:39.436",62,{"$f":"COUNTIFS(Test,A407,Nimi,B407,Aeg,\">=\"&C407)","v":9}]
["Test03","Kaspar Raude","2019-11-07T16:21:30.962",66,{"$f":"COUNTIFS(Test,A408,Nimi,B408,Aeg,\">=\"&C408)","v":4}]
["Test04","Sander Kell","2019-11-23T08:31:52.651",46,{"$f":"COUNTIFS(Test,A409,Nimi,B409,Aeg,\">=\"&C409)","v":2}]
["Test03","Paul Hein","2019-11-27T16:07:35.128",88,{"$f":"COUNTIFS(Test,A410,Nimi,B410,Aeg,\">=\"&C410)","v":3}]
["Test04","Hanna Laid","2019-11-01T19:02:50.564",38,{"$f":"COUNTIFS(Test,A411,Nimi,B411,Aeg,\">=\"&C411)","v":17}]
["Test04","Anna Koel","2019-11-29T14:42:55.113",70,{"$f":"COUNTIFS(Test,A412,Nimi,B412,Aeg,\">=\"&C412)","v":2}]
["Test04","Mihkel Kulp","2019-11-10T16:32:28.877",59,{"$f":"COUNTIFS(Test,A413,Nimi,B413,Aeg,\">=\"&C413)","v":5}]
["Test01","Diana Taal","2019-11-04T15:56:04.278",70,{"$f":"COUNTIFS(Test,A414,Nimi,B414,Aeg,\">=\"&C414)","v":7}]
["Test01","Anette Lepp","2019-11-07T08:42:32.558",88,{"$f":"COUNTIFS(Test,A415,Nimi,B415,Aeg,\">=\"&C415)","v":8}]
["Test03","Mihkel Kulp","2019-11-22T08:51:24.983",49,{"$f":"COUNTIFS(Test,A416,Nimi,B416,Aeg,\">=\"&C416)","v":4}]
["Test01","Paul Hein","2019-11-19T20:09:24.942",45,{"$f":"COUNTIFS(Test,A417,Nimi,B417,Aeg,\">=\"&C417)","v":3}]
["Test02","Karin Saar","2019-11-20T22:15:31.154",62,{"$f":"COUNTIFS(Test,A418,Nimi,B418,Aeg,\">=\"&C418)","v":1}]
["Test01","Brita Kaljula","2019-11-20T14:13:47.808",80,{"$f":"COUNTIFS(Test,A419,Nimi,B419,Aeg,\">=\"&C419)","v":4}]
["Test03","Sander Kell","2019-11-22T21:53:22.691",60,{"$f":"COUNTIFS(Test,A420,Nimi,B420,Aeg,\">=\"&C420)","v":1}]
["Test02","Karin Saar","2019-11-06T11:09:18.574",51,{"$f":"COUNTIFS(Test,A421,Nimi,B421,Aeg,\">=\"&C421)","v":9}]
["Test03","Kristina Merila","2019-11-21T20:07:07.937",70,{"$f":"COUNTIFS(Test,A422,Nimi,B422,Aeg,\">=\"&C422)","v":3}]
["Test03","Joonas Haljas","2019-11-01T12:24:21.187",99,{"$f":"COUNTIFS(Test,A423,Nimi,B423,Aeg,\">=\"&C423)","v":9}]
["Test03","Katrin Laurits","2019-11-22T21:54:22.842",86,{"$f":"COUNTIFS(Test,A424,Nimi,B424,Aeg,\">=\"&C424)","v":2}]
["Test03","Rasmus Kroon","2019-11-22T21:42:48.449",27,{"$f":"COUNTIFS(Test,A425,Nimi,B425,Aeg,\">=\"&C425)","v":5}]
["Test04","Emili Loorits","2019-11-15T21:59:54.928",84,{"$f":"COUNTIFS(Test,A426,Nimi,B426,Aeg,\">=\"&C426)","v":5}]
["Test02","Alari Suur","2019-11-14T22:39:53.589",64,{"$f":"COUNTIFS(Test,A427,Nimi,B427,Aeg,\">=\"&C427)","v":4}]
["Test01","Hans Kukk","2019-11-13T10:22:18.402",32,{"$f":"COUNTIFS(Test,A428,Nimi,B428,Aeg,\">=\"&C428)","v":5}]
["Test04","Brita Kaljula","2019-11-18T20:04:31.965",54,{"$f":"COUNTIFS(Test,A429,Nimi,B429,Aeg,\">=\"&C429)","v":4}]
["Test01","Hans Kukk","2019-11-01T09:48:32.247",100,{"$f":"COUNTIFS(Test,A430,Nimi,B430,Aeg,\">=\"&C430)","v":9}]
["Test01","Anette Lepp","2019-11-26T16:36:37.655",60,{"$f":"COUNTIFS(Test,A431,Nimi,B431,Aeg,\">=\"&C431)","v":1}]
["Test01","Markus Niidas","2019-11-28T20:17:20.276",50,{"$f":"COUNTIFS(Test,A432,Nimi,B432,Aeg,\">=\"&C432)","v":1}]
["Test04","Kristina Merila","2019-11-29T23:29:49.100",20,{"$f":"COUNTIFS(Test,A433,Nimi,B433,Aeg,\">=\"&C433)","v":1}]
["Test04","Artur Piiri","2019-11-17T18:01:39.064",92,{"$f":"COUNTIFS(Test,A434,Nimi,B434,Aeg,\">=\"&C434)","v":3}]
["Test01","Diana Taal","2019-11-07T14:17:45.983",35,{"$f":"COUNTIFS(Test,A435,Nimi,B435,Aeg,\">=\"&C435)","v":5}]
["Test03","Hanna Laid","2019-11-02T22:49:33.783",71,{"$f":"COUNTIFS(Test,A436,Nimi,B436,Aeg,\">=\"&C436)","v":9}]
["Test02","Kristina Merila","2019-11-28T20:58:11.340",36,{"$f":"COUNTIFS(Test,A437,Nimi,B437,Aeg,\">=\"&C437)","v":2}]
["Test01","Erik Pärn","2019-11-05T11:25:02.448",61,{"$f":"COUNTIFS(Test,A438,Nimi,B438,Aeg,\">=\"&C438)","v":9}]
["Test03","Brita Kaljula","2019-11-02T16:35:37.027",43,{"$f":"COUNTIFS(Test,A439,Nimi,B439,Aeg,\">=\"&C439)","v":12}]
["Test03","Alari Suur","2019-11-22T08:50:27.050",84,{"$f":"COUNTIFS(Test,A440,Nimi,B440,Aeg,\">=\"&C440)","v":3}]
["Test04","Alari Suur","2019-11-01T20:22:22.236",43,{"$f":"COUNTIFS(Test,A441,Nimi,B441,Aeg,\">=\"&C441)","v":10}]
["Test04","Getlin Allas","2019-11-09T13:42:46.363",98,{"$f":"COUNTIFS(Test,A442,Nimi,B442,Aeg,\">=\"&C442)","v":5}]
["Test01","Erik Pärn","2019-11-06T19:16:11.199",76,{"$f":"COUNTIFS(Test,A443,Nimi,B443,Aeg,\">=\"&C443)","v":7}]
["Test04","Katrin Laurits","2019-11-19T17:11:37.357",97,{"$f":"COUNTIFS(Test,A444,Nimi,B444,Aeg,\">=\"&C444)","v":3}]
["Test02","Maarja Pihlak","2019-11-23T16:57:10.761",68,{"$f":"COUNTIFS(Test,A445,Nimi,B445,Aeg,\">=\"&C445)","v":1}]
["Test04","Emili Loorits","2019-11-07T20:55:59.140",49,{"$f":"COUNTIFS(Test,A446,Nimi,B446,Aeg,\">=\"&C446)","v":6}]
["Test03","Robert Lentso","2019-11-02T15:25:20.960",27,{"$f":"COUNTIFS(Test,A447,Nimi,B447,Aeg,\">=\"&C447)","v":14}]
["Test02","Brita Kaljula","2019-11-29T19:25:13.203",75,{"$f":"COUNTIFS(Test,A448,Nimi,B448,Aeg,\">=\"&C448)","v":1}]
["Test01","Anette Lepp","2019-11-04T21:47:13.005",54,{"$f":"COUNTIFS(Test,A449,Nimi,B449,Aeg,\">=\"&C449)","v":10}]
["Test04","Kristina Merila","2019-11-25T20:37:39.192",65,{"$f":"COUNTIFS(Test,A450,Nimi,B450,Aeg,\">=\"&C450)","v":4}]
["Test01","Karin Saar","2019-11-19T19:30:16.239",71,{"$f":"COUNTIFS(Test,A451,Nimi,B451,Aeg,\">=\"&C451)","v":5}]
["Test02","Paul Hein","2019-11-30T15:28:14.869",63,{"$f":"COUNTIFS(Test,A452,Nimi,B452,Aeg,\">=\"&C452)","v":1}]
["Test01","Erik Pärn","2019-11-28T17:25:55.298",34,{"$f":"COUNTIFS(Test,A453,Nimi,B453,Aeg,\">=\"&C453)","v":3}]
["Test02","Jaagup Kivi","2019-11-11T14:44:56.025",97,{"$f":"COUNTIFS(Test,A454,Nimi,B454,Aeg,\">=\"&C454)","v":3}]
["Test01","Karin Saar","2019-11-26T17:29:01.923",93,{"$f":"COUNTIFS(Test,A455,Nimi,B455,Aeg,\">=\"&C455)","v":1}]
["Test01","Carmen Sõrmus","2019-11-05T14:35:28.632",21,{"$f":"COUNTIFS(Test,A456,Nimi,B456,Aeg,\">=\"&C456)","v":8}]
["Test01","Rasmus Kroon","2019-11-22T17:52:00.137",68,{"$f":"COUNTIFS(Test,A457,Nimi,B457,Aeg,\">=\"&C457)","v":4}]
["Test02","Mihkel Kulp","2019-11-07T20:45:32.836",22,{"$f":"COUNTIFS(Test,A458,Nimi,B458,Aeg,\">=\"&C458)","v":8}]
["Test01","Maarja Pihlak","2019-11-09T22:54:58.729",93,{"$f":"COUNTIFS(Test,A459,Nimi,B459,Aeg,\">=\"&C459)","v":7}]
["Test03","Anna Koel","2019-11-09T11:57:42.460",49,{"$f":"COUNTIFS(Test,A460,Nimi,B460,Aeg,\">=\"&C460)","v":5}]
["Test03","Anna Koel","2019-11-26T10:43:39.655",29,{"$f":"COUNTIFS(Test,A461,Nimi,B461,Aeg,\">=\"&C461)","v":1}]
["Test02","Diana Taal","2019-11-05T12:18:08.313",71,{"$f":"COUNTIFS(Test,A462,Nimi,B462,Aeg,\">=\"&C462)","v":7}]
["Test04","Artur Piiri","2019-11-22T19:17:50.218",79,{"$f":"COUNTIFS(Test,A463,Nimi,B463,Aeg,\">=\"&C463)","v":2}]
["Test02","Maarja Pihlak","2019-11-15T19:34:58.393",97,{"$f":"COUNTIFS(Test,A464,Nimi,B464,Aeg,\">=\"&C464)","v":6}]
["Test02","Emili Loorits","2019-11-03T08:44:43.048",62,{"$f":"COUNTIFS(Test,A465,Nimi,B465,Aeg,\">=\"&C465)","v":9}]
["Test02","Joonas Haljas","2019-11-11T12:25:07.977",70,{"$f":"COUNTIFS(Test,A466,Nimi,B466,Aeg,\">=\"&C466)","v":9}]
["Test04","Viktoria Lumi","2019-11-27T16:43:11.469",52,{"$f":"COUNTIFS(Test,A467,Nimi,B467,Aeg,\">=\"&C467)","v":1}]
["Test01","Anette Lepp","2019-11-14T21:15:12.714",77,{"$f":"COUNTIFS(Test,A468,Nimi,B468,Aeg,\">=\"&C468)","v":3}]
["Test04","Tarvo Järv","2019-11-09T17:37:36.767",53,{"$f":"COUNTIFS(Test,A469,Nimi,B469,Aeg,\">=\"&C469)","v":7}]
["Test01","Paul Hein","2019-11-23T22:32:39.520",77,{"$f":"COUNTIFS(Test,A470,Nimi,B470,Aeg,\">=\"&C470)","v":2}]
["Test01","Diana Taal","2019-11-27T19:14:33.031",52,{"$f":"COUNTIFS(Test,A471,Nimi,B471,Aeg,\">=\"&C471)","v":1}]
["Test01","Reimo Kala","2019-11-02T16:08:25.189",43,{"$f":"COUNTIFS(Test,A472,Nimi,B472,Aeg,\">=\"&C472)","v":8}]
["Test04","Anna Koel","2019-11-08T20:42:32.487",97,{"$f":"COUNTIFS(Test,A473,Nimi,B473,Aeg,\">=\"&C473)","v":17}]
["Test02","Artur Piiri","2019-11-21T08:31:31.958",79,{"$f":"COUNTIFS(Test,A474,Nimi,B474,Aeg,\">=\"&C474)","v":2}]
["Test01","Mihkel Kulp","2019-11-27T14:40:31.455",23,{"$f":"COUNTIFS(Test,A475,Nimi,B475,Aeg,\">=\"&C475)","v":1}]
["Test04","Egert Vint","2019-11-16T09:16:15.845",59,{"$f":"COUNTIFS(Test,A476,Nimi,B476,Aeg,\">=\"&C476)","v":5}]
["Test03","Jana Kiisk","2019-11-04T22:26:54.803",74,{"$f":"COUNTIFS(Test,A477,Nimi,B477,Aeg,\">=\"&C477)","v":6}]
["Test02","Lauri Vahtra","2019-11-24T20:33:18.799",66,{"$f":"COUNTIFS(Test,A478,Nimi,B478,Aeg,\">=\"&C478)","v":4}]
["Test04","Artur Piiri","2019-11-08T13:49:55.195",73,{"$f":"COUNTIFS(Test,A479,Nimi,B479,Aeg,\">=\"&C479)","v":6}]
["Test03","Anette Lepp","2019-11-21T17:25:01.101",94,{"$f":"COUNTIFS(Test,A480,Nimi,B480,Aeg,\">=\"&C480)","v":4}]
["Test01","Anette Lepp","2019-11-03T18:38:18.069",30,{"$f":"COUNTIFS(Test,A481,Nimi,B481,Aeg,\">=\"&C481)","v":11}]
["Test04","Alari Suur","2019-11-11T23:21:13.805",93,{"$f":"COUNTIFS(Test,A482,Nimi,B482,Aeg,\">=\"&C482)","v":8}]
["Test04","Jaagup Kivi","2019-11-30T22:58:37.332",33,{"$f":"COUNTIFS(Test,A483,Nimi,B483,Aeg,\">=\"&C483)","v":1}]
["Test04","Kaspar Raude","2019-11-13T14:45:12.350",44,{"$f":"COUNTIFS(Test,A484,Nimi,B484,Aeg,\">=\"&C484)","v":3}]
["Test04","Anna Koel","2019-11-25T17:43:02.368",71,{"$f":"COUNTIFS(Test,A485,Nimi,B485,Aeg,\">=\"&C485)","v":7}]
["Test03","Joonas Haljas","2019-11-19T13:26:31.660",25,{"$f":"COUNTIFS(Test,A486,Nimi,B486,Aeg,\">=\"&C486)","v":5}]
["Test02","Jana Kiisk","2019-11-22T08:57:55.626",78,{"$f":"COUNTIFS(Test,A487,Nimi,B487,Aeg,\">=\"&C487)","v":4}]
["Test03","Viktoria Lumi","2019-11-03T19:53:23.056",97,{"$f":"COUNTIFS(Test,A488,Nimi,B488,Aeg,\">=\"&C488)","v":7}]
["Test02","Joonas Haljas","2019-11-03T10:15:12.848",72,{"$f":"COUNTIFS(Test,A489,Nimi,B489,Aeg,\">=\"&C489)","v":11}]
["Test01","Jana Kiisk","2019-11-22T12:12:23.626",68,{"$f":"COUNTIFS(Test,A490,Nimi,B490,Aeg,\">=\"&C490)","v":3}]
["Test02","Urmas Lõhmus","2019-11-17T16:18:58.040",89,{"$f":"COUNTIFS(Test,A491,Nimi,B491,Aeg,\">=\"&C491)","v":6}]
["Test01","Hans Kukk","2019-11-26T21:09:02.659",72,{"$f":"COUNTIFS(Test,A492,Nimi,B492,Aeg,\">=\"&C492)","v":1}]
["Test02","Anna Koel","2019-11-24T12:23:04.863",35,{"$f":"COUNTIFS(Test,A493,Nimi,B493,Aeg,\">=\"&C493)","v":3}]
["Test03","Karin Saar","2019-11-08T10:41:57.151",36,{"$f":"COUNTIFS(Test,A494,Nimi,B494,Aeg,\">=\"&C494)","v":7}]
["Test04","Rasmus Kroon","2019-11-04T17:00:18.513",56,{"$f":"COUNTIFS(Test,A495,Nimi,B495,Aeg,\">=\"&C495)","v":4}]
["Test04","Hanna Laid","2019-11-18T15:40:09.392",32,{"$f":"COUNTIFS(Test,A496,Nimi,B496,Aeg,\">=\"&C496)","v":5}]
["Test02","Erik Pärn","2019-11-30T19:01:20.389",23,{"$f":"COUNTIFS(Test,A497,Nimi,B497,Aeg,\">=\"&C497)","v":1}]
["Test03","Emili Loorits","2019-11-27T14:24:38.002",25,{"$f":"COUNTIFS(Test,A498,Nimi,B498,Aeg,\">=\"&C498)","v":2}]
["Test01","Alari Suur","2019-11-28T08:41:57.316",75,{"$f":"COUNTIFS(Test,A499,Nimi,B499,Aeg,\">=\"&C499)","v":2}]
["Test01","Joonas Haljas","2019-11-16T18:37:21.607",77,{"$f":"COUNTIFS(Test,A500,Nimi,B500,Aeg,\">=\"&C500)","v":7}]
["Test03","Hanna Laid","2019-11-04T22:46:27.439",27,{"$f":"COUNTIFS(Test,A501,Nimi,B501,Aeg,\">=\"&C501)","v":8}]
["Test02","Rasmus Kroon","2019-11-21T19:31:09.153",20,{"$f":"COUNTIFS(Test,A502,Nimi,B502,Aeg,\">=\"&C502)","v":4}]
["Test02","Carmen Sõrmus","2019-11-23T21:10:51.112",63,{"$f":"COUNTIFS(Test,A503,Nimi,B503,Aeg,\">=\"&C503)","v":3}]
["Test02","Armin Kaasik","2019-11-09T18:34:29.316",40,{"$f":"COUNTIFS(Test,A504,Nimi,B504,Aeg,\">=\"&C504)","v":9}]
["Test04","Urmas Lõhmus","2019-11-10T21:20:51.963",50,{"$f":"COUNTIFS(Test,A505,Nimi,B505,Aeg,\">=\"&C505)","v":6}]
["Test02","Urmas Lõhmus","2019-11-27T16:04:25.137",57,{"$f":"COUNTIFS(Test,A506,Nimi,B506,Aeg,\">=\"&C506)","v":2}]
["Test02","Getlin Allas","2019-11-07T23:46:53.537",48,{"$f":"COUNTIFS(Test,A507,Nimi,B507,Aeg,\">=\"&C507)","v":10}]
["Test03","Kristina Merila","2019-11-27T17:43:09.171",66,{"$f":"COUNTIFS(Test,A508,Nimi,B508,Aeg,\">=\"&C508)","v":1}]
["Test02","Urmas Lõhmus","2019-11-23T10:06:19.257",42,{"$f":"COUNTIFS(Test,A509,Nimi,B509,Aeg,\">=\"&C509)","v":4}]
["Test02","Sander Kell","2019-11-06T20:29:47.129",43,{"$f":"COUNTIFS(Test,A510,Nimi,B510,Aeg,\">=\"&C510)","v":8}]
["Test04","Erik Pärn","2019-11-22T13:27:00.369",70,{"$f":"COUNTIFS(Test,A511,Nimi,B511,Aeg,\">=\"&C511)","v":4}]
["Test01","Reimo Kala","2019-11-01T12:27:27.795",31,{"$f":"COUNTIFS(Test,A512,Nimi,B512,Aeg,\">=\"&C512)","v":9}]
["Test02","Martin Aavik","2019-11-05T11:05:28.145",89,{"$f":"COUNTIFS(Test,A513,Nimi,B513,Aeg,\">=\"&C513)","v":5}]
["Test03","Getlin Allas","2019-11-22T08:42:20.881",52,{"$f":"COUNTIFS(Test,A514,Nimi,B514,Aeg,\">=\"&C514)","v":2}]
["Test02","Kertu Heinsoo","2019-11-25T08:05:16.708",25,{"$f":"COUNTIFS(Test,A515,Nimi,B515,Aeg,\">=\"&C515)","v":3}]
["Test03","Paul Hein","2019-11-05T17:45:35.784",69,{"$f":"COUNTIFS(Test,A516,Nimi,B516,Aeg,\">=\"&C516)","v":8}]
["Test01","Hanna Laid","2019-11-21T09:28:46.214",47,{"$f":"COUNTIFS(Test,A517,Nimi,B517,Aeg,\">=\"&C517)","v":4}]
["Test03","Robert Lentso","2019-11-21T17:48:25.781",28,{"$f":"COUNTIFS(Test,A518,Nimi,B518,Aeg,\">=\"&C518)","v":6}]
["Test01","Robert Lentso","2019-11-16T22:54:42.548",76,{"$f":"COUNTIFS(Test,A519,Nimi,B519,Aeg,\">=\"&C519)","v":4}]
["Test01","Getlin Allas","2019-11-14T22:04:52.648",43,{"$f":"COUNTIFS(Test,A520,Nimi,B520,Aeg,\">=\"&C520)","v":7}]
["Test01","Carmen Sõrmus","2019-11-15T12:33:13.786",34,{"$f":"COUNTIFS(Test,A521,Nimi,B521,Aeg,\">=\"&C521)","v":4}]
["Test04","Viktoria Lumi","2019-11-07T22:08:34.056",89,{"$f":"COUNTIFS(Test,A522,Nimi,B522,Aeg,\">=\"&C522)","v":6}]
["Test03","Lauri Vahtra","2019-11-25T09:20:09.138",40,{"$f":"COUNTIFS(Test,A523,Nimi,B523,Aeg,\">=\"&C523)","v":3}]
["Test03","Anna Koel","2019-11-01T17:19:46.284",24,{"$f":"COUNTIFS(Test,A524,Nimi,B524,Aeg,\">=\"&C524)","v":6}]
["Test03","Robert Lentso","2019-11-14T18:34:00.526",44,{"$f":"COUNTIFS(Test,A525,Nimi,B525,Aeg,\">=\"&C525)","v":11}]
["Test01","Anna Koel","2019-11-07T09:04:00.897",66,{"$f":"COUNTIFS(Test,A526,Nimi,B526,Aeg,\">=\"&C526)","v":2}]
["Test04","Brita Kaljula","2019-11-25T19:04:50.423",48,{"$f":"COUNTIFS(Test,A527,Nimi,B527,Aeg,\">=\"&C527)","v":1}]
["Test01","Tarvo Järv","2019-11-30T09:53:45.761",79,{"$f":"COUNTIFS(Test,A528,Nimi,B528,Aeg,\">=\"&C528)","v":1}]
["Test04","Anna Koel","2019-11-29T16:37:13.696",73,{"$f":"COUNTIFS(Test,A529,Nimi,B529,Aeg,\">=\"&C529)","v":1}]
["Test04","Rasmus Kroon","2019-11-15T14:04:08.413",65,{"$f":"COUNTIFS(Test,A530,Nimi,B530,Aeg,\">=\"&C530)","v":1}]
["Test02","Maarja Pihlak","2019-11-06T16:21:18.234",81,{"$f":"COUNTIFS(Test,A531,Nimi,B531,Aeg,\">=\"&C531)","v":8}]
["Test03","Tarvo Järv","2019-11-08T13:17:20.622",77,{"$f":"COUNTIFS(Test,A532,Nimi,B532,Aeg,\">=\"&C532)","v":8}]
["Test03","Rasmus Kroon","2019-11-25T23:19:33.093",24,{"$f":"COUNTIFS(Test,A533,Nimi,B533,Aeg,\">=\"&C533)","v":2}]
["Test03","Viktoria Lumi","2019-11-29T10:59:39.045",58,{"$f":"COUNTIFS(Test,A534,Nimi,B534,Aeg,\">=\"&C534)","v":1}]
["Test03","Brita Kaljula","2019-11-27T14:17:52.945",30,{"$f":"COUNTIFS(Test,A535,Nimi,B535,Aeg,\">=\"&C535)","v":1}]
["Test04","Armin Kaasik","2019-11-13T08:39:00.862",29,{"$f":"COUNTIFS(Test,A536,Nimi,B536,Aeg,\">=\"&C536)","v":5}]
["Test01","Joonas Haljas","2019-11-27T19:28:31.576",92,{"$f":"COUNTIFS(Test,A537,Nimi,B537,Aeg,\">=\"&C537)","v":2}]
["Test03","Alari Suur","2019-11-13T21:55:32.555",88,{"$f":"COUNTIFS(Test,A538,Nimi,B538,Aeg,\">=\"&C538)","v":5}]
["Test04","Armin Kaasik","2019-11-29T21:56:11.757",49,{"$f":"COUNTIFS(Test,A539,Nimi,B539,Aeg,\">=\"&C539)","v":2}]
["Test03","Mihkel Kulp","2019-11-28T11:05:11.773",88,{"$f":"COUNTIFS(Test,A540,Nimi,B540,Aeg,\">=\"&C540)","v":1}]
["Test04","Mihkel Kulp","2019-11-11T18:01:15.874",26,{"$f":"COUNTIFS(Test,A541,Nimi,B541,Aeg,\">=\"&C541)","v":4}]
["Test01","Erik Pärn","2019-11-05T12:04:17.972",51,{"$f":"COUNTIFS(Test,A542,Nimi,B542,Aeg,\">=\"&C542)","v":8}]
["Test04","Maarja Pihlak","2019-11-08T09:59:53.986",48,{"$f":"COUNTIFS(Test,A543,Nimi,B543,Aeg,\">=\"&C543)","v":9}]
["Test03","Diana Taal","2019-11-09T13:49:32.999",45,{"$f":"COUNTIFS(Test,A544,Nimi,B544,Aeg,\">=\"&C544)","v":11}]
["Test01","Kaspar Raude","2019-11-23T20:10:11.519",64,{"$f":"COUNTIFS(Test,A545,Nimi,B545,Aeg,\">=\"&C545)","v":3}]
["Test02","Hans Kukk","2019-11-06T14:22:38.505",53,{"$f":"COUNTIFS(Test,A546,Nimi,B546,Aeg,\">=\"&C546)","v":6}]
["Test04","Maarja Pihlak","2019-11-08T16:07:28.825",85,{"$f":"COUNTIFS(Test,A547,Nimi,B547,Aeg,\">=\"&C547)","v":8}]
["Test02","Tarvo Järv","2019-11-22T10:52:42.796",41,{"$f":"COUNTIFS(Test,A548,Nimi,B548,Aeg,\">=\"&C548)","v":6}]
["Test02","Erik Pärn","2019-11-17T13:54:36.075",53,{"$f":"COUNTIFS(Test,A549,Nimi,B549,Aeg,\">=\"&C549)","v":7}]
["Test02","Urmas Lõhmus","2019-11-28T21:56:26.077",33,{"$f":"COUNTIFS(Test,A550,Nimi,B550,Aeg,\">=\"&C550)","v":1}]
["Test01","Hans Kukk","2019-11-14T14:05:57.327",43,{"$f":"COUNTIFS(Test,A551,Nimi,B551,Aeg,\">=\"&C551)","v":4}]
["Test01","Kaspar Raude","2019-11-02T22:30:50.662",29,{"$f":"COUNTIFS(Test,A552,Nimi,B552,Aeg,\">=\"&C552)","v":7}]
["Test03","Robert Lentso","2019-11-30T18:21:59.099",65,{"$f":"COUNTIFS(Test,A553,Nimi,B553,Aeg,\">=\"&C553)","v":2}]
["Test01","Martin Aavik","2019-11-17T20:51:50.480",23,{"$f":"COUNTIFS(Test,A554,Nimi,B554,Aeg,\">=\"&C554)","v":6}]
["Test03","Robert Lentso","2019-11-04T09:23:09.661",21,{"$f":"COUNTIFS(Test,A555,Nimi,B555,Aeg,\">=\"&C555)","v":13}]
["Test02","Reimo Kala","2019-11-20T10:48:34.877",62,{"$f":"COUNTIFS(Test,A556,Nimi,B556,Aeg,\">=\"&C556)","v":3}]
["Test03","Hanna Laid","2019-11-15T23:09:40.796",99,{"$f":"COUNTIFS(Test,A557,Nimi,B557,Aeg,\">=\"&C557)","v":2}]
["Test01","Karin Saar","2019-11-12T13:17:56.509",66,{"$f":"COUNTIFS(Test,A558,Nimi,B558,Aeg,\">=\"&C558)","v":6}]
["Test02","Emili Loorits","2019-11-18T21:04:26.935",87,{"$f":"COUNTIFS(Test,A559,Nimi,B559,Aeg,\">=\"&C559)","v":5}]
["Test01","Getlin Allas","2019-11-28T09:37:33.101",73,{"$f":"COUNTIFS(Test,A560,Nimi,B560,Aeg,\">=\"&C560)","v":1}]
["Test01","Markus Niidas","2019-11-20T20:01:55.249",43,{"$f":"COUNTIFS(Test,A561,Nimi,B561,Aeg,\">=\"&C561)","v":3}]
["Test04","Anna Koel","2019-11-06T19:48:42.276",28,{"$f":"COUNTIFS(Test,A562,Nimi,B562,Aeg,\">=\"&C562)","v":18}]
["Test02","Jana Kiisk","2019-11-29T23:14:35.358",37,{"$f":"COUNTIFS(Test,A563,Nimi,B563,Aeg,\">=\"&C563)","v":2}]
["Test04","Joonas Haljas","2019-11-21T18:40:43.186",59,{"$f":"COUNTIFS(Test,A564,Nimi,B564,Aeg,\">=\"&C564)","v":2}]
["Test04","Erik Pärn","2019-11-27T21:36:21.758",80,{"$f":"COUNTIFS(Test,A565,Nimi,B565,Aeg,\">=\"&C565)","v":1}]
["Test03","Markus Niidas","2019-11-27T14:34:47.261",26,{"$f":"COUNTIFS(Test,A566,Nimi,B566,Aeg,\">=\"&C566)","v":2}]
["Test03","Paul Hein","2019-11-22T14:12:50.404",50,{"$f":"COUNTIFS(Test,A567,Nimi,B567,Aeg,\">=\"&C567)","v":6}]
["Test04","Katrin Laurits","2019-11-16T15:16:28.041",91,{"$f":"COUNTIFS(Test,A568,Nimi,B568,Aeg,\">=\"&C568)","v":5}]
["Test01","Viktoria Lumi","2019-11-19T13:45:08.313",21,{"$f":"COUNTIFS(Test,A569,Nimi,B569,Aeg,\">=\"&C569)","v":2}]
["Test04","Kaspar Raude","2019-11-05T13:17:43.255",89,{"$f":"COUNTIFS(Test,A570,Nimi,B570,Aeg,\">=\"&C570)","v":7}]
["Test02","Joonas Haljas","2019-11-25T19:34:07.771",20,{"$f":"COUNTIFS(Test,A571,Nimi,B571,Aeg,\">=\"&C571)","v":3}]
["Test04","Kertu Heinsoo","2019-11-26T11:20:50.179",82,{"$f":"COUNTIFS(Test,A572,Nimi,B572,Aeg,\">=\"&C572)","v":1}]
["Test04","Jaagup Kivi","2019-11-10T17:27:18.186",58,{"$f":"COUNTIFS(Test,A573,Nimi,B573,Aeg,\">=\"&C573)","v":9}]
["Test03","Karin Saar","2019-11-08T23:45:43.693",96,{"$f":"COUNTIFS(Test,A574,Nimi,B574,Aeg,\">=\"&C574)","v":6}]
["Test03","Katrin Laurits","2019-11-12T18:19:24.708",83,{"$f":"COUNTIFS(Test,A575,Nimi,B575,Aeg,\">=\"&C575)","v":6}]
["Test02","Karin Saar","2019-11-02T09:42:46.239",80,{"$f":"COUNTIFS(Test,A576,Nimi,B576,Aeg,\">=\"&C576)","v":12}]
["Test03","Jana Kiisk","2019-11-22T18:21:36.425",90,{"$f":"COUNTIFS(Test,A577,Nimi,B577,Aeg,\">=\"&C577)","v":2}]
["Test02","Kristina Merila","2019-11-11T22:12:46.247",99,{"$f":"COUNTIFS(Test,A578,Nimi,B578,Aeg,\">=\"&C578)","v":10}]
["Test02","Kristina Merila","2019-11-16T11:15:44.007",53,{"$f":"COUNTIFS(Test,A579,Nimi,B579,Aeg,\">=\"&C579)","v":5}]
["Test02","Tarvo Järv","2019-11-29T13:10:55.285",45,{"$f":"COUNTIFS(Test,A580,Nimi,B580,Aeg,\">=\"&C580)","v":1}]
["Test03","Erik Pärn","2019-11-11T14:35:40.891",36,{"$f":"COUNTIFS(Test,A581,Nimi,B581,Aeg,\">=\"&C581)","v":8}]
["Test03","Egert Vint","2019-11-15T13:28:58.681",77,{"$f":"COUNTIFS(Test,A582,Nimi,B582,Aeg,\">=\"&C582)","v":5}]
["Test03","Erik Pärn","2019-11-12T15:02:48.164",35,{"$f":"COUNTIFS(Test,A583,Nimi,B583,Aeg,\">=\"&C583)","v":7}]
["Test04","Rasmus Kroon","2019-11-01T19:59:00.935",61,{"$f":"COUNTIFS(Test,A584,Nimi,B584,Aeg,\">=\"&C584)","v":5}]
["Test01","Erik Pärn","2019-11-28T22:32:35.575",93,{"$f":"COUNTIFS(Test,A585,Nimi,B585,Aeg,\">=\"&C585)","v":2}]
["Test02","Jana Kiisk","2019-11-11T09:22:03.927",91,{"$f":"COUNTIFS(Test,A586,Nimi,B586,Aeg,\">=\"&C586)","v":8}]
["Test02","Armin Kaasik","2019-11-10T18:42:49.117",79,{"$f":"COUNTIFS(Test,A587,Nimi,B587,Aeg,\">=\"&C587)","v":8}]
["Test04","Maarja Pihlak","2019-11-04T18:47:30.092",69,{"$f":"COUNTIFS(Test,A588,Nimi,B588,Aeg,\">=\"&C588)","v":11}]
["Test03","Kertu Heinsoo","2019-11-08T18:29:00.304",40,{"$f":"COUNTIFS(Test,A589,Nimi,B589,Aeg,\">=\"&C589)","v":12}]
["Test02","Erik Pärn","2019-11-16T14:46:00.543",65,{"$f":"COUNTIFS(Test,A590,Nimi,B590,Aeg,\">=\"&C590)","v":9}]
["Test04","Hanna Laid","2019-11-25T11:57:31.304",22,{"$f":"COUNTIFS(Test,A591,Nimi,B591,Aeg,\">=\"&C591)","v":2}]
["Test01","Armin Kaasik","2019-11-02T15:25:54.820",95,{"$f":"COUNTIFS(Test,A592,Nimi,B592,Aeg,\">=\"&C592)","v":7}]
["Test01","Mihkel Kulp","2019-11-02T23:52:50.952",63,{"$f":"COUNTIFS(Test,A593,Nimi,B593,Aeg,\">=\"&C593)","v":6}]
["Test01","Hanna Laid","2019-11-12T19:16:46.304",38,{"$f":"COUNTIFS(Test,A594,Nimi,B594,Aeg,\">=\"&C594)","v":8}]
["Test02","Reimo Kala","2019-11-02T16:32:45.741",31,{"$f":"COUNTIFS(Test,A595,Nimi,B595,Aeg,\">=\"&C595)","v":6}]
["Test02","Markus Niidas","2019-11-05T23:28:47.201",89,{"$f":"COUNTIFS(Test,A596,Nimi,B596,Aeg,\">=\"&C596)","v":8}]
["Test02","Robert Lentso","2019-11-16T15:28:44.172",56,{"$f":"COUNTIFS(Test,A597,Nimi,B597,Aeg,\">=\"&C597)","v":6}]
["Test02","Jana Kiisk","2019-11-06T18:57:38.549",27,{"$f":"COUNTIFS(Test,A598,Nimi,B598,Aeg,\">=\"&C598)","v":9}]
["Test02","Lauri Vahtra","2019-11-19T12:53:02.033",77,{"$f":"COUNTIFS(Test,A599,Nimi,B599,Aeg,\">=\"&C599)","v":5}]
["Test04","Martin Aavik","2019-11-04T22:01:00.351",46,{"$f":"COUNTIFS(Test,A600,Nimi,B600,Aeg,\">=\"&C600)","v":8}]
["Test04","Egert Vint","2019-11-18T17:16:30.616",24,{"$f":"COUNTIFS(Test,A601,Nimi,B601,Aeg,\">=\"&C601)","v":3}]
["Test04","Joonas Haljas","2019-11-17T20:56:37.670",70,{"$f":"COUNTIFS(Test,A602,Nimi,B602,Aeg,\">=\"&C602)","v":4}]
["Test04","Alari Suur","2019-11-22T19:29:56.273",50,{"$f":"COUNTIFS(Test,A603,Nimi,B603,Aeg,\">=\"&C603)","v":4}]
["Test03","Robert Lentso","2019-11-23T10:31:06.255",49,{"$f":"COUNTIFS(Test,A604,Nimi,B604,Aeg,\">=\"&C604)","v":5}]
["Test02","Erik Pärn","2019-11-02T11:30:18.883",41,{"$f":"COUNTIFS(Test,A605,Nimi,B605,Aeg,\">=\"&C605)","v":14}]
["Test03","Alari Suur","2019-11-08T21:04:14.859",40,{"$f":"COUNTIFS(Test,A606,Nimi,B606,Aeg,\">=\"&C606)","v":6}]
["Test04","Armin Kaasik","2019-11-30T19:09:40.160",23,{"$f":"COUNTIFS(Test,A607,Nimi,B607,Aeg,\">=\"&C607)","v":1}]
["Test03","Markus Niidas","2019-11-17T22:49:55.072",79,{"$f":"COUNTIFS(Test,A608,Nimi,B608,Aeg,\">=\"&C608)","v":3}]
["Test01","Rasmus Kroon","2019-11-17T09:17:25.189",69,{"$f":"COUNTIFS(Test,A609,Nimi,B609,Aeg,\">=\"&C609)","v":8}]
["Test01","Alari Suur","2019-11-07T14:09:13.834",96,{"$f":"COUNTIFS(Test,A610,Nimi,B610,Aeg,\">=\"&C610)","v":10}]
["Test03","Diana Taal","2019-11-11T15:24:34.719",49,{"$f":"COUNTIFS(Test,A611,Nimi,B611,Aeg,\">=\"&C611)","v":10}]
["Test03","Hanna Laid","2019-11-06T17:46:39.337",74,{"$f":"COUNTIFS(Test,A612,Nimi,B612,Aeg,\">=\"&C612)","v":7}]
["Test04","Hanna Laid","2019-11-26T08:17:47.076",69,{"$f":"COUNTIFS(Test,A613,Nimi,B613,Aeg,\">=\"&C613)","v":1}]
["Test01","Maarja Pihlak","2019-11-23T15:04:27.548",88,{"$f":"COUNTIFS(Test,A614,Nimi,B614,Aeg,\">=\"&C614)","v":3}]
["Test04","Katrin Laurits","2019-11-23T09:47:17.405",29,{"$f":"COUNTIFS(Test,A615,Nimi,B615,Aeg,\">=\"&C615)","v":1}]
["Test02","Anna Koel","2019-11-26T14:16:51.847",83,{"$f":"COUNTIFS(Test,A616,Nimi,B616,Aeg,\">=\"&C616)","v":2}]
["Test04","Kertu Heinsoo","2019-11-07T15:33:43.551",91,{"$f":"COUNTIFS(Test,A617,Nimi,B617,Aeg,\">=\"&C617)","v":6}]
["Test04","Diana Taal","2019-11-20T14:42:53.832",69,{"$f":"COUNTIFS(Test,A618,Nimi,B618,Aeg,\">=\"&C618)","v":3}]
["Test03","Rasmus Kroon","2019-11-04T09:26:08.444",48,{"$f":"COUNTIFS(Test,A619,Nimi,B619,Aeg,\">=\"&C619)","v":8}]
["Test03","Lauri Vahtra","2019-11-23T14:48:03.616",95,{"$f":"COUNTIFS(Test,A620,Nimi,B620,Aeg,\">=\"&C620)","v":4}]
["Test03","Artur Piiri","2019-11-02T16:36:44.592",59,{"$f":"COUNTIFS(Test,A621,Nimi,B621,Aeg,\">=\"&C621)","v":12}]
["Test03","Anette Lepp","2019-11-08T14:57:39.366",96,{"$f":"COUNTIFS(Test,A622,Nimi,B622,Aeg,\">=\"&C622)","v":10}]
["Test02","Urmas Lõhmus","2019-11-05T19:25:58.069",52,{"$f":"COUNTIFS(Test,A623,Nimi,B623,Aeg,\">=\"&C623)","v":9}]
["Test02","Brita Kaljula","2019-11-04T11:43:01.871",60,{"$f":"COUNTIFS(Test,A624,Nimi,B624,Aeg,\">=\"&C624)","v":9}]
["Test03","Anna Koel","2019-11-10T15:22:51.404",35,{"$f":"COUNTIFS(Test,A625,Nimi,B625,Aeg,\">=\"&C625)","v":3}]
["Test04","Kristina Merila","2019-11-19T16:52:40.359",37,{"$f":"COUNTIFS(Test,A626,Nimi,B626,Aeg,\">=\"&C626)","v":7}]
["Test01","Rasmus Kroon","2019-11-03T16:05:36.591",50,{"$f":"COUNTIFS(Test,A627,Nimi,B627,Aeg,\">=\"&C627)","v":10}]
["Test03","Kristina Merila","2019-11-14T10:00:46.655",94,{"$f":"COUNTIFS(Test,A628,Nimi,B628,Aeg,\">=\"&C628)","v":7}]
["Test03","Jaagup Kivi","2019-11-26T12:33:55.039",72,{"$f":"COUNTIFS(Test,A629,Nimi,B629,Aeg,\">=\"&C629)","v":2}]
["Test04","Hans Kukk","2019-11-14T13:37:32.464",58,{"$f":"COUNTIFS(Test,A630,Nimi,B630,Aeg,\">=\"&C630)","v":6}]
["Test04","Mihkel Kulp","2019-11-14T15:38:26.898",95,{"$f":"COUNTIFS(Test,A631,Nimi,B631,Aeg,\">=\"&C631)","v":3}]
["Test04","Maarja Pihlak","2019-11-25T12:29:50.839",68,{"$f":"COUNTIFS(Test,A632,Nimi,B632,Aeg,\">=\"&C632)","v":2}]
["Test02","Rasmus Kroon","2019-11-01T11:59:12.279",56,{"$f":"COUNTIFS(Test,A633,Nimi,B633,Aeg,\">=\"&C633)","v":9}]
["Test01","Egert Vint","2019-11-27T22:24:06.868",69,{"$f":"COUNTIFS(Test,A634,Nimi,B634,Aeg,\">=\"&C634)","v":2}]
["Test03","Tarvo Järv","2019-11-16T09:21:34.888",61,{"$f":"COUNTIFS(Test,A635,Nimi,B635,Aeg,\">=\"&C635)","v":5}]
["Test04","Tarvo Järv","2019-11-26T19:50:06.709",99,{"$f":"COUNTIFS(Test,A636,Nimi,B636,Aeg,\">=\"&C636)","v":2}]
["Test04","Hans Kukk","2019-11-28T09:24:04.633",37,{"$f":"COUNTIFS(Test,A637,Nimi,B637,Aeg,\">=\"&C637)","v":2}]
["Test03","Hans Kukk","2019-11-07T08:21:09.827",61,{"$f":"COUNTIFS(Test,A638,Nimi,B638,Aeg,\">=\"&C638)","v":10}]
["Test02","Brita Kaljula","2019-11-12T21:03:03.206",92,{"$f":"COUNTIFS(Test,A639,Nimi,B639,Aeg,\">=\"&C639)","v":4}]
["Test02","Kertu Heinsoo","2019-11-28T08:27:16.483",82,{"$f":"COUNTIFS(Test,A640,Nimi,B640,Aeg,\">=\"&C640)","v":1}]
["Test02","Hans Kukk","2019-11-17T14:07:51.836",97,{"$f":"COUNTIFS(Test,A641,Nimi,B641,Aeg,\">=\"&C641)","v":4}]
["Test04","Viktoria Lumi","2019-11-09T08:51:54.123",54,{"$f":"COUNTIFS(Test,A642,Nimi,B642,Aeg,\">=\"&C642)","v":5}]
["Test04","Artur Piiri","2019-11-26T08:01:57.760",93,{"$f":"COUNTIFS(Test,A643,Nimi,B643,Aeg,\">=\"&C643)","v":1}]
["Test02","Armin Kaasik","2019-11-22T21:23:40.752",44,{"$f":"COUNTIFS(Test,A644,Nimi,B644,Aeg,\">=\"&C644)","v":4}]
["Test01","Katrin Laurits","2019-11-08T20:57:53.914",98,{"$f":"COUNTIFS(Test,A645,Nimi,B645,Aeg,\">=\"&C645)","v":4}]
["Test02","Artur Piiri","2019-11-23T12:05:42.783",77,{"$f":"COUNTIFS(Test,A646,Nimi,B646,Aeg,\">=\"&C646)","v":1}]
["Test01","Carmen Sõrmus","2019-11-24T18:59:39.437",35,{"$f":"COUNTIFS(Test,A647,Nimi,B647,Aeg,\">=\"&C647)","v":2}]
["Test04","Joonas Haljas","2019-11-14T20:05:20.932",86,{"$f":"COUNTIFS(Test,A648,Nimi,B648,Aeg,\">=\"&C648)","v":5}]
["Test03","Mihkel Kulp","2019-11-22T20:04:07.571",79,{"$f":"COUNTIFS(Test,A649,Nimi,B649,Aeg,\">=\"&C649)","v":3}]
["Test01","Joonas Haljas","2019-11-02T15:25:20.620",29,{"$f":"COUNTIFS(Test,A650,Nimi,B650,Aeg,\">=\"&C650)","v":12}]
["Test04","Anna Koel","2019-11-13T09:08:53.468",39,{"$f":"COUNTIFS(Test,A651,Nimi,B651,Aeg,\">=\"&C651)","v":12}]
["Test01","Mihkel Kulp","2019-11-24T11:02:03.794",88,{"$f":"COUNTIFS(Test,A652,Nimi,B652,Aeg,\">=\"&C652)","v":4}]
["Test03","Artur Piiri","2019-11-22T16:46:45.572",99,{"$f":"COUNTIFS(Test,A653,Nimi,B653,Aeg,\">=\"&C653)","v":2}]
["Test02","Brita Kaljula","2019-11-07T23:43:17.721",54,{"$f":"COUNTIFS(Test,A654,Nimi,B654,Aeg,\">=\"&C654)","v":7}]
["Test04","Hanna Laid","2019-11-09T11:25:54.355",99,{"$f":"COUNTIFS(Test,A655,Nimi,B655,Aeg,\">=\"&C655)","v":12}]
["Test01","Reimo Kala","2019-11-09T21:14:20.045",24,{"$f":"COUNTIFS(Test,A656,Nimi,B656,Aeg,\">=\"&C656)","v":6}]
["Test02","Mihkel Kulp","2019-11-07T12:59:39.662",25,{"$f":"COUNTIFS(Test,A657,Nimi,B657,Aeg,\">=\"&C657)","v":9}]
["Test03","Lauri Vahtra","2019-11-11T21:33:38.338",99,{"$f":"COUNTIFS(Test,A658,Nimi,B658,Aeg,\">=\"&C658)","v":6}]
["Test02","Robert Lentso","2019-11-01T09:58:13.164",99,{"$f":"COUNTIFS(Test,A659,Nimi,B659,Aeg,\">=\"&C659)","v":10}]
["Test03","Reimo Kala","2019-11-04T10:29:30.924",62,{"$f":"COUNTIFS(Test,A660,Nimi,B660,Aeg,\">=\"&C660)","v":5}]
["Test04","Getlin Allas","2019-11-05T10:58:48.860",41,{"$f":"COUNTIFS(Test,A661,Nimi,B661,Aeg,\">=\"&C661)","v":6}]
["Test01","Brita Kaljula","2019-11-13T19:46:23.424",23,{"$f":"COUNTIFS(Test,A662,Nimi,B662,Aeg,\">=\"&C662)","v":5}]
["Test02","Markus Niidas","2019-11-04T16:07:34.854",75,{"$f":"COUNTIFS(Test,A663,Nimi,B663,Aeg,\">=\"&C663)","v":9}]
["Test04","Katrin Laurits","2019-11-19T12:07:13.937",79,{"$f":"COUNTIFS(Test,A664,Nimi,B664,Aeg,\">=\"&C664)","v":4}]
["Test02","Hans Kukk","2019-11-06T09:11:44.022",40,{"$f":"COUNTIFS(Test,A665,Nimi,B665,Aeg,\">=\"&C665)","v":7}]
["Test03","Joonas Haljas","2019-11-15T12:14:42.467",78,{"$f":"COUNTIFS(Test,A666,Nimi,B666,Aeg,\">=\"&C666)","v":7}]
["Test04","Anna Koel","2019-11-09T11:40:34.327",97,{"$f":"COUNTIFS(Test,A667,Nimi,B667,Aeg,\">=\"&C667)","v":16}]
["Test04","Erik Pärn","2019-11-26T16:55:01.071",82,{"$f":"COUNTIFS(Test,A668,Nimi,B668,Aeg,\">=\"&C668)","v":3}]
["Test01","Rasmus Kroon","2019-11-17T22:25:10.179",67,{"$f":"COUNTIFS(Test,A669,Nimi,B669,Aeg,\">=\"&C669)","v":7}]
["Test02","Tarvo Järv","2019-11-24T16:05:24.021",35,{"$f":"COUNTIFS(Test,A670,Nimi,B670,Aeg,\">=\"&C670)","v":5}]
["Test03","Urmas Lõhmus","2019-11-22T16:02:28.689",39,{"$f":"COUNTIFS(Test,A671,Nimi,B671,Aeg,\">=\"&C671)","v":4}]
["Test02","Hans Kukk","2019-11-10T17:10:59.741",91,{"$f":"COUNTIFS(Test,A672,Nimi,B672,Aeg,\">=\"&C672)","v":5}]
["Test01","Getlin Allas","2019-11-18T11:43:08.147",87,{"$f":"COUNTIFS(Test,A673,Nimi,B673,Aeg,\">=\"&C673)","v":3}]
["Test04","Urmas Lõhmus","2019-11-03T14:37:32.826",41,{"$f":"COUNTIFS(Test,A674,Nimi,B674,Aeg,\">=\"&C674)","v":8}]
["Test02","Lauri Vahtra","2019-11-25T20:37:19.919",83,{"$f":"COUNTIFS(Test,A675,Nimi,B675,Aeg,\">=\"&C675)","v":2}]
["Test03","Martin Aavik","2019-11-21T14:49:24.704",98,{"$f":"COUNTIFS(Test,A676,Nimi,B676,Aeg,\">=\"&C676)","v":5}]
["Test01","Urmas Lõhmus","2019-11-07T09:19:47.186",73,{"$f":"COUNTIFS(Test,A677,Nimi,B677,Aeg,\">=\"&C677)","v":6}]
["Test03","Diana Taal","2019-11-28T22:23:09.497",45,{"$f":"COUNTIFS(Test,A678,Nimi,B678,Aeg,\">=\"&C678)","v":2}]
["Test01","Martin Aavik","2019-11-28T20:58:37.101",32,{"$f":"COUNTIFS(Test,A679,Nimi,B679,Aeg,\">=\"&C679)","v":2}]
["Test03","Tarvo Järv","2019-11-05T10:48:19.999",22,{"$f":"COUNTIFS(Test,A680,Nimi,B680,Aeg,\">=\"&C680)","v":10}]
["Test04","Getlin Allas","2019-11-03T09:47:01.183",58,{"$f":"COUNTIFS(Test,A681,Nimi,B681,Aeg,\">=\"&C681)","v":8}]
["Test04","Hanna Laid","2019-11-16T09:26:58.995",52,{"$f":"COUNTIFS(Test,A682,Nimi,B682,Aeg,\">=\"&C682)","v":7}]
["Test01","Getlin Allas","2019-11-15T08:45:52.623",59,{"$f":"COUNTIFS(Test,A683,Nimi,B683,Aeg,\">=\"&C683)","v":6}]
["Test03","Armin Kaasik","2019-11-07T12:30:18.980",99,{"$f":"COUNTIFS(Test,A684,Nimi,B684,Aeg,\">=\"&C684)","v":6}]
["Test01","Jana Kiisk","2019-11-16T23:34:20.323",79,{"$f":"COUNTIFS(Test,A685,Nimi,B685,Aeg,\">=\"&C685)","v":5}]
["Test04","Kertu Heinsoo","2019-11-12T13:00:10.935",28,{"$f":"COUNTIFS(Test,A686,Nimi,B686,Aeg,\">=\"&C686)","v":4}]
["Test04","Markus Niidas","2019-11-07T16:59:16.393",70,{"$f":"COUNTIFS(Test,A687,Nimi,B687,Aeg,\">=\"&C687)","v":4}]
["Test04","Jaagup Kivi","2019-11-13T18:24:16.764",93,{"$f":"COUNTIFS(Test,A688,Nimi,B688,Aeg,\">=\"&C688)","v":8}]
["Test03","Hans Kukk","2019-11-23T18:16:46",95,{"$f":"COUNTIFS(Test,A689,Nimi,B689,Aeg,\">=\"&C689)","v":5}]
["Test03","Emili Loorits","2019-11-24T22:48:49.352",47,{"$f":"COUNTIFS(Test,A690,Nimi,B690,Aeg,\">=\"&C690)","v":3}]
["Test02","Lauri Vahtra","2019-11-08T22:40:55.958",70,{"$f":"COUNTIFS(Test,A691,Nimi,B691,Aeg,\">=\"&C691)","v":8}]
["Test03","Hans Kukk","2019-11-20T18:19:51.258",100,{"$f":"COUNTIFS(Test,A692,Nimi,B692,Aeg,\">=\"&C692)","v":6}]
["Test03","Brita Kaljula","2019-11-15T08:49:31.736",75,{"$f":"COUNTIFS(Test,A693,Nimi,B693,Aeg,\">=\"&C693)","v":7}]
["Test01","Reimo Kala","2019-11-11T16:19:34.690",70,{"$f":"COUNTIFS(Test,A694,Nimi,B694,Aeg,\">=\"&C694)","v":5}]
["Test02","Tarvo Järv","2019-11-06T08:19:46.755",28,{"$f":"COUNTIFS(Test,A695,Nimi,B695,Aeg,\">=\"&C695)","v":11}]
["Test01","Egert Vint","2019-11-13T11:03:55.007",84,{"$f":"COUNTIFS(Test,A696,Nimi,B696,Aeg,\">=\"&C696)","v":5}]
["Test03","Emili Loorits","2019-11-13T13:31:22.155",82,{"$f":"COUNTIFS(Test,A697,Nimi,B697,Aeg,\">=\"&C697)","v":4}]
["Test03","Diana Taal","2019-11-14T15:54:22.298",83,{"$f":"COUNTIFS(Test,A698,Nimi,B698,Aeg,\">=\"&C698)","v":9}]
["Test04","Markus Niidas","2019-11-28T23:01:38.579",59,{"$f":"COUNTIFS(Test,A699,Nimi,B699,Aeg,\">=\"&C699)","v":1}]
["Test04","Karin Saar","2019-11-21T16:45:45.644",24,{"$f":"COUNTIFS(Test,A700,Nimi,B700,Aeg,\">=\"&C700)","v":2}]
["Test01","Robert Lentso","2019-11-13T18:10:42.621",66,{"$f":"COUNTIFS(Test,A701,Nimi,B701,Aeg,\">=\"&C701)","v":5}]
["Test04","Sander Kell","2019-11-05T23:21:57.300",83,{"$f":"COUNTIFS(Test,A702,Nimi,B702,Aeg,\">=\"&C702)","v":5}]
["Test01","Alari Suur","2019-11-10T15:20:14.634",30,{"$f":"COUNTIFS(Test,A703,Nimi,B703,Aeg,\">=\"&C703)","v":8}]
["Test03","Martin Aavik","2019-11-30T13:04:32.313",64,{"$f":"COUNTIFS(Test,A704,Nimi,B704,Aeg,\">=\"&C704)","v":2}]
["Test03","Robert Lentso","2019-11-20T15:42:01.063",36,{"$f":"COUNTIFS(Test,A705,Nimi,B705,Aeg,\">=\"&C705)","v":7}]
["Test02","Getlin Allas","2019-11-04T23:29:41.217",37,{"$f":"COUNTIFS(Test,A706,Nimi,B706,Aeg,\">=\"&C706)","v":11}]
["Test03","Urmas Lõhmus","2019-11-12T16:39:47.906",99,{"$f":"COUNTIFS(Test,A707,Nimi,B707,Aeg,\">=\"&C707)","v":5}]
["Test01","Joonas Haljas","2019-11-21T14:14:43.850",89,{"$f":"COUNTIFS(Test,A708,Nimi,B708,Aeg,\">=\"&C708)","v":5}]
["Test03","Maarja Pihlak","2019-11-11T22:24:54.917",61,{"$f":"COUNTIFS(Test,A709,Nimi,B709,Aeg,\">=\"&C709)","v":4}]
["Test02","Sander Kell","2019-11-22T18:36:14.947",55,{"$f":"COUNTIFS(Test,A710,Nimi,B710,Aeg,\">=\"&C710)","v":5}]
["Test04","Martin Aavik","2019-11-02T20:37:48.463",34,{"$f":"COUNTIFS(Test,A711,Nimi,B711,Aeg,\">=\"&C711)","v":9}]
["Test02","Kaspar Raude","2019-11-01T09:34:02.595",89,{"$f":"COUNTIFS(Test,A712,Nimi,B712,Aeg,\">=\"&C712)","v":3}]
["Test03","Artur Piiri","2019-11-20T15:54:33.906",47,{"$f":"COUNTIFS(Test,A713,Nimi,B713,Aeg,\">=\"&C713)","v":4}]
["Test04","Reimo Kala","2019-11-19T14:03:49.307",58,{"$f":"COUNTIFS(Test,A714,Nimi,B714,Aeg,\">=\"&C714)","v":3}]
["Test03","Artur Piiri","2019-11-10T13:26:01.217",31,{"$f":"COUNTIFS(Test,A715,Nimi,B715,Aeg,\">=\"&C715)","v":10}]
["Test04","Armin Kaasik","2019-11-11T19:32:36.323",56,{"$f":"COUNTIFS(Test,A716,Nimi,B716,Aeg,\">=\"&C716)","v":6}]
["Test02","Viktoria Lumi","2019-11-07T21:25:20.001",26,{"$f":"COUNTIFS(Test,A717,Nimi,B717,Aeg,\">=\"&C717)","v":9}]
["Test02","Sander Kell","2019-11-26T21:58:25.736",38,{"$f":"COUNTIFS(Test,A718,Nimi,B718,Aeg,\">=\"&C718)","v":3}]
["Test02","Tarvo Järv","2019-11-03T15:42:20.303",65,{"$f":"COUNTIFS(Test,A719,Nimi,B719,Aeg,\">=\"&C719)","v":13}]
["Test04","Lauri Vahtra","2019-11-12T23:17:28.263",97,{"$f":"COUNTIFS(Test,A720,Nimi,B720,Aeg,\">=\"&C720)","v":5}]
["Test02","Mihkel Kulp","2019-11-16T21:24:41.768",76,{"$f":"COUNTIFS(Test,A721,Nimi,B721,Aeg,\">=\"&C721)","v":7}]
["Test02","Anette Lepp","2019-11-12T23:27:15.321",44,{"$f":"COUNTIFS(Test,A722,Nimi,B722,Aeg,\">=\"&C722)","v":4}]
["Test03","Mihkel Kulp","2019-11-01T14:23:06.680",86,{"$f":"COUNTIFS(Test,A723,Nimi,B723,Aeg,\">=\"&C723)","v":8}]
["Test04","Getlin Allas","2019-11-09T21:07:43.697",50,{"$f":"COUNTIFS(Test,A724,Nimi,B724,Aeg,\">=\"&C724)","v":4}]
["Test01","Jaagup Kivi","2019-11-11T13:50:53.936",74,{"$f":"COUNTIFS(Test,A725,Nimi,B725,Aeg,\">=\"&C725)","v":5}]
["Test03","Anette Lepp","2019-11-14T21:28:05.061",33,{"$f":"COUNTIFS(Test,A726,Nimi,B726,Aeg,\">=\"&C726)","v":7}]
["Test01","Jaagup Kivi","2019-11-17T16:45:57.543",98,{"$f":"COUNTIFS(Test,A727,Nimi,B727,Aeg,\">=\"&C727)","v":3}]
["Test01","Paul Hein","2019-11-03T16:34:11.686",97,{"$f":"COUNTIFS(Test,A728,Nimi,B728,Aeg,\">=\"&C728)","v":5}]
["Test03","Markus Niidas","2019-11-30T17:00:45.158",66,{"$f":"COUNTIFS(Test,A729,Nimi,B729,Aeg,\">=\"&C729)","v":1}]
["Test01","Armin Kaasik","2019-11-25T22:07:02.781",54,{"$f":"COUNTIFS(Test,A730,Nimi,B730,Aeg,\">=\"&C730)","v":2}]
["Test03","Mihkel Kulp","2019-11-14T14:31:37.811",54,{"$f":"COUNTIFS(Test,A731,Nimi,B731,Aeg,\">=\"&C731)","v":7}]
["Test03","Jana Kiisk","2019-11-08T20:18:45.693",40,{"$f":"COUNTIFS(Test,A732,Nimi,B732,Aeg,\">=\"&C732)","v":5}]
["Test04","Lauri Vahtra","2019-11-29T18:51:16.366",27,{"$f":"COUNTIFS(Test,A733,Nimi,B733,Aeg,\">=\"&C733)","v":1}]
["Test03","Alari Suur","2019-11-06T08:24:05.227",44,{"$f":"COUNTIFS(Test,A734,Nimi,B734,Aeg,\">=\"&C734)","v":7}]
["Test04","Maarja Pihlak","2019-11-16T13:59:26.529",84,{"$f":"COUNTIFS(Test,A735,Nimi,B735,Aeg,\">=\"&C735)","v":4}]
["Test03","Brita Kaljula","2019-11-24T11:05:40.972",97,{"$f":"COUNTIFS(Test,A736,Nimi,B736,Aeg,\">=\"&C736)","v":3}]
["Test02","Rasmus Kroon","2019-11-25T19:00:43.589",95,{"$f":"COUNTIFS(Test,A737,Nimi,B737,Aeg,\">=\"&C737)","v":2}]
["Test03","Mihkel Kulp","2019-11-18T19:34:16.142",35,{"$f":"COUNTIFS(Test,A738,Nimi,B738,Aeg,\">=\"&C738)","v":5}]
["Test04","Anna Koel","2019-11-28T08:38:35.990",75,{"$f":"COUNTIFS(Test,A739,Nimi,B739,Aeg,\">=\"&C739)","v":4}]
["Test03","Martin Aavik","2019-11-15T21:32:19.429",90,{"$f":"COUNTIFS(Test,A740,Nimi,B740,Aeg,\">=\"&C740)","v":7}]
["Test04","Hanna Laid","2019-11-13T08:08:25.343",27,{"$f":"COUNTIFS(Test,A741,Nimi,B741,Aeg,\">=\"&C741)","v":11}]
["Test04","Robert Lentso","2019-11-13T21:20:33.446",21,{"$f":"COUNTIFS(Test,A742,Nimi,B742,Aeg,\">=\"&C742)","v":5}]
["Test02","Lauri Vahtra","2019-11-07T12:03:32.769",26,{"$f":"COUNTIFS(Test,A743,Nimi,B743,Aeg,\">=\"&C743)","v":10}]
["Test03","Jaagup Kivi","2019-11-29T20:49:37.252",57,{"$f":"COUNTIFS(Test,A744,Nimi,B744,Aeg,\">=\"&C744)","v":1}]
["Test03","Armin Kaasik","2019-11-27T15:43:27.739",25,{"$f":"COUNTIFS(Test,A745,Nimi,B745,Aeg,\">=\"&C745)","v":3}]
["Test03","Erik Pärn","2019-11-02T14:18:29.860",63,{"$f":"COUNTIFS(Test,A746,Nimi,B746,Aeg,\">=\"&C746)","v":10}]
["Test01","Anette Lepp","2019-11-16T23:14:33.289",92,{"$f":"COUNTIFS(Test,A747,Nimi,B747,Aeg,\">=\"&C747)","v":2}]
["Test02","Viktoria Lumi","2019-11-04T17:20:04.951",23,{"$f":"COUNTIFS(Test,A748,Nimi,B748,Aeg,\">=\"&C748)","v":10}]
["Test04","Anna Koel","2019-11-10T21:19:18.691",50,{"$f":"COUNTIFS(Test,A749,Nimi,B749,Aeg,\">=\"&C749)","v":15}]
["Test02","Tarvo Järv","2019-11-28T14:32:00.955",56,{"$f":"COUNTIFS(Test,A750,Nimi,B750,Aeg,\">=\"&C750)","v":2}]
["Test03","Kaspar Raude","2019-11-10T20:09:31.691",90,{"$f":"COUNTIFS(Test,A751,Nimi,B751,Aeg,\">=\"&C751)","v":1}]
["Test01","Mihkel Kulp","2019-11-25T17:31:29.808",68,{"$f":"COUNTIFS(Test,A752,Nimi,B752,Aeg,\">=\"&C752)","v":2}]
["Test04","Jaagup Kivi","2019-11-15T18:28:37.957",56,{"$f":"COUNTIFS(Test,A753,Nimi,B753,Aeg,\">=\"&C753)","v":6}]
["Test04","Emili Loorits","2019-11-24T10:26:08.627",74,{"$f":"COUNTIFS(Test,A754,Nimi,B754,Aeg,\">=\"&C754)","v":1}]
["Test02","Egert Vint","2019-11-03T17:07:53.281",35,{"$f":"COUNTIFS(Test,A755,Nimi,B755,Aeg,\">=\"&C755)","v":7}]
["Test02","Tarvo Järv","2019-11-21T14:46:10.192",97,{"$f":"COUNTIFS(Test,A756,Nimi,B756,Aeg,\">=\"&C756)","v":7}]
["Test01","Reimo Kala","2019-11-19T14:11:17.763",95,{"$f":"COUNTIFS(Test,A757,Nimi,B757,Aeg,\">=\"&C757)","v":2}]
["Test01","Tarvo Järv","2019-11-01T20:36:26.272",65,{"$f":"COUNTIFS(Test,A758,Nimi,B758,Aeg,\">=\"&C758)","v":5}]
["Test03","Kertu Heinsoo","2019-11-22T23:10:34.095",33,{"$f":"COUNTIFS(Test,A759,Nimi,B759,Aeg,\">=\"&C759)","v":4}]
["Test03","Anette Lepp","2019-11-28T18:47:23.779",64,{"$f":"COUNTIFS(Test,A760,Nimi,B760,Aeg,\">=\"&C760)","v":2}]
["Test02","Joonas Haljas","2019-11-12T09:34:33.999",55,{"$f":"COUNTIFS(Test,A761,Nimi,B761,Aeg,\">=\"&C761)","v":7}]
["Test03","Diana Taal","2019-11-23T16:04:57.325",63,{"$f":"COUNTIFS(Test,A762,Nimi,B762,Aeg,\">=\"&C762)","v":4}]
["Test03","Alari Suur","2019-11-29T14:49:48.769",44,{"$f":"COUNTIFS(Test,A763,Nimi,B763,Aeg,\">=\"&C763)","v":1}]
["Test03","Martin Aavik","2019-11-10T18:05:17.676",49,{"$f":"COUNTIFS(Test,A764,Nimi,B764,Aeg,\">=\"&C764)","v":11}]
["Test03","Viktoria Lumi","2019-11-06T17:23:47.186",92,{"$f":"COUNTIFS(Test,A765,Nimi,B765,Aeg,\">=\"&C765)","v":6}]
["Test04","Emili Loorits","2019-11-20T11:25:01.850",20,{"$f":"COUNTIFS(Test,A766,Nimi,B766,Aeg,\">=\"&C766)","v":3}]
["Test03","Jana Kiisk","2019-11-26T22:33:20.501",55,{"$f":"COUNTIFS(Test,A767,Nimi,B767,Aeg,\">=\"&C767)","v":1}]
["Test04","Brita Kaljula","2019-11-23T12:13:00.736",23,{"$f":"COUNTIFS(Test,A768,Nimi,B768,Aeg,\">=\"&C768)","v":3}]
["Test03","Diana Taal","2019-11-06T15:51:40.745",68,{"$f":"COUNTIFS(Test,A769,Nimi,B769,Aeg,\">=\"&C769)","v":12}]
["Test03","Rasmus Kroon","2019-11-23T13:24:14.117",73,{"$f":"COUNTIFS(Test,A770,Nimi,B770,Aeg,\">=\"&C770)","v":4}]
["Test04","Erik Pärn","2019-11-13T18:03:42.239",38,{"$f":"COUNTIFS(Test,A771,Nimi,B771,Aeg,\">=\"&C771)","v":5}]
["Test01","Karin Saar","2019-11-07T19:56:53.779",78,{"$f":"COUNTIFS(Test,A772,Nimi,B772,Aeg,\">=\"&C772)","v":7}]
["Test01","Jana Kiisk","2019-11-16T17:10:14.300",46,{"$f":"COUNTIFS(Test,A773,Nimi,B773,Aeg,\">=\"&C773)","v":6}]
["Test04","Diana Taal","2019-11-03T14:55:18.607",93,{"$f":"COUNTIFS(Test,A774,Nimi,B774,Aeg,\">=\"&C774)","v":9}]
["Test04","Robert Lentso","2019-11-25T09:46:52.579",97,{"$f":"COUNTIFS(Test,A775,Nimi,B775,Aeg,\">=\"&C775)","v":1}]
["Test04","Alari Suur","2019-11-26T11:22:04.714",59,{"$f":"COUNTIFS(Test,A776,Nimi,B776,Aeg,\">=\"&C776)","v":2}]
["Test03","Viktoria Lumi","2019-11-25T20:48:29.613",82,{"$f":"COUNTIFS(Test,A777,Nimi,B777,Aeg,\">=\"&C777)","v":3}]
["Test02","Erik Pärn","2019-11-25T22:53:40.002",81,{"$f":"COUNTIFS(Test,A778,Nimi,B778,Aeg,\">=\"&C778)","v":3}]
["Test04","Egert Vint","2019-11-20T22:49:00.657",56,{"$f":"COUNTIFS(Test,A779,Nimi,B779,Aeg,\">=\"&C779)","v":2}]
["Test02","Egert Vint","2019-11-02T11:31:57.144",73,{"$f":"COUNTIFS(Test,A780,Nimi,B780,Aeg,\">=\"&C780)","v":9}]
["Test02","Anna Koel","2019-11-03T20:56:18.397",99,{"$f":"COUNTIFS(Test,A781,Nimi,B781,Aeg,\">=\"&C781)","v":6}]
["Test02","Hanna Laid","2019-11-15T23:47:40.838",21,{"$f":"COUNTIFS(Test,A782,Nimi,B782,Aeg,\">=\"&C782)","v":2}]
["Test04","Markus Niidas","2019-11-19T19:33:25.408",52,{"$f":"COUNTIFS(Test,A783,Nimi,B783,Aeg,\">=\"&C783)","v":2}]
["Test02","Erik Pärn","2019-11-04T23:37:40.382",71,{"$f":"COUNTIFS(Test,A784,Nimi,B784,Aeg,\">=\"&C784)","v":13}]
["Test02","Mihkel Kulp","2019-11-26T08:38:40.999",84,{"$f":"COUNTIFS(Test,A785,Nimi,B785,Aeg,\">=\"&C785)","v":4}]
["Test02","Kristina Merila","2019-11-14T16:55:41.246",89,{"$f":"COUNTIFS(Test,A786,Nimi,B786,Aeg,\">=\"&C786)","v":8}]
["Test03","Paul Hein","2019-11-17T21:17:03.593",76,{"$f":"COUNTIFS(Test,A787,Nimi,B787,Aeg,\">=\"&C787)","v":7}]
["Test02","Rasmus Kroon","2019-11-01T19:59:52.952",86,{"$f":"COUNTIFS(Test,A788,Nimi,B788,Aeg,\">=\"&C788)","v":8}]
["Test02","Kristina Merila","2019-11-02T23:48:55.221",77,{"$f":"COUNTIFS(Test,A789,Nimi,B789,Aeg,\">=\"&C789)","v":16}]
["Test02","Karin Saar","2019-11-15T08:40:24.783",78,{"$f":"COUNTIFS(Test,A790,Nimi,B790,Aeg,\">=\"&C790)","v":3}]
["Test01","Jana Kiisk","2019-11-19T22:19:27.163",29,{"$f":"COUNTIFS(Test,A791,Nimi,B791,Aeg,\">=\"&C791)","v":4}]
["Test01","Carmen Sõrmus","2019-11-29T10:50:32.917",27,{"$f":"COUNTIFS(Test,A792,Nimi,B792,Aeg,\">=\"&C792)","v":1}]
["Test01","Getlin Allas","2019-11-02T15:23:55.830",91,{"$f":"COUNTIFS(Test,A793,Nimi,B793,Aeg,\">=\"&C793)","v":9}]
["Test01","Alari Suur","2019-11-29T20:21:38.494",79,{"$f":"COUNTIFS(Test,A794,Nimi,B794,Aeg,\">=\"&C794)","v":1}]
["Test03","Erik Pärn","2019-11-24T19:23:18.132",31,{"$f":"COUNTIFS(Test,A795,Nimi,B795,Aeg,\">=\"&C795)","v":3}]
["Test01","Kristina Merila","2019-11-13T14:18:59.610",37,{"$f":"COUNTIFS(Test,A796,Nimi,B796,Aeg,\">=\"&C796)","v":2}]
["Test03","Martin Aavik","2019-11-11T18:19:54.928",66,{"$f":"COUNTIFS(Test,A797,Nimi,B797,Aeg,\">=\"&C797)","v":10}]
["Test03","Martin Aavik","2019-11-16T22:04:11.893",59,{"$f":"COUNTIFS(Test,A798,Nimi,B798,Aeg,\">=\"&C798)","v":6}]
["Test02","Kristina Merila","2019-11-04T10:28:07.403",77,{"$f":"COUNTIFS(Test,A799,Nimi,B799,Aeg,\">=\"&C799)","v":15}]
["Test01","Sander Kell","2019-11-16T15:40:20.034",84,{"$f":"COUNTIFS(Test,A800,Nimi,B800,Aeg,\">=\"&C800)","v":7}]
["Test03","Artur Piiri","2019-11-20T15:56:41.858",36,{"$f":"COUNTIFS(Test,A801,Nimi,B801,Aeg,\">=\"&C801)","v":3}]
["Test04","Joonas Haljas","2019-11-01T18:09:34.549",65,{"$f":"COUNTIFS(Test,A802,Nimi,B802,Aeg,\">=\"&C802)","v":6}]
["Test02","Alari Suur","2019-11-02T17:18:22.701",41,{"$f":"COUNTIFS(Test,A803,Nimi,B803,Aeg,\">=\"&C803)","v":8}]
["Test04","Diana Taal","2019-11-09T18:14:23.771",23,{"$f":"COUNTIFS(Test,A804,Nimi,B804,Aeg,\">=\"&C804)","v":6}]
["Test04","Tarvo Järv","2019-11-19T22:26:42.025",93,{"$f":"COUNTIFS(Test,A805,Nimi,B805,Aeg,\">=\"&C805)","v":3}]
["Test04","Anna Koel","2019-11-01T12:45:57.730",67,{"$f":"COUNTIFS(Test,A806,Nimi,B806,Aeg,\">=\"&C806)","v":21}]
["Test01","Viktoria Lumi","2019-11-01T12:55:49.215",64,{"$f":"COUNTIFS(Test,A807,Nimi,B807,Aeg,\">=\"&C807)","v":9}]
["Test04","Hanna Laid","2019-11-06T11:08:41.039",97,{"$f":"COUNTIFS(Test,A808,Nimi,B808,Aeg,\">=\"&C808)","v":14}]
["Test04","Maarja Pihlak","2019-11-16T08:29:09.896",23,{"$f":"COUNTIFS(Test,A809,Nimi,B809,Aeg,\">=\"&C809)","v":5}]
["Test02","Karin Saar","2019-11-06T08:09:32.177",65,{"$f":"COUNTIFS(Test,A810,Nimi,B810,Aeg,\">=\"&C810)","v":10}]
["Test04","Anna Koel","2019-11-02T19:13:28.196",80,{"$f":"COUNTIFS(Test,A811,Nimi,B811,Aeg,\">=\"&C811)","v":20}]
["Test03","Kaspar Raude","2019-11-09T12:09:10.821",91,{"$f":"COUNTIFS(Test,A812,Nimi,B812,Aeg,\">=\"&C812)","v":2}]
["Test04","Brita Kaljula","2019-11-04T19:39:20.520",24,{"$f":"COUNTIFS(Test,A813,Nimi,B813,Aeg,\">=\"&C813)","v":9}]
["Test04","Viktoria Lumi","2019-11-25T11:10:55.920",37,{"$f":"COUNTIFS(Test,A814,Nimi,B814,Aeg,\">=\"&C814)","v":3}]
["Test02","Jaagup Kivi","2019-11-19T15:13:57.459",78,{"$f":"COUNTIFS(Test,A815,Nimi,B815,Aeg,\">=\"&C815)","v":1}]
["Test01","Katrin Laurits","2019-11-20T18:42:01.208",35,{"$f":"COUNTIFS(Test,A816,Nimi,B816,Aeg,\">=\"&C816)","v":2}]
["Test03","Rasmus Kroon","2019-11-30T10:42:34.697",33,{"$f":"COUNTIFS(Test,A817,Nimi,B817,Aeg,\">=\"&C817)","v":1}]
["Test01","Viktoria Lumi","2019-11-17T18:45:04.273",59,{"$f":"COUNTIFS(Test,A818,Nimi,B818,Aeg,\">=\"&C818)","v":4}]
["Test02","Reimo Kala","2019-11-07T15:48:44.429",33,{"$f":"COUNTIFS(Test,A819,Nimi,B819,Aeg,\">=\"&C819)","v":4}]
["Test01","Egert Vint","2019-11-03T17:52:50.559",27,{"$f":"COUNTIFS(Test,A820,Nimi,B820,Aeg,\">=\"&C820)","v":7}]
["Test03","Artur Piiri","2019-11-05T20:09:40.587",26,{"$f":"COUNTIFS(Test,A821,Nimi,B821,Aeg,\">=\"&C821)","v":11}]
["Test04","Egert Vint","2019-11-17T09:16:08.206",61,{"$f":"COUNTIFS(Test,A822,Nimi,B822,Aeg,\">=\"&C822)","v":4}]
["Test03","Brita Kaljula","2019-11-01T22:36:18.260",33,{"$f":"COUNTIFS(Test,A823,Nimi,B823,Aeg,\">=\"&C823)","v":13}]
["Test02","Maarja Pihlak","2019-11-18T11:42:13.053",31,{"$f":"COUNTIFS(Test,A824,Nimi,B824,Aeg,\">=\"&C824)","v":5}]
["Test01","Kertu Heinsoo","2019-11-01T10:36:16.038",85,{"$f":"COUNTIFS(Test,A825,Nimi,B825,Aeg,\">=\"&C825)","v":11}]
["Test03","Egert Vint","2019-11-14T12:22:02.598",41,{"$f":"COUNTIFS(Test,A826,Nimi,B826,Aeg,\">=\"&C826)","v":6}]
["Test03","Erik Pärn","2019-11-26T11:27:52.208",83,{"$f":"COUNTIFS(Test,A827,Nimi,B827,Aeg,\">=\"&C827)","v":1}]
["Test03","Tarvo Järv","2019-11-20T22:07:55.667",43,{"$f":"COUNTIFS(Test,A828,Nimi,B828,Aeg,\">=\"&C828)","v":2}]
["Test04","Anna Koel","2019-11-27T18:48:16.785",24,{"$f":"COUNTIFS(Test,A829,Nimi,B829,Aeg,\">=\"&C829)","v":6}]
["Test02","Carmen Sõrmus","2019-11-15T22:09:29.731",57,{"$f":"COUNTIFS(Test,A830,Nimi,B830,Aeg,\">=\"&C830)","v":4}]
["Test03","Kertu Heinsoo","2019-11-11T09:42:52.320",50,{"$f":"COUNTIFS(Test,A831,Nimi,B831,Aeg,\">=\"&C831)","v":10}]
["Test02","Getlin Allas","2019-11-27T17:32:36.326",39,{"$f":"COUNTIFS(Test,A832,Nimi,B832,Aeg,\">=\"&C832)","v":2}]
["Test01","Markus Niidas","2019-11-19T20:16:21.343",51,{"$f":"COUNTIFS(Test,A833,Nimi,B833,Aeg,\">=\"&C833)","v":4}]
["Test03","Anette Lepp","2019-11-10T08:48:55.445",33,{"$f":"COUNTIFS(Test,A834,Nimi,B834,Aeg,\">=\"&C834)","v":8}]
["Test02","Joonas Haljas","2019-11-20T21:37:48.744",21,{"$f":"COUNTIFS(Test,A835,Nimi,B835,Aeg,\">=\"&C835)","v":5}]
["Test02","Erik Pärn","2019-11-05T16:38:45.481",59,{"$f":"COUNTIFS(Test,A836,Nimi,B836,Aeg,\">=\"&C836)","v":12}]
["Test03","Martin Aavik","2019-11-21T20:34:41.713",62,{"$f":"COUNTIFS(Test,A837,Nimi,B837,Aeg,\">=\"&C837)","v":4}]
["Test04","Alari Suur","2019-11-20T21:37:22.996",71,{"$f":"COUNTIFS(Test,A838,Nimi,B838,Aeg,\">=\"&C838)","v":5}]
["Test04","Robert Lentso","2019-11-20T17:25:37.342",51,{"$f":"COUNTIFS(Test,A839,Nimi,B839,Aeg,\">=\"&C839)","v":2}]
["Test03","Paul Hein","2019-11-26T10:29:02.492",30,{"$f":"COUNTIFS(Test,A840,Nimi,B840,Aeg,\">=\"&C840)","v":4}]
["Test02","Urmas Lõhmus","2019-11-25T12:30:52.644",45,{"$f":"COUNTIFS(Test,A841,Nimi,B841,Aeg,\">=\"&C841)","v":3}]
["Test01","Egert Vint","2019-11-18T09:40:40.688",100,{"$f":"COUNTIFS(Test,A842,Nimi,B842,Aeg,\">=\"&C842)","v":4}]
["Test02","Katrin Laurits","2019-11-04T08:22:04.922",55,{"$f":"COUNTIFS(Test,A843,Nimi,B843,Aeg,\">=\"&C843)","v":7}]
["Test02","Joonas Haljas","2019-11-29T10:55:39.515",36,{"$f":"COUNTIFS(Test,A844,Nimi,B844,Aeg,\">=\"&C844)","v":1}]
["Test03","Carmen Sõrmus","2019-11-30T16:00:27.246",60,{"$f":"COUNTIFS(Test,A845,Nimi,B845,Aeg,\">=\"&C845)","v":1}]
["Test04","Lauri Vahtra","2019-11-08T11:05:51.816",69,{"$f":"COUNTIFS(Test,A846,Nimi,B846,Aeg,\">=\"&C846)","v":7}]
["Test01","Jaagup Kivi","2019-11-29T09:00:27.266",72,{"$f":"COUNTIFS(Test,A847,Nimi,B847,Aeg,\">=\"&C847)","v":1}]
["Test01","Urmas Lõhmus","2019-11-11T22:52:48.861",49,{"$f":"COUNTIFS(Test,A848,Nimi,B848,Aeg,\">=\"&C848)","v":5}]
["Test01","Paul Hein","2019-11-25T12:36:14.208",35,{"$f":"COUNTIFS(Test,A849,Nimi,B849,Aeg,\">=\"&C849)","v":1}]
["Test04","Getlin Allas","2019-11-05T10:25:44.115",24,{"$f":"COUNTIFS(Test,A850,Nimi,B850,Aeg,\">=\"&C850)","v":7}]
["Test04","Brita Kaljula","2019-11-11T13:24:09.472",100,{"$f":"COUNTIFS(Test,A851,Nimi,B851,Aeg,\">=\"&C851)","v":6}]
["Test02","Carmen Sõrmus","2019-11-14T22:31:59.354",60,{"$f":"COUNTIFS(Test,A852,Nimi,B852,Aeg,\">=\"&C852)","v":6}]
["Test04","Lauri Vahtra","2019-11-13T18:09:32.168",37,{"$f":"COUNTIFS(Test,A853,Nimi,B853,Aeg,\">=\"&C853)","v":4}]
["Test02","Markus Niidas","2019-11-19T21:37:20.681",70,{"$f":"COUNTIFS(Test,A854,Nimi,B854,Aeg,\">=\"&C854)","v":4}]
["Test03","Martin Aavik","2019-11-04T17:02:21.724",73,{"$f":"COUNTIFS(Test,A855,Nimi,B855,Aeg,\">=\"&C855)","v":13}]
["Test03","Kertu Heinsoo","2019-11-27T15:11:05.388",37,{"$f":"COUNTIFS(Test,A856,Nimi,B856,Aeg,\">=\"&C856)","v":1}]
["Test01","Joonas Haljas","2019-11-04T21:44:58.968",62,{"$f":"COUNTIFS(Test,A857,Nimi,B857,Aeg,\">=\"&C857)","v":10}]
["Test02","Kertu Heinsoo","2019-11-13T08:15:39.562",63,{"$f":"COUNTIFS(Test,A858,Nimi,B858,Aeg,\">=\"&C858)","v":5}]
["Test03","Egert Vint","2019-11-30T17:05:08.491",28,{"$f":"COUNTIFS(Test,A859,Nimi,B859,Aeg,\">=\"&C859)","v":1}]
["Test02","Kaspar Raude","2019-11-09T18:17:10.155",55,{"$f":"COUNTIFS(Test,A860,Nimi,B860,Aeg,\">=\"&C860)","v":2}]
["Test02","Hans Kukk","2019-11-29T22:49:47.549",22,{"$f":"COUNTIFS(Test,A861,Nimi,B861,Aeg,\">=\"&C861)","v":1}]
["Test01","Erik Pärn","2019-11-06T21:52:30.220",83,{"$f":"COUNTIFS(Test,A862,Nimi,B862,Aeg,\">=\"&C862)","v":6}]
["Test03","Viktoria Lumi","2019-11-10T12:07:08.497",99,{"$f":"COUNTIFS(Test,A863,Nimi,B863,Aeg,\">=\"&C863)","v":5}]
["Test03","Anette Lepp","2019-11-16T20:37:17.551",54,{"$f":"COUNTIFS(Test,A864,Nimi,B864,Aeg,\">=\"&C864)","v":6}]
["Test04","Katrin Laurits","2019-11-10T12:14:26.241",61,{"$f":"COUNTIFS(Test,A865,Nimi,B865,Aeg,\">=\"&C865)","v":7}]
["Test04","Robert Lentso","2019-11-01T19:11:04.369",65,{"$f":"COUNTIFS(Test,A866,Nimi,B866,Aeg,\">=\"&C866)","v":7}]
["Test04","Sander Kell","2019-11-30T17:29:59.060",34,{"$f":"COUNTIFS(Test,A867,Nimi,B867,Aeg,\">=\"&C867)","v":1}]
["Test02","Alari Suur","2019-11-09T17:55:10.561",53,{"$f":"COUNTIFS(Test,A868,Nimi,B868,Aeg,\">=\"&C868)","v":6}]
["Test01","Rasmus Kroon","2019-11-21T17:34:30.003",25,{"$f":"COUNTIFS(Test,A869,Nimi,B869,Aeg,\">=\"&C869)","v":5}]
["Test02","Erik Pärn","2019-11-24T12:26:41.089",22,{"$f":"COUNTIFS(Test,A870,Nimi,B870,Aeg,\">=\"&C870)","v":5}]
["Test01","Kertu Heinsoo","2019-11-15T19:29:47.198",68,{"$f":"COUNTIFS(Test,A871,Nimi,B871,Aeg,\">=\"&C871)","v":8}]
["Test04","Hanna Laid","2019-11-02T19:49:08.605",51,{"$f":"COUNTIFS(Test,A872,Nimi,B872,Aeg,\">=\"&C872)","v":16}]
["Test02","Markus Niidas","2019-11-20T12:12:43.040",80,{"$f":"COUNTIFS(Test,A873,Nimi,B873,Aeg,\">=\"&C873)","v":3}]
["Test04","Anna Koel","2019-11-22T09:01:15.779",62,{"$f":"COUNTIFS(Test,A874,Nimi,B874,Aeg,\">=\"&C874)","v":9}]
["Test03","Jaagup Kivi","2019-11-21T13:23:54.317",34,{"$f":"COUNTIFS(Test,A875,Nimi,B875,Aeg,\">=\"&C875)","v":3}]
["Test01","Erik Pärn","2019-11-21T20:30:59.487",24,{"$f":"COUNTIFS(Test,A876,Nimi,B876,Aeg,\">=\"&C876)","v":5}]
["Test04","Hanna Laid","2019-11-14T19:09:23.278",97,{"$f":"COUNTIFS(Test,A877,Nimi,B877,Aeg,\">=\"&C877)","v":10}]
["Test03","Mihkel Kulp","2019-11-27T08:11:49.568",94,{"$f":"COUNTIFS(Test,A878,Nimi,B878,Aeg,\">=\"&C878)","v":2}]
["Test04","Alari Suur","2019-11-29T17:01:39.518",44,{"$f":"COUNTIFS(Test,A879,Nimi,B879,Aeg,\">=\"&C879)","v":1}]
["Test04","Anette Lepp","2019-11-11T18:37:44.496",28,{"$f":"COUNTIFS(Test,A880,Nimi,B880,Aeg,\">=\"&C880)","v":7}]
["Test03","Brita Kaljula","2019-11-10T15:56:12.786",51,{"$f":"COUNTIFS(Test,A881,Nimi,B881,Aeg,\">=\"&C881)","v":9}]
["Test02","Armin Kaasik","2019-11-30T12:01:33.673",44,{"$f":"COUNTIFS(Test,A882,Nimi,B882,Aeg,\">=\"&C882)","v":2}]
["Test03","Karin Saar","2019-11-23T13:49:58.653",85,{"$f":"COUNTIFS(Test,A883,Nimi,B883,Aeg,\">=\"&C883)","v":3}]
["Test01","Brita Kaljula","2019-11-27T11:36:58.890",80,{"$f":"COUNTIFS(Test,A884,Nimi,B884,Aeg,\">=\"&C884)","v":1}]
["Test04","Hans Kukk","2019-11-27T19:20:51.094",70,{"$f":"COUNTIFS(Test,A885,Nimi,B885,Aeg,\">=\"&C885)","v":3}]
["Test03","Rasmus Kroon","2019-11-21T14:39:41.750",63,{"$f":"COUNTIFS(Test,A886,Nimi,B886,Aeg,\">=\"&C886)","v":6}]
["Test04","Anna Koel","2019-11-11T23:33:11.434",97,{"$f":"COUNTIFS(Test,A887,Nimi,B887,Aeg,\">=\"&C887)","v":13}]
["Test03","Hanna Laid","2019-11-22T20:16:58.494",87,{"$f":"COUNTIFS(Test,A888,Nimi,B888,Aeg,\">=\"&C888)","v":1}]
["Test03","Viktoria Lumi","2019-11-03T12:39:27.985",71,{"$f":"COUNTIFS(Test,A889,Nimi,B889,Aeg,\">=\"&C889)","v":8}]
["Test04","Anna Koel","2019-11-05T17:28:40.618",100,{"$f":"COUNTIFS(Test,A890,Nimi,B890,Aeg,\">=\"&C890)","v":19}]
["Test03","Hans Kukk","2019-11-28T20:21:02.569",62,{"$f":"COUNTIFS(Test,A891,Nimi,B891,Aeg,\">=\"&C891)","v":3}]
["Test02","Getlin Allas","2019-11-12T23:18:33.075",50,{"$f":"COUNTIFS(Test,A892,Nimi,B892,Aeg,\">=\"&C892)","v":6}]
["Test02","Kertu Heinsoo","2019-11-07T22:02:23.092",41,{"$f":"COUNTIFS(Test,A893,Nimi,B893,Aeg,\">=\"&C893)","v":6}]
["Test03","Kertu Heinsoo","2019-11-10T17:05:12.910",63,{"$f":"COUNTIFS(Test,A894,Nimi,B894,Aeg,\">=\"&C894)","v":11}]
["Test04","Kristina Merila","2019-11-03T22:29:31.623",62,{"$f":"COUNTIFS(Test,A895,Nimi,B895,Aeg,\">=\"&C895)","v":11}]
["Test01","Sander Kell","2019-11-20T23:49:17.010",94,{"$f":"COUNTIFS(Test,A896,Nimi,B896,Aeg,\">=\"&C896)","v":4}]
["Test04","Emili Loorits","2019-11-02T18:13:46.469",38,{"$f":"COUNTIFS(Test,A897,Nimi,B897,Aeg,\">=\"&C897)","v":7}]
["Test04","Karin Saar","2019-11-23T14:37:37.813",73,{"$f":"COUNTIFS(Test,A898,Nimi,B898,Aeg,\">=\"&C898)","v":1}]
["Test02","Lauri Vahtra","2019-11-17T18:45:14.427",26,{"$f":"COUNTIFS(Test,A899,Nimi,B899,Aeg,\">=\"&C899)","v":7}]
["Test02","Urmas Lõhmus","2019-11-11T18:02:51.107",54,{"$f":"COUNTIFS(Test,A900,Nimi,B900,Aeg,\">=\"&C900)","v":7}]
["Test04","Markus Niidas","2019-11-06T20:07:34.502",84,{"$f":"COUNTIFS(Test,A901,Nimi,B901,Aeg,\">=\"&C901)","v":5}]
["Test02","Jaagup Kivi","2019-11-17T22:34:35.747",37,{"$f":"COUNTIFS(Test,A902,Nimi,B902,Aeg,\">=\"&C902)","v":2}]
["Test04","Martin Aavik","2019-11-06T21:25:31.077",24,{"$f":"COUNTIFS(Test,A903,Nimi,B903,Aeg,\">=\"&C903)","v":7}]
["Test03","Jana Kiisk","2019-11-21T15:19:02.960",49,{"$f":"COUNTIFS(Test,A904,Nimi,B904,Aeg,\">=\"&C904)","v":3}]
["Test04","Maarja Pihlak","2019-11-13T20:45:52.497",81,{"$f":"COUNTIFS(Test,A905,Nimi,B905,Aeg,\">=\"&C905)","v":7}]
["Test04","Urmas Lõhmus","2019-11-18T20:44:53.025",67,{"$f":"COUNTIFS(Test,A906,Nimi,B906,Aeg,\">=\"&C906)","v":4}]
["Test01","Paul Hein","2019-11-09T08:05:10.645",32,{"$f":"COUNTIFS(Test,A907,Nimi,B907,Aeg,\">=\"&C907)","v":4}]
["Test04","Anna Koel","2019-11-28T10:16:03.402",36,{"$f":"COUNTIFS(Test,A908,Nimi,B908,Aeg,\">=\"&C908)","v":3}]
["Test01","Viktoria Lumi","2019-11-09T09:04:35.293",71,{"$f":"COUNTIFS(Test,A909,Nimi,B909,Aeg,\">=\"&C909)","v":6}]
["Test02","Karin Saar","2019-11-14T15:43:46.417",40,{"$f":"COUNTIFS(Test,A910,Nimi,B910,Aeg,\">=\"&C910)","v":4}]
["Test03","Diana Taal","2019-11-19T19:20:19.876",94,{"$f":"COUNTIFS(Test,A911,Nimi,B911,Aeg,\">=\"&C911)","v":8}]
["Test03","Kertu Heinsoo","2019-11-23T22:44:01.899",35,{"$f":"COUNTIFS(Test,A912,Nimi,B912,Aeg,\">=\"&C912)","v":3}]
["Test02","Paul Hein","2019-11-10T17:29:21.649",67,{"$f":"COUNTIFS(Test,A913,Nimi,B913,Aeg,\">=\"&C913)","v":6}]
["Test02","Alari Suur","2019-11-16T09:03:49.753",55,{"$f":"COUNTIFS(Test,A914,Nimi,B914,Aeg,\">=\"&C914)","v":3}]
["Test02","Robert Lentso","2019-11-11T16:37:19.266",82,{"$f":"COUNTIFS(Test,A915,Nimi,B915,Aeg,\">=\"&C915)","v":9}]
["Test02","Tarvo Järv","2019-11-26T20:34:06.369",47,{"$f":"COUNTIFS(Test,A916,Nimi,B916,Aeg,\">=\"&C916)","v":3}]
["Test02","Diana Taal","2019-11-29T13:41:10.761",74,{"$f":"COUNTIFS(Test,A917,Nimi,B917,Aeg,\">=\"&C917)","v":1}]
["Test03","Armin Kaasik","2019-11-01T21:10:05.028",80,{"$f":"COUNTIFS(Test,A918,Nimi,B918,Aeg,\">=\"&C918)","v":7}]
["Test04","Diana Taal","2019-11-25T23:43:16.032",85,{"$f":"COUNTIFS(Test,A919,Nimi,B919,Aeg,\">=\"&C919)","v":2}]
["Test01","Alari Suur","2019-11-16T20:29:10.926",30,{"$f":"COUNTIFS(Test,A920,Nimi,B920,Aeg,\">=\"&C920)","v":7}]
["Test04","Kertu Heinsoo","2019-11-24T20:16:09.001",55,{"$f":"COUNTIFS(Test,A921,Nimi,B921,Aeg,\">=\"&C921)","v":3}]
["Test02","Kertu Heinsoo","2019-11-06T10:01:34.725",57,{"$f":"COUNTIFS(Test,A922,Nimi,B922,Aeg,\">=\"&C922)","v":7}]
["Test02","Sander Kell","2019-11-08T12:03:05.439",70,{"$f":"COUNTIFS(Test,A923,Nimi,B923,Aeg,\">=\"&C923)","v":7}]
["Test04","Egert Vint","2019-11-08T08:32:23.996",78,{"$f":"COUNTIFS(Test,A924,Nimi,B924,Aeg,\">=\"&C924)","v":7}]
["Test04","Urmas Lõhmus","2019-11-19T13:02:41.695",50,{"$f":"COUNTIFS(Test,A925,Nimi,B925,Aeg,\">=\"&C925)","v":3}]
["Test02","Kertu Heinsoo","2019-11-25T20:08:26.772",60,{"$f":"COUNTIFS(Test,A926,Nimi,B926,Aeg,\">=\"&C926)","v":2}]
["Test01","Joonas Haljas","2019-11-11T08:27:31.453",23,{"$f":"COUNTIFS(Test,A927,Nimi,B927,Aeg,\">=\"&C927)","v":8}]
["Test02","Egert Vint","2019-11-17T10:12:47.344",54,{"$f":"COUNTIFS(Test,A928,Nimi,B928,Aeg,\">=\"&C928)","v":3}]
["Test02","Karin Saar","2019-11-01T19:17:58.366",77,{"$f":"COUNTIFS(Test,A929,Nimi,B929,Aeg,\">=\"&C929)","v":13}]
["Test02","Rasmus Kroon","2019-11-23T16:03:35.395",56,{"$f":"COUNTIFS(Test,A930,Nimi,B930,Aeg,\">=\"&C930)","v":3}]
["Test01","Lauri Vahtra","2019-11-23T19:10:08.938",25,{"$f":"COUNTIFS(Test,A931,Nimi,B931,Aeg,\">=\"&C931)","v":2}]
["Test02","Armin Kaasik","2019-11-20T10:45:55.392",23,{"$f":"COUNTIFS(Test,A932,Nimi,B932,Aeg,\">=\"&C932)","v":5}]
["Test04","Martin Aavik","2019-11-18T17:55:39.785",20,{"$f":"COUNTIFS(Test,A933,Nimi,B933,Aeg,\">=\"&C933)","v":4}]
["Test03","Karin Saar","2019-11-27T18:33:30.749",40,{"$f":"COUNTIFS(Test,A934,Nimi,B934,Aeg,\">=\"&C934)","v":2}]
["Test04","Diana Taal","2019-11-10T10:02:27.472",25,{"$f":"COUNTIFS(Test,A935,Nimi,B935,Aeg,\">=\"&C935)","v":5}]
["Test04","Jaagup Kivi","2019-11-19T23:06:07.943",80,{"$f":"COUNTIFS(Test,A936,Nimi,B936,Aeg,\">=\"&C936)","v":3}]
["Test04","Armin Kaasik","2019-11-23T21:25:30.337",24,{"$f":"COUNTIFS(Test,A937,Nimi,B937,Aeg,\">=\"&C937)","v":4}]
["Test02","Jana Kiisk","2019-11-19T10:45:43.001",58,{"$f":"COUNTIFS(Test,A938,Nimi,B938,Aeg,\">=\"&C938)","v":5}]
["Test04","Anette Lepp","2019-11-23T10:23:22.376",41,{"$f":"COUNTIFS(Test,A939,Nimi,B939,Aeg,\">=\"&C939)","v":3}]
["Test01","Hanna Laid","2019-11-29T22:24:26.191",89,{"$f":"COUNTIFS(Test,A940,Nimi,B940,Aeg,\">=\"&C940)","v":1}]
["Test04","Karin Saar","2019-11-10T18:40:06.643",59,{"$f":"COUNTIFS(Test,A941,Nimi,B941,Aeg,\">=\"&C941)","v":7}]
["Test03","Katrin Laurits","2019-11-08T14:49:59.496",71,{"$f":"COUNTIFS(Test,A942,Nimi,B942,Aeg,\">=\"&C942)","v":7}]
["Test04","Joonas Haljas","2019-11-21T08:55:54.954",55,{"$f":"COUNTIFS(Test,A943,Nimi,B943,Aeg,\">=\"&C943)","v":3}]
["Test01","Hans Kukk","2019-11-22T18:31:22.279",53,{"$f":"COUNTIFS(Test,A944,Nimi,B944,Aeg,\">=\"&C944)","v":2}]
["Test03","Egert Vint","2019-11-17T10:20:35.570",67,{"$f":"COUNTIFS(Test,A945,Nimi,B945,Aeg,\">=\"&C945)","v":4}]
["Test01","Brita Kaljula","2019-11-03T16:54:28.454",43,{"$f":"COUNTIFS(Test,A946,Nimi,B946,Aeg,\">=\"&C946)","v":9}]
["Test04","Anette Lepp","2019-11-11T19:46:20.215",24,{"$f":"COUNTIFS(Test,A947,Nimi,B947,Aeg,\">=\"&C947)","v":6}]
["Test04","Jaagup Kivi","2019-11-18T18:08:38.035",47,{"$f":"COUNTIFS(Test,A948,Nimi,B948,Aeg,\">=\"&C948)","v":4}]
["Test03","Egert Vint","2019-11-28T08:51:58.986",84,{"$f":"COUNTIFS(Test,A949,Nimi,B949,Aeg,\">=\"&C949)","v":2}]
["Test02","Jana Kiisk","2019-11-30T23:53:33.008",71,{"$f":"COUNTIFS(Test,A950,Nimi,B950,Aeg,\">=\"&C950)","v":1}]
["Test03","Joonas Haljas","2019-11-21T22:38:26.774",31,{"$f":"COUNTIFS(Test,A951,Nimi,B951,Aeg,\">=\"&C951)","v":4}]
["Test04","Sander Kell","2019-11-14T20:55:57.581",93,{"$f":"COUNTIFS(Test,A952,Nimi,B952,Aeg,\">=\"&C952)","v":4}]
["Test01","Kertu Heinsoo","2019-11-05T14:32:29.687",59,{"$f":"COUNTIFS(Test,A953,Nimi,B953,Aeg,\">=\"&C953)","v":10}]
["Test01","Rasmus Kroon","2019-11-30T20:06:31.034",74,{"$f":"COUNTIFS(Test,A954,Nimi,B954,Aeg,\">=\"&C954)","v":1}]
["Test03","Anette Lepp","2019-11-19T09:40:16.888",46,{"$f":"COUNTIFS(Test,A955,Nimi,B955,Aeg,\">=\"&C955)","v":5}]
["Test01","Karin Saar","2019-11-21T12:15:43.567",40,{"$f":"COUNTIFS(Test,A956,Nimi,B956,Aeg,\">=\"&C956)","v":4}]
["Test02","Getlin Allas","2019-11-21T23:32:09.425",87,{"$f":"COUNTIFS(Test,A957,Nimi,B957,Aeg,\">=\"&C957)","v":5}]
["Test01","Sander Kell","2019-11-24T15:51:14.614",80,{"$f":"COUNTIFS(Test,A958,Nimi,B958,Aeg,\">=\"&C958)","v":3}]
["Test01","Joonas Haljas","2019-11-27T10:39:49.644",62,{"$f":"COUNTIFS(Test,A959,Nimi,B959,Aeg,\">=\"&C959)","v":3}]
["Test02","Jana Kiisk","2019-11-06T17:50:58.762",82,{"$f":"COUNTIFS(Test,A960,Nimi,B960,Aeg,\">=\"&C960)","v":10}]
["Test03","Paul Hein","2019-11-30T17:24:02.934",38,{"$f":"COUNTIFS(Test,A961,Nimi,B961,Aeg,\">=\"&C961)","v":1}]
["Test02","Mihkel Kulp","2019-11-29T16:43:32.509",53,{"$f":"COUNTIFS(Test,A962,Nimi,B962,Aeg,\">=\"&C962)","v":1}]
["Test03","Brita Kaljula","2019-11-04T09:03:23.351",38,{"$f":"COUNTIFS(Test,A963,Nimi,B963,Aeg,\">=\"&C963)","v":10}]
["Test01","Joonas Haljas","2019-11-19T19:05:38.681",55,{"$f":"COUNTIFS(Test,A964,Nimi,B964,Aeg,\">=\"&C964)","v":6}]
["Test02","Katrin Laurits","2019-11-18T16:00:32.186",82,{"$f":"COUNTIFS(Test,A965,Nimi,B965,Aeg,\">=\"&C965)","v":4}]
["Test03","Mihkel Kulp","2019-11-17T08:23:05.387",66,{"$f":"COUNTIFS(Test,A966,Nimi,B966,Aeg,\">=\"&C966)","v":6}]
["Test04","Hans Kukk","2019-11-06T21:07:12.019",32,{"$f":"COUNTIFS(Test,A967,Nimi,B967,Aeg,\">=\"&C967)","v":8}]
["Test04","Karin Saar","2019-11-06T11:10:52.475",62,{"$f":"COUNTIFS(Test,A968,Nimi,B968,Aeg,\">=\"&C968)","v":8}]
["Test04","Mihkel Kulp","2019-11-23T18:13:42.555",66,{"$f":"COUNTIFS(Test,A969,Nimi,B969,Aeg,\">=\"&C969)","v":2}]
["Test02","Egert Vint","2019-11-06T18:36:26.176",32,{"$f":"COUNTIFS(Test,A970,Nimi,B970,Aeg,\">=\"&C970)","v":5}]
["Test03","Lauri Vahtra","2019-11-08T21:42:48.116",59,{"$f":"COUNTIFS(Test,A971,Nimi,B971,Aeg,\">=\"&C971)","v":8}]
["Test04","Viktoria Lumi","2019-11-03T14:34:09.132",76,{"$f":"COUNTIFS(Test,A972,Nimi,B972,Aeg,\">=\"&C972)","v":8}]
["Test03","Jaagup Kivi","2019-11-15T15:37:32.777",74,{"$f":"COUNTIFS(Test,A973,Nimi,B973,Aeg,\">=\"&C973)","v":7}]
["Test04","Anna Koel","2019-11-16T20:25:28.203",76,{"$f":"COUNTIFS(Test,A974,Nimi,B974,Aeg,\">=\"&C974)","v":11}]
["Test04","Anette Lepp","2019-11-26T17:46:58.093",49,{"$f":"COUNTIFS(Test,A975,Nimi,B975,Aeg,\">=\"&C975)","v":1}]
["Test03","Maarja Pihlak","2019-11-05T17:17:21.018",57,{"$f":"COUNTIFS(Test,A976,Nimi,B976,Aeg,\">=\"&C976)","v":5}]
["Test01","Viktoria Lumi","2019-11-10T20:03:43.840",37,{"$f":"COUNTIFS(Test,A977,Nimi,B977,Aeg,\">=\"&C977)","v":5}]
["Test01","Kertu Heinsoo","2019-11-20T10:57:22.837",43,{"$f":"COUNTIFS(Test,A978,Nimi,B978,Aeg,\">=\"&C978)","v":6}]
["Test03","Martin Aavik","2019-11-08T17:56:07.804",65,{"$f":"COUNTIFS(Test,A979,Nimi,B979,Aeg,\">=\"&C979)","v":12}]
["Test04","Diana Taal","2019-11-07T17:59:20.943",22,{"$f":"COUNTIFS(Test,A980,Nimi,B980,Aeg,\">=\"&C980)","v":8}]
["Test04","Paul Hein","2019-11-13T23:08:18.586",62,{"$f":"COUNTIFS(Test,A981,Nimi,B981,Aeg,\">=\"&C981)","v":4}]
["Test02","Hans Kukk","2019-11-01T13:49:18.493",77,{"$f":"COUNTIFS(Test,A982,Nimi,B982,Aeg,\">=\"&C982)","v":8}]
["Test03","Erik Pärn","2019-11-25T15:36:04.061",84,{"$f":"COUNTIFS(Test,A983,Nimi,B983,Aeg,\">=\"&C983)","v":2}]
["Test04","Katrin Laurits","2019-11-20T12:23:05.502",66,{"$f":"COUNTIFS(Test,A984,Nimi,B984,Aeg,\">=\"&C984)","v":2}]
["Test03","Getlin Allas","2019-11-06T21:28:11.848",85,{"$f":"COUNTIFS(Test,A985,Nimi,B985,Aeg,\">=\"&C985)","v":7}]
["Test01","Diana Taal","2019-11-05T12:32:50.369",77,{"$f":"COUNTIFS(Test,A986,Nimi,B986,Aeg,\">=\"&C986)","v":6}]
["Test04","Emili Loorits","2019-11-21T11:35:15.314",38,{"$f":"COUNTIFS(Test,A987,Nimi,B987,Aeg,\">=\"&C987)","v":2}]
["Test01","Hanna Laid","2019-11-05T23:42:28.106",88,{"$f":"COUNTIFS(Test,A988,Nimi,B988,Aeg,\">=\"&C988)","v":9}]
["Test04","Getlin Allas","2019-11-26T14:06:28.232",89,{"$f":"COUNTIFS(Test,A989,Nimi,B989,Aeg,\">=\"&C989)","v":1}]
["Test03","Armin Kaasik","2019-11-28T16:40:37.716",100,{"$f":"COUNTIFS(Test,A990,Nimi,B990,Aeg,\">=\"&C990)","v":2}]
["Test02","Getlin Allas","2019-11-09T08:16:19.348",47,{"$f":"COUNTIFS(Test,A991,Nimi,B991,Aeg,\">=\"&C991)","v":9}]
["Test03","Artur Piiri","2019-11-16T08:48:19.491",74,{"$f":"COUNTIFS(Test,A992,Nimi,B992,Aeg,\">=\"&C992)","v":7}]
["Test04","Hanna Laid","2019-11-06T15:31:44.623",90,{"$f":"COUNTIFS(Test,A993,Nimi,B993,Aeg,\">=\"&C993)","v":13}]
["Test02","Armin Kaasik","2019-11-22T22:23:54.649",35,{"$f":"COUNTIFS(Test,A994,Nimi,B994,Aeg,\">=\"&C994)","v":3}]
["Test04","Maarja Pihlak","2019-11-17T22:53:42.577",79,{"$f":"COUNTIFS(Test,A995,Nimi,B995,Aeg,\">=\"&C995)","v":3}]
["Test01","Brita Kaljula","2019-11-27T09:29:48.287",88,{"$f":"COUNTIFS(Test,A996,Nimi,B996,Aeg,\">=\"&C996)","v":2}]
["Test03","Diana Taal","2019-11-29T23:02:14.915",48,{"$f":"COUNTIFS(Test,A997,Nimi,B997,Aeg,\">=\"&C997)","v":1}]
["Test02","Artur Piiri","2019-11-09T13:02:14.646",97,{"$f":"COUNTIFS(Test,A998,Nimi,B998,Aeg,\">=\"&C998)","v":3}]
["Test02","Kristina Merila","2019-11-07T12:10:33.484",98,{"$f":"COUNTIFS(Test,A999,Nimi,B999,Aeg,\">=\"&C999)","v":14}]
["Test02","Viktoria Lumi","2019-11-08T23:41:46.359",49,{"$f":"COUNTIFS(Test,A1000,Nimi,B1000,Aeg,\">=\"&C1000)","v":8}]
["Test03","Lauri Vahtra","2019-11-17T11:13:26.031",34,{"$f":"COUNTIFS(Test,A1001,Nimi,B1001,Aeg,\">=\"&C1001)","v":5}]
["Test01","Urmas Lõhmus","2019-11-19T08:19:50.203",42,{"$f":"COUNTIFS(Test,A1002,Nimi,B1002,Aeg,\">=\"&C1002)","v":2}]
["Test03","Anna Koel","2019-11-15T11:25:36.132",81,{"$f":"COUNTIFS(Test,A1003,Nimi,B1003,Aeg,\">=\"&C1003)","v":2}]
["Test03","Carmen Sõrmus","2019-11-18T10:46:43.464",57,{"$f":"COUNTIFS(Test,A1004,Nimi,B1004,Aeg,\">=\"&C1004)","v":2}]
["Test01","Robert Lentso","2019-11-26T20:35:19.526",30,{"$f":"COUNTIFS(Test,A1005,Nimi,B1005,Aeg,\">=\"&C1005)","v":3}]
["Test01","Anna Koel","2019-11-06T23:54:10.604",51,{"$f":"COUNTIFS(Test,A1006,Nimi,B1006,Aeg,\">=\"&C1006)","v":3}]
["Test02","Carmen Sõrmus","2019-11-15T10:14:21.417",73,{"$f":"COUNTIFS(Test,A1007,Nimi,B1007,Aeg,\">=\"&C1007)","v":5}]
["Test04","Martin Aavik","2019-11-26T08:59:27.084",47,{"$f":"COUNTIFS(Test,A1008,Nimi,B1008,Aeg,\">=\"&C1008)","v":2}]
["Test01","Katrin Laurits","2019-11-05T15:45:53.853",29,{"$f":"COUNTIFS(Test,A1009,Nimi,B1009,Aeg,\">=\"&C1009)","v":5}]
["Test04","Reimo Kala","2019-11-26T19:27:05.872",79,{"$f":"COUNTIFS(Test,A1010,Nimi,B1010,Aeg,\">=\"&C1010)","v":2}]
["Test04","Jaagup Kivi","2019-11-06T10:06:42.272",27,{"$f":"COUNTIFS(Test,A1011,Nimi,B1011,Aeg,\">=\"&C1011)","v":12}]
["Test04","Anette Lepp","2019-11-03T19:28:50.441",80,{"$f":"COUNTIFS(Test,A1012,Nimi,B1012,Aeg,\">=\"&C1012)","v":11}]
["Test01","Martin Aavik","2019-11-13T20:50:23.135",91,{"$f":"COUNTIFS(Test,A1013,Nimi,B1013,Aeg,\">=\"&C1013)","v":7}]
["Test01","Anette Lepp","2019-11-06T13:17:54.820",94,{"$f":"COUNTIFS(Test,A1014,Nimi,B1014,Aeg,\">=\"&C1014)","v":9}]
["Test03","Robert Lentso","2019-11-07T22:28:11.177",68,{"$f":"COUNTIFS(Test,A1015,Nimi,B1015,Aeg,\">=\"&C1015)","v":12}]
["Test02","Viktoria Lumi","2019-11-13T14:26:10.409",78,{"$f":"COUNTIFS(Test,A1016,Nimi,B1016,Aeg,\">=\"&C1016)","v":7}]
["Test03","Armin Kaasik","2019-11-29T14:15:58.537",60,{"$f":"COUNTIFS(Test,A1017,Nimi,B1017,Aeg,\">=\"&C1017)","v":1}]
["Test04","Anna Koel","2019-11-18T12:05:42.152",63,{"$f":"COUNTIFS(Test,A1018,Nimi,B1018,Aeg,\">=\"&C1018)","v":10}]
["Test03","Robert Lentso","2019-11-30T19:38:46.649",58,{"$f":"COUNTIFS(Test,A1019,Nimi,B1019,Aeg,\">=\"&C1019)","v":1}]
["Test02","Karin Saar","2019-11-10T20:54:53.016",50,{"$f":"COUNTIFS(Test,A1020,Nimi,B1020,Aeg,\">=\"&C1020)","v":8}]
["Test02","Anette Lepp","2019-11-10T18:33:56.712",99,{"$f":"COUNTIFS(Test,A1021,Nimi,B1021,Aeg,\">=\"&C1021)","v":5}]
["Test02","Paul Hein","2019-11-09T12:42:09.889",88,{"$f":"COUNTIFS(Test,A1022,Nimi,B1022,Aeg,\">=\"&C1022)","v":7}]
["Test01","Kertu Heinsoo","2019-11-27T11:56:43.773",90,{"$f":"COUNTIFS(Test,A1023,Nimi,B1023,Aeg,\">=\"&C1023)","v":4}]
["Test04","Robert Lentso","2019-11-14T19:33:47.368",38,{"$f":"COUNTIFS(Test,A1024,Nimi,B1024,Aeg,\">=\"&C1024)","v":4}]
["Test03","Karin Saar","2019-11-21T22:39:26.897",39,{"$f":"COUNTIFS(Test,A1025,Nimi,B1025,Aeg,\">=\"&C1025)","v":4}]
["Test02","Armin Kaasik","2019-11-30T20:03:57.271",61,{"$f":"COUNTIFS(Test,A1026,Nimi,B1026,Aeg,\">=\"&C1026)","v":1}]
["Test01","Viktoria Lumi","2019-11-04T20:56:11.367",24,{"$f":"COUNTIFS(Test,A1027,Nimi,B1027,Aeg,\">=\"&C1027)","v":8}]
["Test04","Markus Niidas","2019-11-11T09:06:51.450",92,{"$f":"COUNTIFS(Test,A1028,Nimi,B1028,Aeg,\">=\"&C1028)","v":3}]
["Test04","Brita Kaljula","2019-11-13T09:51:55.825",100,{"$f":"COUNTIFS(Test,A1029,Nimi,B1029,Aeg,\">=\"&C1029)","v":5}]
["Test03","Tarvo Järv","2019-11-14T12:35:59.930",27,{"$f":"COUNTIFS(Test,A1030,Nimi,B1030,Aeg,\">=\"&C1030)","v":6}]
["Test01","Jana Kiisk","2019-11-06T14:58:58.241",57,{"$f":"COUNTIFS(Test,A1031,Nimi,B1031,Aeg,\">=\"&C1031)","v":9}]
["Test02","Martin Aavik","2019-11-19T09:46:17.483",28,{"$f":"COUNTIFS(Test,A1032,Nimi,B1032,Aeg,\">=\"&C1032)","v":2}]
["Test04","Katrin Laurits","2019-11-08T17:24:24.131",81,{"$f":"COUNTIFS(Test,A1033,Nimi,B1033,Aeg,\">=\"&C1033)","v":8}]
["Test01","Hans Kukk","2019-11-05T16:57:03.584",91,{"$f":"COUNTIFS(Test,A1034,Nimi,B1034,Aeg,\">=\"&C1034)","v":7}]
["Test03","Jana Kiisk","2019-11-11T11:56:30.215",87,{"$f":"COUNTIFS(Test,A1035,Nimi,B1035,Aeg,\">=\"&C1035)","v":4}]
["Test02","Katrin Laurits","2019-11-24T17:01:08.744",53,{"$f":"COUNTIFS(Test,A1036,Nimi,B1036,Aeg,\">=\"&C1036)","v":3}]
["Test02","Karin Saar","2019-11-05T14:28:50.382",27,{"$f":"COUNTIFS(Test,A1037,Nimi,B1037,Aeg,\">=\"&C1037)","v":11}]
["Test03","Kristina Merila","2019-11-11T10:51:10.874",49,{"$f":"COUNTIFS(Test,A1038,Nimi,B1038,Aeg,\">=\"&C1038)","v":8}]
["Test04","Anna Koel","2019-11-11T11:34:36.621",39,{"$f":"COUNTIFS(Test,A1039,Nimi,B1039,Aeg,\">=\"&C1039)","v":14}]
["Test02","Hans Kukk","2019-11-17T15:17:21.990",65,{"$f":"COUNTIFS(Test,A1040,Nimi,B1040,Aeg,\">=\"&C1040)","v":3}]
["Test04","Anette Lepp","2019-11-10T09:23:21.234",78,{"$f":"COUNTIFS(Test,A1041,Nimi,B1041,Aeg,\">=\"&C1041)","v":8}]
["Test01","Diana Taal","2019-11-26T11:33:34.975",28,{"$f":"COUNTIFS(Test,A1042,Nimi,B1042,Aeg,\">=\"&C1042)","v":2}]
["Test03","Robert Lentso","2019-11-15T18:07:34.693",23,{"$f":"COUNTIFS(Test,A1043,Nimi,B1043,Aeg,\">=\"&C1043)","v":10}]
["Test03","Martin Aavik","2019-11-13T12:27:39.597",96,{"$f":"COUNTIFS(Test,A1044,Nimi,B1044,Aeg,\">=\"&C1044)","v":9}]
["Test02","Getlin Allas","2019-11-25T16:49:56.561",90,{"$f":"COUNTIFS(Test,A1045,Nimi,B1045,Aeg,\">=\"&C1045)","v":3}]
["Test01","Kertu Heinsoo","2019-11-15T08:35:50.023",74,{"$f":"COUNTIFS(Test,A1046,Nimi,B1046,Aeg,\">=\"&C1046)","v":9}]
["Test01","Carmen Sõrmus","2019-11-10T13:47:18.991",47,{"$f":"COUNTIFS(Test,A1047,Nimi,B1047,Aeg,\">=\"&C1047)","v":5}]
["Test02","Katrin Laurits","2019-11-30T21:42:34.400",40,{"$f":"COUNTIFS(Test,A1048,Nimi,B1048,Aeg,\">=\"&C1048)","v":1}]
["Test03","Paul Hein","2019-11-29T09:30:45.221",44,{"$f":"COUNTIFS(Test,A1049,Nimi,B1049,Aeg,\">=\"&C1049)","v":2}]
["Test02","Joonas Haljas","2019-11-12T09:03:56.181",67,{"$f":"COUNTIFS(Test,A1050,Nimi,B1050,Aeg,\">=\"&C1050)","v":8}]
["Test01","Markus Niidas","2019-11-14T12:51:18.097",25,{"$f":"COUNTIFS(Test,A1051,Nimi,B1051,Aeg,\">=\"&C1051)","v":5}]
["Test02","Mihkel Kulp","2019-11-17T08:42:36.640",86,{"$f":"COUNTIFS(Test,A1052,Nimi,B1052,Aeg,\">=\"&C1052)","v":6}]
["Test01","Diana Taal","2019-11-13T17:52:37.136",71,{"$f":"COUNTIFS(Test,A1053,Nimi,B1053,Aeg,\">=\"&C1053)","v":4}]
["Test03","Kertu Heinsoo","2019-11-11T15:30:14.787",31,{"$f":"COUNTIFS(Test,A1054,Nimi,B1054,Aeg,\">=\"&C1054)","v":9}]
["Test02","Katrin Laurits","2019-11-26T11:00:08.073",24,{"$f":"COUNTIFS(Test,A1055,Nimi,B1055,Aeg,\">=\"&C1055)","v":2}]
["Test03","Viktoria Lumi","2019-11-28T21:09:33.722",100,{"$f":"COUNTIFS(Test,A1056,Nimi,B1056,Aeg,\">=\"&C1056)","v":2}]
["Test02","Lauri Vahtra","2019-11-18T21:34:57.578",54,{"$f":"COUNTIFS(Test,A1057,Nimi,B1057,Aeg,\">=\"&C1057)","v":6}]
["Test03","Martin Aavik","2019-11-14T19:58:12.785",38,{"$f":"COUNTIFS(Test,A1058,Nimi,B1058,Aeg,\">=\"&C1058)","v":8}]
["Test02","Paul Hein","2019-11-02T09:01:59.802",32,{"$f":"COUNTIFS(Test,A1059,Nimi,B1059,Aeg,\">=\"&C1059)","v":9}]
["Test03","Artur Piiri","2019-11-13T15:27:30.617",25,{"$f":"COUNTIFS(Test,A1060,Nimi,B1060,Aeg,\">=\"&C1060)","v":9}]
["Test02","Paul Hein","2019-11-22T09:47:07.259",25,{"$f":"COUNTIFS(Test,A1061,Nimi,B1061,Aeg,\">=\"&C1061)","v":4}]
["Test03","Emili Loorits","2019-11-29T16:36:40.042",23,{"$f":"COUNTIFS(Test,A1062,Nimi,B1062,Aeg,\">=\"&C1062)","v":1}]
["Test01","Anna Koel","2019-11-17T16:50:33.327",37,{"$f":"COUNTIFS(Test,A1063,Nimi,B1063,Aeg,\">=\"&C1063)","v":1}]
["Test04","Karin Saar","2019-11-13T09:47:09.718",51,{"$f":"COUNTIFS(Test,A1064,Nimi,B1064,Aeg,\">=\"&C1064)","v":5}]
["Test02","Kertu Heinsoo","2019-11-05T15:58:33.898",70,{"$f":"COUNTIFS(Test,A1065,Nimi,B1065,Aeg,\">=\"&C1065)","v":8}]
["Test01","Getlin Allas","2019-11-15T16:06:55.761",97,{"$f":"COUNTIFS(Test,A1066,Nimi,B1066,Aeg,\">=\"&C1066)","v":5}]
["Test03","Hanna Laid","2019-11-14T19:48:47.910",23,{"$f":"COUNTIFS(Test,A1067,Nimi,B1067,Aeg,\">=\"&C1067)","v":3}]
["Test02","Carmen Sõrmus","2019-11-24T17:25:43.387",54,{"$f":"COUNTIFS(Test,A1068,Nimi,B1068,Aeg,\">=\"&C1068)","v":2}]
["Test01","Brita Kaljula","2019-11-26T20:02:32.650",81,{"$f":"COUNTIFS(Test,A1069,Nimi,B1069,Aeg,\">=\"&C1069)","v":3}]
["Test03","Reimo Kala","2019-11-01T17:50:16.330",71,{"$f":"COUNTIFS(Test,A1070,Nimi,B1070,Aeg,\">=\"&C1070)","v":6}]
["Test03","Sander Kell","2019-11-13T13:36:17.585",93,{"$f":"COUNTIFS(Test,A1071,Nimi,B1071,Aeg,\">=\"&C1071)","v":3}]
["Test01","Hans Kukk","2019-11-03T11:45:09.162",89,{"$f":"COUNTIFS(Test,A1072,Nimi,B1072,Aeg,\">=\"&C1072)","v":8}]
["Test04","Reimo Kala","2019-11-30T11:29:00.525",92,{"$f":"COUNTIFS(Test,A1073,Nimi,B1073,Aeg,\">=\"&C1073)","v":1}]
["Test03","Anette Lepp","2019-11-09T21:09:12.499",52,{"$f":"COUNTIFS(Test,A1074,Nimi,B1074,Aeg,\">=\"&C1074)","v":9}]
["Test01","Jana Kiisk","2019-11-29T22:48:26.564",41,{"$f":"COUNTIFS(Test,A1075,Nimi,B1075,Aeg,\">=\"&C1075)","v":1}]
["Test01","Joonas Haljas","2019-11-03T13:15:09.163",20,{"$f":"COUNTIFS(Test,A1076,Nimi,B1076,Aeg,\">=\"&C1076)","v":11}]
["Test03","Kertu Heinsoo","2019-11-20T14:10:49.346",58,{"$f":"COUNTIFS(Test,A1077,Nimi,B1077,Aeg,\">=\"&C1077)","v":7}]
["Test04","Erik Pärn","2019-11-01T13:56:54.718",83,{"$f":"COUNTIFS(Test,A1078,Nimi,B1078,Aeg,\">=\"&C1078)","v":8}]
["Test01","Katrin Laurits","2019-11-17T12:49:51.852",29,{"$f":"COUNTIFS(Test,A1079,Nimi,B1079,Aeg,\">=\"&C1079)","v":3}]
["Test02","Getlin Allas","2019-11-12T15:49:40.885",44,{"$f":"COUNTIFS(Test,A1080,Nimi,B1080,Aeg,\">=\"&C1080)","v":7}]
["Test02","Viktoria Lumi","2019-11-26T09:15:21.281",28,{"$f":"COUNTIFS(Test,A1081,Nimi,B1081,Aeg,\">=\"&C1081)","v":1}]
["Test04","Jaagup Kivi","2019-11-15T22:45:39.706",35,{"$f":"COUNTIFS(Test,A1082,Nimi,B1082,Aeg,\">=\"&C1082)","v":5}]
["Test02","Urmas Lõhmus","2019-11-22T08:20:19.946",61,{"$f":"COUNTIFS(Test,A1083,Nimi,B1083,Aeg,\">=\"&C1083)","v":5}]
["Test01","Brita Kaljula","2019-11-12T13:36:14.599",20,{"$f":"COUNTIFS(Test,A1084,Nimi,B1084,Aeg,\">=\"&C1084)","v":6}]
["Test04","Martin Aavik","2019-11-14T21:06:36.421",78,{"$f":"COUNTIFS(Test,A1085,Nimi,B1085,Aeg,\">=\"&C1085)","v":5}]
["Test04","Kristina Merila","2019-11-08T08:59:49.990",48,{"$f":"COUNTIFS(Test,A1086,Nimi,B1086,Aeg,\">=\"&C1086)","v":8}]
["Test04","Martin Aavik","2019-11-13T17:25:26.004",41,{"$f":"COUNTIFS(Test,A1087,Nimi,B1087,Aeg,\">=\"&C1087)","v":6}]
["Test02","Diana Taal","2019-11-16T22:01:56.331",88,{"$f":"COUNTIFS(Test,A1088,Nimi,B1088,Aeg,\">=\"&C1088)","v":5}]
["Test02","Kristina Merila","2019-11-28T11:37:49.747",53,{"$f":"COUNTIFS(Test,A1089,Nimi,B1089,Aeg,\">=\"&C1089)","v":3}]
["Test04","Mihkel Kulp","2019-11-07T09:25:55.584",44,{"$f":"COUNTIFS(Test,A1090,Nimi,B1090,Aeg,\">=\"&C1090)","v":6}]
["Test01","Sander Kell","2019-11-28T21:53:13.018",46,{"$f":"COUNTIFS(Test,A1091,Nimi,B1091,Aeg,\">=\"&C1091)","v":1}]
["Test02","Mihkel Kulp","2019-11-05T10:04:00.377",90,{"$f":"COUNTIFS(Test,A1092,Nimi,B1092,Aeg,\">=\"&C1092)","v":10}]
["Test01","Hanna Laid","2019-11-24T12:35:27.589",85,{"$f":"COUNTIFS(Test,A1093,Nimi,B1093,Aeg,\">=\"&C1093)","v":2}]
["Test01","Jana Kiisk","2019-11-14T11:04:47.060",47,{"$f":"COUNTIFS(Test,A1094,Nimi,B1094,Aeg,\">=\"&C1094)","v":7}]
["Test02","Egert Vint","2019-11-10T18:40:42.448",33,{"$f":"COUNTIFS(Test,A1095,Nimi,B1095,Aeg,\">=\"&C1095)","v":4}]
["Test01","Erik Pärn","2019-11-29T17:33:05.968",87,{"$f":"COUNTIFS(Test,A1096,Nimi,B1096,Aeg,\">=\"&C1096)","v":1}]
["Test01","Brita Kaljula","2019-11-11T21:55:15.110",54,{"$f":"COUNTIFS(Test,A1097,Nimi,B1097,Aeg,\">=\"&C1097)","v":7}]
["Test03","Brita Kaljula","2019-11-03T21:07:25.328",44,{"$f":"COUNTIFS(Test,A1098,Nimi,B1098,Aeg,\">=\"&C1098)","v":11}]
["Test01","Hans Kukk","2019-11-16T11:58:22.756",100,{"$f":"COUNTIFS(Test,A1099,Nimi,B1099,Aeg,\">=\"&C1099)","v":3}]
["Test01","Hanna Laid","2019-11-16T17:39:12.667",85,{"$f":"COUNTIFS(Test,A1100,Nimi,B1100,Aeg,\">=\"&C1100)","v":7}]
["Test01","Joonas Haljas","2019-11-22T15:38:26.465",47,{"$f":"COUNTIFS(Test,A1101,Nimi,B1101,Aeg,\">=\"&C1101)","v":4}]
["Test04","Brita Kaljula","2019-11-09T21:56:28.270",97,{"$f":"COUNTIFS(Test,A1102,Nimi,B1102,Aeg,\">=\"&C1102)","v":7}]
["Test03","Carmen Sõrmus","2019-11-09T22:51:02.591",67,{"$f":"COUNTIFS(Test,A1103,Nimi,B1103,Aeg,\">=\"&C1103)","v":5}]
["Test04","Kaspar Raude","2019-11-18T22:57:37.132",89,{"$f":"COUNTIFS(Test,A1104,Nimi,B1104,Aeg,\">=\"&C1104)","v":2}]
["Test02","Getlin Allas","2019-11-10T17:34:09.998",50,{"$f":"COUNTIFS(Test,A1105,Nimi,B1105,Aeg,\">=\"&C1105)","v":8}]
["Test04","Kristina Merila","2019-11-20T14:37:20.761",20,{"$f":"COUNTIFS(Test,A1106,Nimi,B1106,Aeg,\">=\"&C1106)","v":6}]
["Test03","Erik Pärn","2019-11-09T23:39:59.943",56,{"$f":"COUNTIFS(Test,A1107,Nimi,B1107,Aeg,\">=\"&C1107)","v":9}]
["Test03","Brita Kaljula","2019-11-13T20:15:58.434",75,{"$f":"COUNTIFS(Test,A1108,Nimi,B1108,Aeg,\">=\"&C1108)","v":8}]
["Test01","Anna Koel","2019-11-04T20:12:16.012",72,{"$f":"COUNTIFS(Test,A1109,Nimi,B1109,Aeg,\">=\"&C1109)","v":4}]
["Test04","Erik Pärn","2019-11-12T14:14:44.045",45,{"$f":"COUNTIFS(Test,A1110,Nimi,B1110,Aeg,\">=\"&C1110)","v":7}]
["Test02","Karin Saar","2019-11-12T09:53:30.342",51,{"$f":"COUNTIFS(Test,A1111,Nimi,B1111,Aeg,\">=\"&C1111)","v":6}]
["Test04","Jaagup Kivi","2019-11-07T23:31:44.602",68,{"$f":"COUNTIFS(Test,A1112,Nimi,B1112,Aeg,\">=\"&C1112)","v":10}]
["Test04","Kaspar Raude","2019-11-23T18:16:04.740",56,{"$f":"COUNTIFS(Test,A1113,Nimi,B1113,Aeg,\">=\"&C1113)","v":1}]
["Test01","Kaspar Raude","2019-11-29T19:36:59.528",44,{"$f":"COUNTIFS(Test,A1114,Nimi,B1114,Aeg,\">=\"&C1114)","v":1}]
["Test02","Robert Lentso","2019-11-18T10:30:44.801",40,{"$f":"COUNTIFS(Test,A1115,Nimi,B1115,Aeg,\">=\"&C1115)","v":4}]
["Test02","Jana Kiisk","2019-11-25T19:47:55.510",81,{"$f":"COUNTIFS(Test,A1116,Nimi,B1116,Aeg,\">=\"&C1116)","v":3}]
["Test01","Alari Suur","2019-11-23T22:47:38.292",83,{"$f":"COUNTIFS(Test,A1117,Nimi,B1117,Aeg,\">=\"&C1117)","v":3}]
["Test02","Sander Kell","2019-11-27T16:43:01.406",70,{"$f":"COUNTIFS(Test,A1118,Nimi,B1118,Aeg,\">=\"&C1118)","v":2}]
["Test04","Jaagup Kivi","2019-11-07T15:58:43.278",86,{"$f":"COUNTIFS(Test,A1119,Nimi,B1119,Aeg,\">=\"&C1119)","v":11}]
["Test02","Armin Kaasik","2019-11-13T19:27:10.334",23,{"$f":"COUNTIFS(Test,A1120,Nimi,B1120,Aeg,\">=\"&C1120)","v":7}]
["Test02","Rasmus Kroon","2019-11-02T12:16:23.131",88,{"$f":"COUNTIFS(Test,A1121,Nimi,B1121,Aeg,\">=\"&C1121)","v":7}]
["Test03","Kristina Merila","2019-11-16T16:10:16.708",29,{"$f":"COUNTIFS(Test,A1122,Nimi,B1122,Aeg,\">=\"&C1122)","v":5}]
["Test01","Joonas Haljas","2019-11-07T11:23:16.261",22,{"$f":"COUNTIFS(Test,A1123,Nimi,B1123,Aeg,\">=\"&C1123)","v":9}]
["Test03","Katrin Laurits","2019-11-22T17:47:05.624",99,{"$f":"COUNTIFS(Test,A1124,Nimi,B1124,Aeg,\">=\"&C1124)","v":3}]
["Test01","Kertu Heinsoo","2019-11-29T21:46:56.575",68,{"$f":"COUNTIFS(Test,A1125,Nimi,B1125,Aeg,\">=\"&C1125)","v":2}]
["Test03","Carmen Sõrmus","2019-11-02T14:23:33.650",25,{"$f":"COUNTIFS(Test,A1126,Nimi,B1126,Aeg,\">=\"&C1126)","v":7}]
["Test04","Erik Pärn","2019-11-27T19:51:07.444",98,{"$f":"COUNTIFS(Test,A1127,Nimi,B1127,Aeg,\">=\"&C1127)","v":2}]
["Test02","Reimo Kala","2019-11-25T16:45:53.501",90,{"$f":"COUNTIFS(Test,A1128,Nimi,B1128,Aeg,\">=\"&C1128)","v":1}]
["Test01","Rasmus Kroon","2019-11-30T10:31:53.027",67,{"$f":"COUNTIFS(Test,A1129,Nimi,B1129,Aeg,\">=\"&C1129)","v":2}]
["Test03","Brita Kaljula","2019-11-20T18:45:48.949",36,{"$f":"COUNTIFS(Test,A1130,Nimi,B1130,Aeg,\">=\"&C1130)","v":5}]
["Test04","Diana Taal","2019-11-12T14:52:57.026",26,{"$f":"COUNTIFS(Test,A1131,Nimi,B1131,Aeg,\">=\"&C1131)","v":4}]
["Test04","Carmen Sõrmus","2019-11-18T20:16:30.626",72,{"$f":"COUNTIFS(Test,A1132,Nimi,B1132,Aeg,\">=\"&C1132)","v":2}]
["Test02","Alari Suur","2019-11-16T15:07:14.419",60,{"$f":"COUNTIFS(Test,A1133,Nimi,B1133,Aeg,\">=\"&C1133)","v":2}]
["Test01","Katrin Laurits","2019-11-01T09:44:23.997",86,{"$f":"COUNTIFS(Test,A1134,Nimi,B1134,Aeg,\">=\"&C1134)","v":6}]
["Test01","Maarja Pihlak","2019-11-14T16:09:00.824",93,{"$f":"COUNTIFS(Test,A1135,Nimi,B1135,Aeg,\">=\"&C1135)","v":6}]
["Test01","Rasmus Kroon","2019-11-26T13:54:02.176",57,{"$f":"COUNTIFS(Test,A1136,Nimi,B1136,Aeg,\">=\"&C1136)","v":3}]
["Test02","Anette Lepp","2019-11-17T17:36:21.313",50,{"$f":"COUNTIFS(Test,A1137,Nimi,B1137,Aeg,\">=\"&C1137)","v":2}]
["Test03","Lauri Vahtra","2019-11-25T11:04:16.049",62,{"$f":"COUNTIFS(Test,A1138,Nimi,B1138,Aeg,\">=\"&C1138)","v":2}]
["Test03","Urmas Lõhmus","2019-11-25T12:46:20.455",51,{"$f":"COUNTIFS(Test,A1139,Nimi,B1139,Aeg,\">=\"&C1139)","v":2}]
["Test01","Brita Kaljula","2019-11-07T23:52:13.973",71,{"$f":"COUNTIFS(Test,A1140,Nimi,B1140,Aeg,\">=\"&C1140)","v":8}]
["Test02","Emili Loorits","2019-11-24T08:18:38.438",100,{"$f":"COUNTIFS(Test,A1141,Nimi,B1141,Aeg,\">=\"&C1141)","v":1}]
["Test03","Anna Koel","2019-11-10T09:39:13.939",30,{"$f":"COUNTIFS(Test,A1142,Nimi,B1142,Aeg,\">=\"&C1142)","v":4}]
["Test01","Diana Taal","2019-11-24T16:53:37.672",79,{"$f":"COUNTIFS(Test,A1143,Nimi,B1143,Aeg,\">=\"&C1143)","v":3}]
["Test03","Katrin Laurits","2019-11-19T22:23:58.229",31,{"$f":"COUNTIFS(Test,A1144,Nimi,B1144,Aeg,\">=\"&C1144)","v":4}]
["Test02","Hans Kukk","2019-11-28T20:04:12.479",89,{"$f":"COUNTIFS(Test,A1145,Nimi,B1145,Aeg,\">=\"&C1145)","v":2}]
["Test03","Hans Kukk","2019-11-20T15:14:04.836",67,{"$f":"COUNTIFS(Test,A1146,Nimi,B1146,Aeg,\">=\"&C1146)","v":7}]
["Test03","Armin Kaasik","2019-11-20T09:10:11.366",47,{"$f":"COUNTIFS(Test,A1147,Nimi,B1147,Aeg,\">=\"&C1147)","v":5}]
["Test01","Jana Kiisk","2019-11-13T19:51:08.649",84,{"$f":"COUNTIFS(Test,A1148,Nimi,B1148,Aeg,\">=\"&C1148)","v":8}]
["Test04","Kaspar Raude","2019-11-10T22:11:54.699",75,{"$f":"COUNTIFS(Test,A1149,Nimi,B1149,Aeg,\">=\"&C1149)","v":4}]
["Test04","Sander Kell","2019-11-17T18:16:21.086",47,{"$f":"COUNTIFS(Test,A1150,Nimi,B1150,Aeg,\">=\"&C1150)","v":3}]
["Test01","Carmen Sõrmus","2019-11-09T14:15:14.941",70,{"$f":"COUNTIFS(Test,A1151,Nimi,B1151,Aeg,\">=\"&C1151)","v":7}]
["Test02","Getlin Allas","2019-11-02T23:48:46.233",20,{"$f":"COUNTIFS(Test,A1152,Nimi,B1152,Aeg,\">=\"&C1152)","v":14}]
["Test03","Armin Kaasik","2019-11-23T23:10:51.553",44,{"$f":"COUNTIFS(Test,A1153,Nimi,B1153,Aeg,\">=\"&C1153)","v":4}]
["Test04","Tarvo Järv","2019-11-14T17:26:18.211",90,{"$f":"COUNTIFS(Test,A1154,Nimi,B1154,Aeg,\">=\"&C1154)","v":5}]
["Test03","Diana Taal","2019-11-21T11:55:44.979",63,{"$f":"COUNTIFS(Test,A1155,Nimi,B1155,Aeg,\">=\"&C1155)","v":6}]
["Test03","Carmen Sõrmus","2019-11-17T17:18:00.298",20,{"$f":"COUNTIFS(Test,A1156,Nimi,B1156,Aeg,\">=\"&C1156)","v":3}]
["Test01","Martin Aavik","2019-11-19T22:34:39.151",65,{"$f":"COUNTIFS(Test,A1157,Nimi,B1157,Aeg,\">=\"&C1157)","v":5}]
["Test04","Emili Loorits","2019-11-18T14:02:44.434",25,{"$f":"COUNTIFS(Test,A1158,Nimi,B1158,Aeg,\">=\"&C1158)","v":4}]
["Test01","Rasmus Kroon","2019-11-15T11:13:06.513",50,{"$f":"COUNTIFS(Test,A1159,Nimi,B1159,Aeg,\">=\"&C1159)","v":9}]
["Test04","Jaagup Kivi","2019-11-04T14:12:21.400",59,{"$f":"COUNTIFS(Test,A1160,Nimi,B1160,Aeg,\">=\"&C1160)","v":13}]
["Test02","Erik Pärn","2019-11-10T10:51:10.361",38,{"$f":"COUNTIFS(Test,A1161,Nimi,B1161,Aeg,\">=\"&C1161)","v":10}]
["Test03","Carmen Sõrmus","2019-11-10T11:42:21.071",20,{"$f":"COUNTIFS(Test,A1162,Nimi,B1162,Aeg,\">=\"&C1162)","v":4}]
["Test03","Hans Kukk","2019-11-30T09:26:40.889",69,{"$f":"COUNTIFS(Test,A1163,Nimi,B1163,Aeg,\">=\"&C1163)","v":2}]
["Test04","Armin Kaasik","2019-11-06T11:49:58.143",42,{"$f":"COUNTIFS(Test,A1164,Nimi,B1164,Aeg,\">=\"&C1164)","v":8}]
["Test04","Karin Saar","2019-11-16T22:18:37.425",98,{"$f":"COUNTIFS(Test,A1165,Nimi,B1165,Aeg,\">=\"&C1165)","v":3}]
["Test04","Kristina Merila","2019-11-07T08:54:40.790",94,{"$f":"COUNTIFS(Test,A1166,Nimi,B1166,Aeg,\">=\"&C1166)","v":9}]
["Test02","Tarvo Järv","2019-11-04T19:50:49.206",86,{"$f":"COUNTIFS(Test,A1167,Nimi,B1167,Aeg,\">=\"&C1167)","v":12}]
["Test03","Martin Aavik","2019-11-30T19:23:16.883",51,{"$f":"COUNTIFS(Test,A1168,Nimi,B1168,Aeg,\">=\"&C1168)","v":1}]
["Test02","Emili Loorits","2019-11-20T13:07:51.520",73,{"$f":"COUNTIFS(Test,A1169,Nimi,B1169,Aeg,\">=\"&C1169)","v":3}]
["Test03","Erik Pärn","2019-11-24T10:24:24.044",44,{"$f":"COUNTIFS(Test,A1170,Nimi,B1170,Aeg,\">=\"&C1170)","v":4}]
["Test02","Emili Loorits","2019-11-12T21:31:26.691",47,{"$f":"COUNTIFS(Test,A1171,Nimi,B1171,Aeg,\">=\"&C1171)","v":6}]
["Test02","Mihkel Kulp","2019-11-28T12:41:37.976",82,{"$f":"COUNTIFS(Test,A1172,Nimi,B1172,Aeg,\">=\"&C1172)","v":3}]
["Test03","Karin Saar","2019-11-30T15:13:23.961",89,{"$f":"COUNTIFS(Test,A1173,Nimi,B1173,Aeg,\">=\"&C1173)","v":1}]

{"sheet":"testid (2)","index":3,"n_rows":1173,"n_cols":13,"rows_kept":1173,"cut":false,"hidden":true,"merged":[]}
[null,null,null,null,null,"08:00:00","23:55:00",null,null,"Test01","Test02","Test03","Test04"]
[null,null,null,null,null,"2019-11-01","2019-11-30",null,"Katrin Laurits",{"$f":"COUNTIFS($A:$A,J$1,$B:$B,$I2)","v":10},{"$f":"COUNTIFS($A:$A,K$1,$B:$B,$I2)","v":7},10,8]
[null,null,null,null,null,null,null,null,"Anette Lepp",{"$f":"COUNTIFS($A:$A,J$1,$B:$B,$I3)","v":6},8,10,7]
["Test","Nimi","Aeg","Tulemus",null,null,"Test01",null,"Reimo Kala",7,7,10,5]
[{"$f":"INDEX($G$4:$G$7,RANDBETWEEN(1,4))","v":"Test03"},{"$f":"INDEX($I$2:$I$36,RANDBETWEEN(1,35))","v":"Markus Niidas"},{"$f":"RANDBETWEEN($F$2,$G$2)+$F$1+RAND()*($G$1-$F$1)","v":"2019-11-17T23:32:28.184"},{"$f":"RANDBETWEEN(20,100)","v":57},null,null,"Test02",null,"Egert Vint",13,12,6,14]
[{"$f":"INDEX($G$4:$G$7,RANDBETWEEN(1,4))","v":"Test02"},{"$f":"INDEX($I$2:$I$36,RANDBETWEEN(1,35))","v":"Egert Vint"},{"$f":"RANDBETWEEN($F$2,$G$2)+$F$1+RAND()*($G$1-$F$1)","v":"2019-11-02T19:10:31.461"},{"$f":"RANDBETWEEN(20,100)","v":81},null,null,"Test03",null,"Carmen Sõrmus",11,8,5,17]
["Test01","Anna Koel","2019-11-11T16:07:42.342",25,null,null,"Test04",null,"Armin Kaasik",5,8,6,6]
["Test01","Artur Piiri","2019-11-11T19:30:25.092",89,null,null,null,null,"Jana Kiisk",5,5,4,6]
["Test03","Getlin Allas","2019-11-24T18:31:32.922",67,null,null,null,null,"Kaspar Raude",13,9,9,9]
["Test03","Tarvo Järv","2019-11-12T11:36:24.656",23,null,35,null,null,"Karin Saar",11,10,13,6]
["Test02","Lauri Vahtra","2019-11-18T22:49:49.800",90,null,4,null,null,"Hanna Laid",4,4,10,11]
["Test04","Diana Taal","2019-11-30T12:24:30.892",31,null,5,null,null,"Mihkel Kulp",7,11,3,13]
["Test04","Maarja Pihlak","2019-11-18T16:24:00.655",68,null,{"$f":"F10*F11*F12","v":700},null,null,"Markus Niidas",10,17,11,12]
["Test03","Emili Loorits","2019-11-21T16:12:45.132",81,null,null,null,null,"Alari Suur",6,11,7,8]
["Test01","Kertu Heinsoo","2019-11-21T20:30:38.929",70,null,null,null,null,"Erik Pärn",8,5,4,6]
["Test03","Hans Kukk","2019-11-24T23:22:13.735",80,null,null,null,null,"Martin Aavik",6,11,7,11]
["Test04","Carmen Sõrmus","2019-11-13T10:50:23.362",21,null,null,null,null,"Maarja Pihlak",12,7,7,14]
["Test03","Reimo Kala","2019-11-24T15:30:56.871",28,null,null,null,null,"Urmas Lõhmus",6,4,11,12]
["Test02","Markus Niidas","2019-11-15T21:16:36.970",20,null,null,null,null,"Lauri Vahtra",5,8,7,9]
["Test04","Markus Niidas","2019-11-05T12:36:05.297",99,null,null,null,null,"Emili Loorits",9,4,9,8]
["Test02","Diana Taal","2019-11-06T17:32:40.715",35,null,null,null,null,"Jaagup Kivi",3,11,4,9]
["Test03","Rasmus Kroon","2019-11-27T21:01:42.296",22,null,null,null,null,"Joonas Haljas",5,9,7,8]
["Test03","Paul Hein","2019-11-20T08:17:01.373",83,null,null,null,null,"Robert Lentso",8,10,7,7]
["Test04","Martin Aavik","2019-11-21T10:40:37.715",85,null,null,null,null,"Viktoria Lumi",6,9,8,5]
["Test02","Martin Aavik","2019-11-08T14:29:19.665",53,null,null,null,null,"Sander Kell",7,6,11,8]
["Test02","Anna Koel","2019-11-26T12:47:49.894",75,null,null,null,null,"Hans Kukk",6,9,6,10]
["Test02","Egert Vint","2019-11-12T21:34:22.322",53,null,null,null,null,"Diana Taal",13,9,3,12]
["Test02","Hans Kukk","2019-11-12T10:24:04.718",95,null,null,null,null,"Kertu Heinsoo",6,9,12,7]
["Test01","Artur Piiri","2019-11-12T23:26:13.285",27,null,null,null,null,"Tarvo Järv",5,9,8,8]
["Test02","Viktoria Lumi","2019-11-01T09:31:40.379",78,null,null,null,null,"Paul Hein",10,12,15,6]
["Test03","Anna Koel","2019-11-17T18:09:56.746",31,null,null,null,null,"Artur Piiri",11,8,11,7]
["Test04","Hanna Laid","2019-11-28T15:09:53.512",43,null,null,null,null,"Getlin Allas",7,15,7,8]
["Test01","Reimo Kala","2019-11-12T12:04:19.293",49,null,null,null,null,"Brita Kaljula",8,14,10,9]
["Test04","Anette Lepp","2019-11-21T08:41:00.515",63,null,null,null,null,"Anna Koel",3,10,8,11]
["Test03","Paul Hein","2019-11-25T10:47:54.385",55,null,null,null,null,"Kristina Merila",10,4,7,6]
["Test02","Tarvo Järv","2019-11-25T18:49:48.802",65,null,null,null,null,"Rasmus Kroon",7,8,9,7]
["Test01","Diana Taal","2019-11-23T12:49:13.392",37]
["Test04","Erik Pärn","2019-11-22T16:57:52.247",73]
["Test02","Getlin Allas","2019-11-19T10:13:46.791",89]
["Test04","Anna Koel","2019-11-16T10:28:31.850",41]
["Test04","Maarja Pihlak","2019-11-18T18:46:36.617",88]
["Test01","Brita Kaljula","2019-11-17T11:57:51.962",86]
["Test01","Katrin Laurits","2019-11-19T19:03:59.091",61]
["Test02","Egert Vint","2019-11-25T17:28:57.761",30]
["Test03","Artur Piiri","2019-11-12T08:20:57.633",65]
["Test02","Hanna Laid","2019-11-09T22:20:21.921",92]
["Test02","Paul Hein","2019-11-06T19:21:43.048",76]
["Test01","Kaspar Raude","2019-11-23T20:41:06.353",83]
["Test03","Kertu Heinsoo","2019-11-26T19:19:00.950",32]
["Test03","Paul Hein","2019-11-04T20:54:14.203",22]
["Test04","Urmas Lõhmus","2019-11-28T20:25:49.922",68]
["Test04","Erik Pärn","2019-11-11T22:17:54.884",82]
["Test01","Kristina Merila","2019-11-24T12:15:25.629",100]
["Test03","Erik Pärn","2019-11-28T17:55:20.809",43]
["Test04","Getlin Allas","2019-11-27T21:06:57.365",28]
["Test04","Jana Kiisk","2019-11-08T21:28:20.889",89]
["Test04","Kaspar Raude","2019-11-11T11:06:52.489",51]
["Test02","Hans Kukk","2019-11-22T21:03:38.543",73]
["Test03","Egert Vint","2019-11-05T17:23:42.454",43]
["Test01","Emili Loorits","2019-11-14T18:39:51.066",63]
["Test02","Joonas Haljas","2019-11-07T10:35:26.700",29]
["Test01","Emili Loorits","2019-11-29T17:12:37.906",61]
["Test03","Kristina Merila","2019-11-03T23:21:29.190",29]
["Test02","Robert Lentso","2019-11-16T17:16:36.209",89]
["Test01","Kertu Heinsoo","2019-11-27T15:33:23.327",46]
["Test04","Artur Piiri","2019-11-23T22:21:49.381",29]
["Test04","Anette Lepp","2019-11-17T16:41:52.686",48]
["Test04","Hans Kukk","2019-11-17T12:14:09.343",45]
["Test02","Rasmus Kroon","2019-11-24T13:19:53.649",77]
[{"$f":"INDEX($G$4:$G$7,RANDBETWEEN(1,4))","v":"Test01"},{"$f":"INDEX($I$2:$I$36,RANDBETWEEN(1,35))","v":"Markus Niidas"},{"$f":"RANDBETWEEN($F$2,$G$2)+$F$1+RAND()*($G$1-$F$1)","v":"2019-11-03T12:56:46.076"},{"$f":"RANDBETWEEN(20,100)","v":77}]
["Test02","Artur Piiri","2019-11-06T16:38:46.109",76]
["Test04","Artur Piiri","2019-11-24T10:44:11.983",82]
["Test01","Mihkel Kulp","2019-11-17T20:50:34.581",58]
["Test02","Paul Hein","2019-11-17T11:00:33.839",95]
["Test01","Markus Niidas","2019-11-06T19:46:06.416",23]
["Test03","Paul Hein","2019-11-16T08:50:02.945",71]
["Test01","Kristina Merila","2019-11-28T11:07:56.076",22]
["Test04","Maarja Pihlak","2019-11-13T13:58:55.491",64]
["Test03","Karin Saar","2019-11-26T09:31:13.697",45]
["Test01","Diana Taal","2019-11-12T16:47:53.566",40]
["Test03","Anna Koel","2019-11-23T16:26:57.517",84]
["Test03","Maarja Pihlak","2019-11-05T16:24:58.246",23]
["Test03","Markus Niidas","2019-11-02T13:23:12.848",73]
["Test03","Hanna Laid","2019-11-17T18:21:22.238",89]
["Test04","Rasmus Kroon","2019-11-10T11:25:26.376",57]
["Test03","Maarja Pihlak","2019-11-26T12:12:02.232",83]
["Test04","Karin Saar","2019-11-24T17:35:54.924",25]
["Test01","Mihkel Kulp","2019-11-22T11:58:40.870",29]
["Test02","Paul Hein","2019-11-13T13:41:39.164",77]
["Test01","Sander Kell","2019-11-30T14:05:56.975",92]
["Test03","Lauri Vahtra","2019-11-04T15:08:02.727",97]
["Test03","Robert Lentso","2019-11-02T08:15:21.914",83]
["Test04","Lauri Vahtra","2019-11-06T18:10:08.608",27]
["Test02","Sander Kell","2019-11-07T20:51:51.832",79]
["Test01","Markus Niidas","2019-11-06T12:47:00.301",67]
["Test02","Markus Niidas","2019-11-07T21:22:22.153",73]
["Test03","Anna Koel","2019-11-30T22:18:03.909",30]
["Test03","Armin Kaasik","2019-11-30T11:50:31.414",25]
["Test04","Mihkel Kulp","2019-11-24T08:18:48.416",42]
["Test01","Kristina Merila","2019-11-09T16:45:27.820",50]
["Test01","Paul Hein","2019-11-25T19:57:56.790",47]
["Test01","Viktoria Lumi","2019-11-26T18:39:42.362",43]
["Test04","Joonas Haljas","2019-11-18T23:00:06.963",90]
["Test01","Maarja Pihlak","2019-11-10T23:21:20.300",47]
["Test03","Paul Hein","2019-11-24T09:58:48.788",31]
["Test04","Lauri Vahtra","2019-11-17T13:02:25.409",81]
["Test04","Maarja Pihlak","2019-11-24T12:45:31.013",43]
["Test03","Paul Hein","2019-11-09T18:31:13.123",40]
["Test04","Lauri Vahtra","2019-11-16T09:32:46.249",24]
["Test02","Markus Niidas","2019-11-21T20:59:02.498",91]
["Test03","Artur Piiri","2019-11-03T18:58:47.906",35]
["Test01","Maarja Pihlak","2019-11-28T11:04:55.163",89]
["Test02","Robert Lentso","2019-11-29T21:21:23.535",33]
["Test01","Rasmus Kroon","2019-11-19T20:03:27.656",50]
["Test01","Katrin Laurits","2019-11-29T15:46:05.029",62]
["Test01","Alari Suur","2019-11-30T17:05:50.262",92]
["Test01","Egert Vint","2019-11-17T21:39:49.294",46]
["Test03","Karin Saar","2019-11-15T19:57:11.490",91]
["Test02","Brita Kaljula","2019-11-11T19:28:27.023",74]
["Test04","Kaspar Raude","2019-11-22T19:06:56.427",26]
["Test04","Egert Vint","2019-11-30T20:00:16.769",78]
["Test03","Katrin Laurits","2019-11-18T14:46:00.166",73]
["Test03","Emili Loorits","2019-11-03T20:00:55.713",36]
["Test02","Kaspar Raude","2019-11-22T22:52:49.181",96]
["Test02","Lauri Vahtra","2019-11-19T08:40:40.198",85]
["Test02","Mihkel Kulp","2019-11-20T19:45:09.133",47]
["Test02","Mihkel Kulp","2019-11-09T23:00:02.956",89]
["Test02","Getlin Allas","2019-11-22T14:32:01.887",30]
["Test04","Carmen Sõrmus","2019-11-09T15:25:14.781",36]
["Test03","Paul Hein","2019-11-23T15:28:58.648",96]
["Test01","Diana Taal","2019-11-23T16:02:12.616",20]
["Test03","Erik Pärn","2019-11-23T14:54:05.495",37]
["Test01","Diana Taal","2019-11-13T22:57:11.769",54]
[{"$f":"INDEX($G$4:$G$7,RANDBETWEEN(1,4))","v":"Test02"},{"$f":"INDEX($I$2:$I$36,RANDBETWEEN(1,35))","v":"Erik Pärn"},{"$f":"RANDBETWEEN($F$2,$G$2)+$F$1+RAND()*($G$1-$F$1)","v":"2019-11-26T12:22:15.997"},{"$f":"RANDBETWEEN(20,100)","v":37}]
["Test02","Maarja Pihlak","2019-11-19T16:40:30.515",37]
["Test03","Urmas Lõhmus","2019-11-22T20:05:07.715",23]
["Test03","Karin Saar","2019-11-01T23:35:29.711",20]
["Test01","Karin Saar","2019-11-24T19:46:14.640",75]
["Test01","Anette Lepp","2019-11-02T19:23:33.199",98]
["Test01","Katrin Laurits","2019-11-21T20:11:13.325",80]
["Test04","Maarja Pihlak","2019-11-15T11:17:23.743",46]
["Test04","Karin Saar","2019-11-17T17:43:42.273",87]
["Test04","Robert Lentso","2019-11-06T08:40:05.337",97]
["Test03","Karin Saar","2019-11-23T13:06:55.631",74]
["Test02","Anna Koel","2019-11-22T09:20:22.459",42]
["Test02","Getlin Allas","2019-11-01T10:24:20.493",94]
["Test01","Jana Kiisk","2019-11-21T21:29:53.938",35]
["Test04","Katrin Laurits","2019-11-27T18:19:33.792",42]
["Test03","Reimo Kala","2019-11-26T11:30:58.726",74]
["Test04","Kertu Heinsoo","2019-11-11T19:03:45.336",42]
["Test04","Katrin Laurits","2019-11-13T17:41:21.282",44]
["Test02","Maarja Pihlak","2019-11-01T12:12:23.190",21]
["Test04","Kaspar Raude","2019-11-04T11:18:30.780",37]
["Test04","Reimo Kala","2019-11-11T20:46:32.464",37]
["Test02","Paul Hein","2019-11-10T12:35:59.063",77]
["Test04","Urmas Lõhmus","2019-11-05T19:00:30.333",81]
["Test02","Egert Vint","2019-11-20T15:05:09.878",37]
["Test04","Anna Koel","2019-11-08T11:46:21.445",95]
["Test01","Karin Saar","2019-11-22T20:43:52.895",69]
["Test04","Rasmus Kroon","2019-11-16T14:46:51.431",39]
["Test03","Emili Loorits","2019-11-04T08:52:26.302",97]
["Test01","Karin Saar","2019-11-21T14:29:42.382",38]
["Test01","Carmen Sõrmus","2019-11-13T18:06:52.895",44]
["Test04","Sander Kell","2019-11-29T10:01:21.563",53]
["Test02","Tarvo Järv","2019-11-28T17:08:18.763",70]
["Test03","Tarvo Järv","2019-11-27T19:52:01.680",73]
["Test01","Robert Lentso","2019-11-13T13:09:23.272",31]
["Test04","Urmas Lõhmus","2019-11-25T23:42:26.118",33]
["Test03","Robert Lentso","2019-11-14T13:28:15.601",20]
["Test03","Brita Kaljula","2019-11-02T20:16:07.467",82]
["Test01","Emili Loorits","2019-11-20T19:27:25.755",30]
["Test01","Robert Lentso","2019-11-02T11:46:54.502",56]
["Test02","Kristina Merila","2019-11-25T14:19:55.034",50]
["Test02","Egert Vint","2019-11-20T13:28:15.416",95]
["Test02","Kaspar Raude","2019-11-11T22:00:56.056",89]
["Test02","Karin Saar","2019-11-27T21:18:09.282",22]
["Test03","Alari Suur","2019-11-17T21:33:55.002",91]
["Test04","Armin Kaasik","2019-11-19T16:44:45.719",58]
["Test03","Joonas Haljas","2019-11-08T18:05:02.543",92]
["Test02","Alari Suur","2019-11-07T14:55:23.822",60]
["Test01","Kertu Heinsoo","2019-11-28T23:50:32.302",63]
["Test03","Tarvo Järv","2019-11-05T22:15:53.205",36]
["Test04","Anna Koel","2019-11-06T13:15:21.459",62]
["Test02","Jaagup Kivi","2019-11-10T15:29:57.352",46]
["Test03","Kertu Heinsoo","2019-11-25T21:09:51.309",48]
["Test01","Markus Niidas","2019-11-15T11:11:42.478",65]
["Test03","Katrin Laurits","2019-11-01T11:25:59.022",25]
["Test01","Maarja Pihlak","2019-11-12T08:21:52.999",20]
["Test03","Markus Niidas","2019-11-22T14:27:56.374",66]
["Test04","Markus Niidas","2019-11-23T10:29:01.708",46]
["Test02","Katrin Laurits","2019-11-11T21:08:56.274",76]
["Test03","Viktoria Lumi","2019-11-14T12:38:54.066",84]
["Test03","Artur Piiri","2019-11-01T08:50:16.333",74]
["Test04","Urmas Lõhmus","2019-11-06T13:57:05.905",94]
["Test01","Karin Saar","2019-11-01T16:26:57.525",20]
["Test04","Kertu Heinsoo","2019-11-13T15:50:42.163",65]
["Test01","Markus Niidas","2019-11-09T21:03:23.317",20]
[{"$f":"INDEX($G$4:$G$7,RANDBETWEEN(1,4))","v":"Test01"},{"$f":"INDEX($I$2:$I$36,RANDBETWEEN(1,35))","v":"Emili Loorits"},{"$f":"RANDBETWEEN($F$2,$G$2)+$F$1+RAND()*($G$1-$F$1)","v":"2019-11-02T18:42:50.859"},{"$f":"RANDBETWEEN(20,100)","v":21}]
["Test04","Urmas Lõhmus","2019-11-30T22:33:57.470",40]
["Test02","Kertu Heinsoo","2019-11-13T11:13:04.143",55]
["Test04","Egert Vint","2019-11-26T10:19:15.278",96]
["Test04","Emili Loorits","2019-11-22T19:11:34.941",99]
["Test03","Brita Kaljula","2019-11-20T17:29:02.664",98]
["Test01","Egert Vint","2019-11-09T13:27:34.623",92]
["Test04","Robert Lentso","2019-11-19T23:50:42.362",96]
["Test04","Alari Suur","2019-11-29T17:53:42.261",32]
["Test04","Armin Kaasik","2019-11-15T14:43:14.082",49]
["Test03","Diana Taal","2019-11-06T14:07:57.685",27]
["Test01","Carmen Sõrmus","2019-11-13T09:17:56.410",30]
["Test02","Mihkel Kulp","2019-11-09T19:06:11.787",42]
["Test02","Rasmus Kroon","2019-11-13T16:54:10.511",40]
["Test03","Martin Aavik","2019-11-27T10:33:26.667",84]
["Test02","Viktoria Lumi","2019-11-11T12:23:55.015",44]
["Test04","Carmen Sõrmus","2019-11-17T09:50:44.963",82]
["Test03","Maarja Pihlak","2019-11-26T19:42:40.461",56]
["Test01","Kaspar Raude","2019-11-02T09:56:10.940",72]
["Test04","Jaagup Kivi","2019-11-27T18:55:10.161",46]
["Test02","Jana Kiisk","2019-11-02T12:49:09.639",39]
["Test04","Erik Pärn","2019-11-13T23:13:42.816",79]
["Test04","Karin Saar","2019-11-29T22:26:50.406",72]
["Test03","Carmen Sõrmus","2019-11-01T21:34:17.312",80]
["Test01","Carmen Sõrmus","2019-11-08T22:45:04.311",22]
["Test03","Anette Lepp","2019-11-26T16:18:09.478",54]
["Test04","Urmas Lõhmus","2019-11-15T16:50:02.591",47]
["Test03","Emili Loorits","2019-11-09T08:49:47.536",33]
["Test03","Hanna Laid","2019-11-23T21:01:39.123",37]
["Test02","Robert Lentso","2019-11-19T12:25:47.471",84]
["Test01","Viktoria Lumi","2019-11-24T23:33:03.395",92]
["Test03","Artur Piiri","2019-11-17T15:57:39.855",40]
["Test04","Anna Koel","2019-11-18T14:42:05.840",53]
["Test04","Markus Niidas","2019-11-29T18:04:41.062",73]
["Test02","Markus Niidas","2019-11-25T16:12:44.846",76]
["Test03","Kertu Heinsoo","2019-11-29T18:17:37.812",48]
["Test02","Kaspar Raude","2019-11-14T18:39:57.017",50]
["Test01","Kristina Merila","2019-11-29T11:50:05.545",80]
["Test04","Carmen Sõrmus","2019-11-02T15:14:39.737",60]
["Test03","Artur Piiri","2019-11-10T23:52:46.696",79]
["Test03","Rasmus Kroon","2019-11-24T18:31:52.289",30]
["Test02","Urmas Lõhmus","2019-11-03T11:03:43.326",46]
["Test04","Anette Lepp","2019-11-21T20:46:25.540",68]
["Test04","Egert Vint","2019-11-06T10:15:40.510",26]
["Test01","Paul Hein","2019-11-17T12:39:05.331",52]
["Test02","Paul Hein","2019-11-15T18:06:05.153",44]
["Test01","Paul Hein","2019-11-10T23:19:13.758",88]
["Test02","Brita Kaljula","2019-11-15T17:46:20.446",45]
["Test01","Urmas Lõhmus","2019-11-05T11:42:00.320",35]
["Test02","Rasmus Kroon","2019-11-28T17:22:35.489",71]
["Test03","Viktoria Lumi","2019-11-22T21:08:13.314",91]
["Test03","Mihkel Kulp","2019-11-12T12:16:15.843",48]
["Test01","Armin Kaasik","2019-11-06T18:12:33.774",32]
["Test01","Brita Kaljula","2019-11-04T16:48:09.351",93]
["Test01","Armin Kaasik","2019-11-17T08:08:11.732",31]
["Test02","Viktoria Lumi","2019-11-04T09:18:26.445",85]
["Test02","Anna Koel","2019-11-21T09:03:38.804",90]
["Test01","Urmas Lõhmus","2019-11-28T17:23:49.980",60]
["Test01","Reimo Kala","2019-11-23T22:35:51.679",49]
["Test03","Sander Kell","2019-11-27T15:00:28.538",71]
["Test01","Artur Piiri","2019-11-15T13:13:00.429",38]
["Test04","Urmas Lõhmus","2019-11-23T19:58:11.201",70]
["Test01","Paul Hein","2019-11-28T15:22:13.944",44]
["Test02","Paul Hein","2019-11-21T13:07:57.707",27]
[{"$f":"INDEX($G$4:$G$7,RANDBETWEEN(1,4))","v":"Test04"},{"$f":"INDEX($I$2:$I$36,RANDBETWEEN(1,35))","v":"Kaspar Raude"},{"$f":"RANDBETWEEN($F$2,$G$2)+$F$1+RAND()*($G$1-$F$1)","v":"2019-11-13T08:12:24.048"},{"$f":"RANDBETWEEN(20,100)","v":95}]
["Test01","Kristina Merila","2019-11-25T21:23:34.262",97]
["Test03","Lauri Vahtra","2019-11-02T08:24:10.908",60]
["Test04","Katrin Laurits","2019-11-24T14:14:48.636",93]
["Test03","Rasmus Kroon","2019-11-15T20:51:39.835",81]
["Test03","Alari Suur","2019-11-02T08:48:46.542",90]
["Test04","Anette Lepp","2019-11-13T21:42:05.321",24]
["Test03","Brita Kaljula","2019-11-19T14:03:27.491",51]
["Test02","Carmen Sõrmus","2019-11-10T21:48:12.015",61]
["Test04","Reimo Kala","2019-11-03T09:18:37.953",67]
["Test03","Paul Hein","2019-11-07T16:49:58.956",21]
["Test02","Kertu Heinsoo","2019-11-04T15:38:02.582",94]
["Test03","Sander Kell","2019-11-25T11:09:39.169",40]
["Test03","Sander Kell","2019-11-12T18:06:17.433",49]
["Test03","Martin Aavik","2019-11-07T18:41:44.463",21]
["Test04","Lauri Vahtra","2019-11-15T11:03:46.520",61]
["Test04","Emili Loorits","2019-11-09T14:43:40.354",99]
["Test01","Markus Niidas","2019-11-04T19:06:57.011",79]
["Test04","Getlin Allas","2019-11-13T13:10:25.403",42]
["Test02","Getlin Allas","2019-11-07T10:51:19.395",58]
["Test02","Artur Piiri","2019-11-11T19:37:06.300",92]
["Test01","Lauri Vahtra","2019-11-04T19:39:56.773",28]
["Test02","Anna Koel","2019-11-02T11:06:19.196",50]
["Test03","Viktoria Lumi","2019-11-08T19:52:27.602",35]
["Test02","Armin Kaasik","2019-11-24T18:10:44.735",81]
["Test02","Martin Aavik","2019-11-24T12:52:45.258",56]
["Test02","Anette Lepp","2019-11-12T20:39:53.786",98]
["Test03","Paul Hein","2019-11-27T09:02:32.648",51]
["Test02","Anette Lepp","2019-11-27T15:26:05.193",88]
["Test01","Anette Lepp","2019-11-28T19:36:39.188",93]
["Test03","Hans Kukk","2019-11-22T11:57:11.689",62]
["Test02","Viktoria Lumi","2019-11-29T16:36:06.650",100]
["Test01","Maarja Pihlak","2019-11-26T23:47:31.399",93]
["Test01","Karin Saar","2019-11-12T23:54:51.591",75]
["Test03","Paul Hein","2019-11-10T16:45:53.056",86]
["Test02","Carmen Sõrmus","2019-11-22T12:17:27.354",85]
["Test01","Egert Vint","2019-11-13T18:45:30.856",79]
["Test02","Jaagup Kivi","2019-11-09T12:17:43.529",49]
["Test01","Viktoria Lumi","2019-11-27T11:44:00.713",33]
["Test01","Kristina Merila","2019-11-13T10:04:08.909",78]
["Test01","Alari Suur","2019-11-03T20:36:16.458",73]
["Test04","Mihkel Kulp","2019-11-26T22:01:06.991",71]
["Test04","Markus Niidas","2019-11-30T19:28:55.659",76]
["Test04","Erik Pärn","2019-11-09T15:18:50.897",20]
["Test04","Viktoria Lumi","2019-11-10T08:23:15.913",63]
["Test02","Rasmus Kroon","2019-11-03T10:25:16.028",24]
["Test03","Anette Lepp","2019-11-16T18:13:42.709",47]
["Test04","Urmas Lõhmus","2019-11-20T19:12:03.838",63]
["Test01","Lauri Vahtra","2019-11-19T13:51:18.303",68]
["Test03","Brita Kaljula","2019-11-09T11:24:26.735",21]
["Test02","Kaspar Raude","2019-11-09T10:06:04.969",39]
["Test01","Brita Kaljula","2019-11-16T20:14:38.586",87]
["Test04","Markus Niidas","2019-11-15T10:08:16.240",36]
["Test03","Getlin Allas","2019-11-27T09:14:59.429",70]
["Test04","Alari Suur","2019-11-18T14:51:05.255",26]
["Test02","Reimo Kala","2019-11-13T12:05:07.212",28]
["Test01","Joonas Haljas","2019-11-01T13:41:02.922",38]
["Test03","Lauri Vahtra","2019-11-10T13:59:36.590",51]
["Test03","Getlin Allas","2019-11-11T20:58:20.056",37]
["Test01","Sander Kell","2019-11-19T12:34:26.237",49]
["Test03","Kristina Merila","2019-11-26T16:41:59.048",79]
["Test03","Alari Suur","2019-11-17T14:53:47.846",21]
["Test03","Mihkel Kulp","2019-11-03T22:10:50.220",32]
["Test01","Emili Loorits","2019-11-26T23:34:26.004",37]
[{"$f":"INDEX($G$4:$G$7,RANDBETWEEN(1,4))","v":"Test03"},{"$f":"INDEX($I$2:$I$36,RANDBETWEEN(1,35))","v":"Katrin Laurits"},{"$f":"RANDBETWEEN($F$2,$G$2)+$F$1+RAND()*($G$1-$F$1)","v":"2019-11-05T17:16:57.237"},{"$f":"RANDBETWEEN(20,100)","v":32}]
["Test04","Anna Koel","2019-11-04T22:53:28.495",93]
["Test01","Diana Taal","2019-11-23T12:36:40.803",35]
["Test03","Urmas Lõhmus","2019-11-12T18:27:46.821",92]
["Test01","Hans Kukk","2019-11-18T20:12:46.733",49]
["Test02","Kaspar Raude","2019-11-28T19:38:16.550",82]
["Test02","Urmas Lõhmus","2019-11-25T16:16:02.262",25]
["Test03","Robert Lentso","2019-11-16T18:20:37.210",37]
["Test01","Karin Saar","2019-11-01T08:49:22.811",49]
["Test04","Getlin Allas","2019-11-02T19:23:34.688",89]
["Test02","Kaspar Raude","2019-11-18T12:23:44.631",56]
["Test03","Anette Lepp","2019-11-21T17:00:44.082",93]
["Test02","Markus Niidas","2019-11-02T09:07:46.085",86]
["Test03","Artur Piiri","2019-11-05T10:41:30.139",66]
["Test02","Sander Kell","2019-11-27T23:26:34.800",66]
["Test03","Reimo Kala","2019-11-30T23:41:14.794",89]
["Test02","Alari Suur","2019-11-06T09:30:39.101",80]
["Test01","Robert Lentso","2019-11-28T09:11:57.246",69]
["Test03","Viktoria Lumi","2019-11-21T21:28:04.738",87]
["Test02","Joonas Haljas","2019-11-23T08:15:21.842",78]
["Test04","Jaagup Kivi","2019-11-14T17:32:06.542",42]
["Test04","Alari Suur","2019-11-13T09:22:08.816",68]
["Test04","Jaagup Kivi","2019-11-15T12:10:39.410",63]
["Test01","Egert Vint","2019-11-08T19:04:02.259",93]
["Test04","Kristina Merila","2019-11-30T15:43:30.434",22]
["Test01","Erik Pärn","2019-11-29T08:31:13.902",93]
["Test04","Egert Vint","2019-11-06T09:03:26.629",59]
["Test01","Lauri Vahtra","2019-11-09T09:02:50.649",31]
["Test04","Martin Aavik","2019-11-11T23:34:10.791",23]
["Test04","Tarvo Järv","2019-11-27T23:07:35.868",88]
["Test04","Reimo Kala","2019-11-03T23:27:16.407",95]
["Test03","Katrin Laurits","2019-11-12T16:58:09.651",94]
["Test03","Urmas Lõhmus","2019-11-22T18:30:28.086",96]
["Test04","Carmen Sõrmus","2019-11-01T18:36:49.969",24]
["Test04","Carmen Sõrmus","2019-11-12T20:29:44.259",36]
["Test01","Kertu Heinsoo","2019-11-06T23:16:23.314",65]
["Test02","Kertu Heinsoo","2019-11-14T21:14:08.532",96]
["Test01","Emili Loorits","2019-11-28T21:19:27.257",24]
["Test02","Maarja Pihlak","2019-11-20T10:09:38.716",20]
["Test02","Lauri Vahtra","2019-11-08T18:23:02.587",30]
["Test02","Alari Suur","2019-11-22T09:47:29.325",93]
["Test02","Getlin Allas","2019-11-20T13:45:07.830",61]
["Test04","Kaspar Raude","2019-11-04T11:37:13.502",50]
["Test02","Mihkel Kulp","2019-11-04T15:29:01.633",43]
["Test03","Jana Kiisk","2019-11-14T08:56:21.808",53]
["Test04","Carmen Sõrmus","2019-11-05T12:54:05.557",73]
["Test04","Tarvo Järv","2019-11-24T22:02:27.229",100]
["Test01","Anette Lepp","2019-11-28T23:27:05.779",34]
["Test01","Carmen Sõrmus","2019-11-07T22:45:08.562",93]
["Test01","Brita Kaljula","2019-11-11T21:59:59.414",58]
["Test04","Getlin Allas","2019-11-21T19:49:42.739",80]
["Test01","Emili Loorits","2019-11-02T23:28:58.938",30]
["Test04","Mihkel Kulp","2019-11-16T11:06:07.029",63]
["Test01","Markus Niidas","2019-11-26T22:17:16.065",66]
["Test03","Carmen Sõrmus","2019-11-15T08:55:28.999",97]
["Test02","Mihkel Kulp","2019-11-18T09:37:55.935",69]
["Test02","Hans Kukk","2019-11-13T12:44:43.186",51]
["Test01","Viktoria Lumi","2019-11-23T13:26:28.928",30]
["Test02","Karin Saar","2019-11-05T16:58:39.148",39]
["Test04","Mihkel Kulp","2019-11-03T14:46:00.464",68]
["Test02","Hans Kukk","2019-11-28T21:42:45.354",30]
["Test03","Anette Lepp","2019-11-21T15:34:49.056",61]
["Test04","Tarvo Järv","2019-11-05T23:40:24.008",86]
["Test03","Sander Kell","2019-11-20T12:39:09.124",77]
[{"$f":"INDEX($G$4:$G$7,RANDBETWEEN(1,4))","v":"Test01"},{"$f":"INDEX($I$2:$I$36,RANDBETWEEN(1,35))","v":"Armin Kaasik"},{"$f":"RANDBETWEEN($F$2,$G$2)+$F$1+RAND()*($G$1-$F$1)","v":"2019-11-30T23:47:40.726"},{"$f":"RANDBETWEEN(20,100)","v":32}]
["Test03","Urmas Lõhmus","2019-11-30T11:32:12.501",70]
["Test04","Anna Koel","2019-11-22T20:07:21.117",39]
["Test01","Maarja Pihlak","2019-11-17T13:06:53.547",22]
["Test02","Markus Niidas","2019-11-24T15:43:57.479",50]
["Test01","Kaspar Raude","2019-11-27T11:33:53.440",99]
["Test01","Carmen Sõrmus","2019-11-24T17:39:45.472",78]
["Test01","Mihkel Kulp","2019-11-05T12:32:08.087",66]
["Test03","Katrin Laurits","2019-11-13T08:30:37.308",21]
["Test02","Kristina Merila","2019-11-13T20:57:43.802",90]
["Test04","Brita Kaljula","2019-11-08T09:41:01.193",81]
["Test02","Robert Lentso","2019-11-08T16:29:50.584",81]
["Test04","Jaagup Kivi","2019-11-19T13:17:06.743",26]
["Test04","Joonas Haljas","2019-11-28T10:09:56.616",64]
["Test02","Getlin Allas","2019-11-14T08:03:22.561",89]
["Test02","Armin Kaasik","2019-11-25T16:42:37.669",25]
["Test02","Egert Vint","2019-11-02T21:02:00.355",54]
["Test03","Markus Niidas","2019-11-14T15:11:00.620",57]
["Test02","Diana Taal","2019-11-11T08:17:44.905",27]
["Test04","Egert Vint","2019-11-22T11:47:31.606",59]
["Test03","Hans Kukk","2019-11-23T12:18:53.596",81]
["Test01","Sander Kell","2019-11-28T15:18:20.820",57]
["Test02","Markus Niidas","2019-11-01T13:20:40.714",55]
["Test01","Kaspar Raude","2019-11-29T09:48:08.535",93]
["Test03","Alari Suur","2019-11-17T22:49:21.753",43]
["Test04","Mihkel Kulp","2019-11-24T16:23:12.458",34]
["Test02","Alari Suur","2019-11-25T08:36:54.500",28]
["Test03","Katrin Laurits","2019-11-19T18:53:32.619",79]
["Test03","Kristina Merila","2019-11-07T12:29:27.108",21]
["Test04","Alari Suur","2019-11-28T21:13:10.738",93]
["Test01","Maarja Pihlak","2019-11-25T21:30:00.283",88]
["Test03","Paul Hein","2019-11-29T10:13:04.455",35]
["Test01","Karin Saar","2019-11-11T15:11:16.393",27]
["Test02","Alari Suur","2019-11-10T19:19:45.050",72]
["Test04","Jaagup Kivi","2019-11-05T16:23:54.472",88]
["Test02","Paul Hein","2019-11-05T13:04:08.917",37]
["Test03","Joonas Haljas","2019-11-14T21:38:42.142",20]
["Test04","Armin Kaasik","2019-11-22T23:32:04.367",92]
["Test02","Tarvo Järv","2019-11-24T21:30:51.161",88]
["Test02","Egert Vint","2019-11-09T19:39:10.679",87]
["Test01","Karin Saar","2019-11-24T20:38:16.131",62]
["Test04","Joonas Haljas","2019-11-27T13:08:58.566",81]
["Test01","Hans Kukk","2019-11-10T20:15:05.231",39]
["Test02","Artur Piiri","2019-11-01T16:23:42.331",55]
["Test04","Maarja Pihlak","2019-11-29T11:55:14.009",72]
["Test02","Paul Hein","2019-11-07T15:58:59.599",58]
["Test02","Getlin Allas","2019-11-09T21:09:01.143",84]
["Test02","Katrin Laurits","2019-11-11T14:46:31.695",92]
["Test01","Diana Taal","2019-11-18T10:00:32.888",35]
["Test03","Urmas Lõhmus","2019-11-10T18:07:29.788",54]
["Test04","Jana Kiisk","2019-11-24T11:39:29.243",22]
["Test04","Artur Piiri","2019-11-09T14:28:43.726",78]
["Test04","Kertu Heinsoo","2019-11-27T09:59:59.820",99]
["Test02","Getlin Allas","2019-11-02T08:46:59.609",54]
["Test04","Emili Loorits","2019-11-23T20:54:31.612",79]
["Test03","Diana Taal","2019-11-30T08:47:50.437",20]
["Test04","Maarja Pihlak","2019-11-16T09:07:49.463",24]
["Test01","Robert Lentso","2019-11-24T13:27:23.073",35]
["Test04","Diana Taal","2019-11-05T13:32:32.881",72]
["Test02","Mihkel Kulp","2019-11-26T09:04:24.516",53]
["Test03","Kertu Heinsoo","2019-11-06T11:32:50.750",100]
["Test01","Markus Niidas","2019-11-09T10:47:40.787",76]
["Test01","Anette Lepp","2019-11-07T14:33:36.879",89]
["Test02","Getlin Allas","2019-11-17T10:25:15.186",39]
[{"$f":"INDEX($G$4:$G$7,RANDBETWEEN(1,4))","v":"Test03"},{"$f":"INDEX($I$2:$I$36,RANDBETWEEN(1,35))","v":"Martin Aavik"},{"$f":"RANDBETWEEN($F$2,$G$2)+$F$1+RAND()*($G$1-$F$1)","v":"2019-11-11T17:22:36.510"},{"$f":"RANDBETWEEN(20,100)","v":71}]
["Test04","Robert Lentso","2019-11-20T15:49:44.911",65]
["Test02","Rasmus Kroon","2019-11-24T09:57:28.913",100]
["Test02","Martin Aavik","2019-11-07T14:02:45.041",31]
["Test02","Anna Koel","2019-11-27T14:37:14.147",42]
["Test03","Alari Suur","2019-11-06T13:28:43.973",46]
["Test03","Viktoria Lumi","2019-11-26T22:54:25.665",67]
["Test04","Armin Kaasik","2019-11-03T13:29:46.105",92]
["Test01","Urmas Lõhmus","2019-11-14T13:04:10.659",48]
["Test04","Artur Piiri","2019-11-20T19:08:54.650",21]
["Test03","Rasmus Kroon","2019-11-19T13:24:01.468",92]
["Test04","Alari Suur","2019-11-27T09:34:04.935",93]
["Test04","Reimo Kala","2019-11-18T19:50:06.538",90]
["Test04","Viktoria Lumi","2019-11-20T11:12:48.889",28]
["Test03","Mihkel Kulp","2019-11-25T23:03:58.601",25]
["Test04","Markus Niidas","2019-11-11T21:34:31.778",71]
["Test02","Joonas Haljas","2019-11-04T21:05:09.729",88]
["Test03","Sander Kell","2019-11-01T12:25:00.505",66]
["Test02","Hanna Laid","2019-11-25T08:32:27.079",44]
["Test04","Mihkel Kulp","2019-11-18T21:49:34.107",36]
["Test04","Diana Taal","2019-11-03T09:39:39.066",38]
["Test02","Karin Saar","2019-11-07T23:29:41.979",24]
["Test01","Viktoria Lumi","2019-11-03T18:03:04.700",20]
["Test02","Lauri Vahtra","2019-11-13T20:13:30.244",71]
["Test02","Kaspar Raude","2019-11-05T18:48:50.941",46]
["Test04","Maarja Pihlak","2019-11-09T20:32:59.964",28]
["Test04","Diana Taal","2019-11-13T14:49:53.311",62]
["Test01","Karin Saar","2019-11-19T22:00:59.366",50]
["Test02","Jaagup Kivi","2019-11-11T16:12:48.103",49]
["Test01","Robert Lentso","2019-11-20T12:17:04.807",85]
["Test01","Lauri Vahtra","2019-11-07T09:42:38.394",65]
["Test03","Brita Kaljula","2019-11-19T09:52:25.044",49]
["Test01","Emili Loorits","2019-11-29T10:58:24.402",69]
["Test02","Robert Lentso","2019-11-04T19:27:07.767",45]
["Test01","Kaspar Raude","2019-11-30T08:49:25.318",100]
["Test02","Emili Loorits","2019-11-20T11:37:52.230",95]
["Test02","Anette Lepp","2019-11-27T08:32:06.828",26]
["Test04","Reimo Kala","2019-11-20T16:48:34.013",46]
["Test02","Reimo Kala","2019-11-20T19:03:51.748",96]
["Test04","Mihkel Kulp","2019-11-07T11:02:39.732",25]
["Test03","Tarvo Järv","2019-11-18T09:09:59.348",73]
["Test03","Diana Taal","2019-11-21T22:11:13.565",26]
["Test03","Sander Kell","2019-11-01T14:42:30.248",56]
["Test04","Martin Aavik","2019-11-27T11:35:56.692",29]
["Test02","Robert Lentso","2019-11-06T09:59:21.909",51]
["Test01","Diana Taal","2019-11-01T18:05:46.040",51]
["Test02","Robert Lentso","2019-11-13T13:45:39.242",75]
["Test04","Katrin Laurits","2019-11-07T20:35:30.927",48]
["Test02","Artur Piiri","2019-11-30T09:16:46.419",32]
["Test01","Tarvo Järv","2019-11-11T16:29:01.876",55]
["Test03","Hanna Laid","2019-11-12T08:19:54.676",33]
["Test04","Egert Vint","2019-11-27T23:53:42.578",51]
["Test03","Kertu Heinsoo","2019-11-14T16:11:13.927",44]
["Test04","Lauri Vahtra","2019-11-26T16:04:21.891",73]
["Test04","Karin Saar","2019-11-06T17:10:53.429",84]
["Test03","Kaspar Raude","2019-11-18T17:01:39.782",70]
["Test01","Hans Kukk","2019-11-01T12:53:58.574",69]
["Test04","Martin Aavik","2019-11-16T20:14:48.417",46]
["Test01","Hans Kukk","2019-11-16T09:21:49.517",20]
["Test02","Kristina Merila","2019-11-14T14:51:52.681",87]
["Test02","Alari Suur","2019-11-24T16:15:04.244",60]
["Test04","Carmen Sõrmus","2019-11-27T08:45:55.292",82]
["Test04","Mihkel Kulp","2019-11-01T11:26:02.430",53]
["Test01","Markus Niidas","2019-11-01T09:36:27.739",56]
[{"$f":"INDEX($G$4:$G$7,RANDBETWEEN(1,4))","v":"Test02"},{"$f":"INDEX($I$2:$I$36,RANDBETWEEN(1,35))","v":"Anette Lepp"},{"$f":"RANDBETWEEN($F$2,$G$2)+$F$1+RAND()*($G$1-$F$1)","v":"2019-11-05T18:53:34.891"},{"$f":"RANDBETWEEN(20,100)","v":63}]
["Test04","Getlin Allas","2019-11-16T12:30:37.344",35]
["Test01","Mihkel Kulp","2019-11-26T22:15:27.210",51]
["Test04","Karin Saar","2019-11-18T19:17:23.715",35]
["Test01","Paul Hein","2019-11-18T13:44:54.396",50]
["Test04","Karin Saar","2019-11-13T19:29:18.173",36]
["Test04","Carmen Sõrmus","2019-11-24T17:08:29.548",25]
["Test02","Kertu Heinsoo","2019-11-13T19:55:13.645",62]
["Test04","Kristina Merila","2019-11-20T15:04:14.574",21]
["Test02","Maarja Pihlak","2019-11-08T19:13:26.435",49]
["Test04","Getlin Allas","2019-11-05T17:32:09.089",57]
["Test02","Katrin Laurits","2019-11-22T14:21:15.702",52]
["Test04","Carmen Sõrmus","2019-11-02T11:46:38.819",37]
["Test04","Jaagup Kivi","2019-11-08T17:30:58.470",59]
["Test04","Katrin Laurits","2019-11-20T23:02:40.884",46]
["Test04","Hanna Laid","2019-11-07T20:28:04.547",34]
["Test02","Hanna Laid","2019-11-10T09:02:02.443",41]
["Test04","Hans Kukk","2019-11-04T23:30:38.721",25]
["Test04","Robert Lentso","2019-11-30T19:54:38.307",21]
["Test04","Viktoria Lumi","2019-11-09T20:25:12.726",75]
["Test02","Karin Saar","2019-11-20T23:50:19.220",89]
["Test04","Brita Kaljula","2019-11-26T10:57:50.123",30]
["Test02","Getlin Allas","2019-11-29T23:31:01.514",79]
["Test03","Katrin Laurits","2019-11-30T21:07:21.974",75]
["Test04","Martin Aavik","2019-11-10T21:00:18.993",56]
["Test02","Jaagup Kivi","2019-11-06T17:43:01.178",32]
["Test04","Hanna Laid","2019-11-06T18:42:14.987",31]
["Test04","Egert Vint","2019-11-03T10:57:15.490",76]
["Test01","Katrin Laurits","2019-11-30T14:12:19.418",20]
["Test01","Tarvo Järv","2019-11-20T09:27:00.668",50]
["Test01","Rasmus Kroon","2019-11-06T10:31:46.627",57]
["Test03","Emili Loorits","2019-11-22T17:27:27.492",26]
["Test04","Carmen Sõrmus","2019-11-20T21:56:56.060",26]
["Test03","Karin Saar","2019-11-15T21:35:31.110",75]
["Test03","Armin Kaasik","2019-11-08T14:32:55.378",62]
["Test03","Karin Saar","2019-11-07T14:22:24.522",53]
["Test02","Markus Niidas","2019-11-21T22:13:36.297",73]
["Test04","Kaspar Raude","2019-11-07T23:03:11.113",39]
["Test01","Sander Kell","2019-11-08T16:02:38.415",42]
["Test01","Diana Taal","2019-11-04T23:43:00.131",62]
["Test04","Hanna Laid","2019-11-11T16:07:54.034",72]
["Test02","Kertu Heinsoo","2019-11-18T12:34:17.585",89]
["Test02","Mihkel Kulp","2019-11-30T13:51:26.806",41]
["Test03","Katrin Laurits","2019-11-26T08:04:22.814",61]
["Test04","Armin Kaasik","2019-11-13T17:53:30.553",81]
["Test02","Brita Kaljula","2019-11-07T22:50:33.747",55]
["Test02","Tarvo Järv","2019-11-23T08:16:50.694",42]
["Test02","Mihkel Kulp","2019-11-10T20:55:27.332",41]
["Test03","Paul Hein","2019-11-21T15:47:07.643",76]
["Test02","Jana Kiisk","2019-11-27T23:30:50.253",77]
["Test03","Carmen Sõrmus","2019-11-22T21:50:52.370",93]
["Test03","Martin Aavik","2019-11-21T17:38:08.610",64]
["Test03","Armin Kaasik","2019-11-08T14:03:26.225",64]
["Test04","Kristina Merila","2019-11-03T18:46:04.504",85]
["Test01","Alari Suur","2019-11-06T22:36:28.380",82]
["Test03","Rasmus Kroon","2019-11-14T17:17:16.586",91]
["Test01","Egert Vint","2019-11-12T18:30:52.499",88]
["Test01","Reimo Kala","2019-11-07T10:19:20.663",87]
["Test03","Karin Saar","2019-11-06T23:36:35.317",93]
["Test02","Viktoria Lumi","2019-11-19T08:07:03.525",98]
["Test02","Armin Kaasik","2019-11-04T11:45:33.223",88]
["Test04","Hans Kukk","2019-11-11T12:41:43.072",37]
["Test04","Diana Taal","2019-11-05T11:00:41.675",61]
["Test02","Reimo Kala","2019-11-10T09:40:11.968",34]
[{"$f":"INDEX($G$4:$G$7,RANDBETWEEN(1,4))","v":"Test03"},{"$f":"INDEX($I$2:$I$36,RANDBETWEEN(1,35))","v":"Paul Hein"},{"$f":"RANDBETWEEN($F$2,$G$2)+$F$1+RAND()*($G$1-$F$1)","v":"2019-11-28T14:16:57.397"},{"$f":"RANDBETWEEN(20,100)","v":90}]
["Test02","Alari Suur","2019-11-28T12:43:28.232",95]
["Test02","Mihkel Kulp","2019-11-08T17:54:34.627",60]
["Test01","Mihkel Kulp","2019-11-03T08:34:36.930",31]
["Test04","Sander Kell","2019-11-22T10:19:46.131",61]
["Test02","Erik Pärn","2019-11-01T10:11:48.948",98]
["Test01","Katrin Laurits","2019-11-21T10:08:45.561",93]
["Test02","Kertu Heinsoo","2019-11-16T20:38:46.806",54]
["Test01","Jaagup Kivi","2019-11-02T17:55:03.801",40]
["Test01","Hans Kukk","2019-11-01T10:51:39.224",90]
["Test03","Viktoria Lumi","2019-11-15T19:32:54.500",69]
["Test02","Emili Loorits","2019-11-15T09:37:30.005",20]
["Test01","Jaagup Kivi","2019-11-07T09:23:17.899",26]
["Test03","Maarja Pihlak","2019-11-08T10:09:10.763",21]
["Test04","Jana Kiisk","2019-11-16T09:43:30.625",36]
["Test03","Jana Kiisk","2019-11-16T18:56:04.040",59]
["Test03","Sander Kell","2019-11-04T20:06:03.227",54]
["Test03","Emili Loorits","2019-11-28T22:36:54.460",39]
["Test02","Katrin Laurits","2019-11-09T20:03:40.928",45]
["Test02","Reimo Kala","2019-11-09T12:51:06.377",91]
["Test02","Mihkel Kulp","2019-11-11T19:06:38.490",77]
["Test01","Kaspar Raude","2019-11-19T21:27:02.580",59]
["Test03","Kaspar Raude","2019-11-22T20:43:02.261",92]
["Test04","Rasmus Kroon","2019-11-22T15:16:41.564",40]
["Test03","Joonas Haljas","2019-11-08T10:10:09.957",48]
["Test04","Maarja Pihlak","2019-11-11T14:39:30.751",52]
["Test01","Hanna Laid","2019-11-19T14:41:04.846",51]
["Test02","Jana Kiisk","2019-11-10T19:57:31.855",88]
["Test02","Martin Aavik","2019-11-01T14:24:20.007",23]
["Test02","Alari Suur","2019-11-19T09:41:31.540",78]
["Test02","Karin Saar","2019-11-10T08:21:43.393",59]
["Test01","Urmas Lõhmus","2019-11-19T08:20:32.893",66]
["Test03","Kristina Merila","2019-11-26T19:25:03.180",86]
["Test01","Sander Kell","2019-11-26T15:23:33.657",42]
["Test02","Viktoria Lumi","2019-11-15T13:21:29.230",28]
["Test01","Erik Pärn","2019-11-25T14:00:24.212",69]
["Test03","Markus Niidas","2019-11-08T13:16:12.860",43]
["Test03","Kaspar Raude","2019-11-11T14:20:09.884",36]
["Test03","Egert Vint","2019-11-17T15:01:27.178",49]
["Test01","Urmas Lõhmus","2019-11-15T20:06:18.259",77]
["Test04","Emili Loorits","2019-11-22T14:14:23.488",34]
["Test03","Urmas Lõhmus","2019-11-01T15:30:41.131",82]
["Test02","Anna Koel","2019-11-11T13:48:19.863",51]
["Test03","Sander Kell","2019-11-06T18:30:57.200",54]
["Test03","Robert Lentso","2019-11-22T14:18:55.487",51]
["Test02","Robert Lentso","2019-11-01T21:04:17.131",97]
["Test02","Viktoria Lumi","2019-11-24T11:55:51.349",48]
["Test02","Erik Pärn","2019-11-29T18:05:24.752",33]
["Test03","Kertu Heinsoo","2019-11-29T12:14:15.859",46]
["Test02","Joonas Haljas","2019-11-19T12:55:31.895",65]
["Test02","Hans Kukk","2019-11-14T13:48:20.595",26]
["Test02","Markus Niidas","2019-11-11T19:48:00.199",62]
["Test01","Egert Vint","2019-11-16T23:07:08.563",51]
["Test04","Anette Lepp","2019-11-21T15:39:44.909",32]
["Test01","Kaspar Raude","2019-11-25T12:14:30.533",61]
["Test03","Anette Lepp","2019-11-17T09:12:09.467",93]
["Test03","Joonas Haljas","2019-11-18T12:16:49.514",74]
["Test01","Robert Lentso","2019-11-22T11:02:57.630",79]
["Test03","Armin Kaasik","2019-11-13T18:39:35.553",89]
["Test04","Rasmus Kroon","2019-11-07T13:14:25.041",89]
["Test01","Armin Kaasik","2019-11-19T18:05:56.498",92]
["Test02","Lauri Vahtra","2019-11-20T13:40:23.995",53]
["Test03","Urmas Lõhmus","2019-11-24T10:08:44.237",32]
["Test01","Martin Aavik","2019-11-13T15:10:04.577",87]
[{"$f":"INDEX($G$4:$G$7,RANDBETWEEN(1,4))","v":"Test03"},{"$f":"INDEX($I$2:$I$36,RANDBETWEEN(1,35))","v":"Emili Loorits"},{"$f":"RANDBETWEEN($F$2,$G$2)+$F$1+RAND()*($G$1-$F$1)","v":"2019-11-11T13:24:06.147"},{"$f":"RANDBETWEEN(20,100)","v":54}]
["Test02","Markus Niidas","2019-11-21T11:56:44.402",41]
["Test01","Alari Suur","2019-11-12T22:28:16.430",89]
["Test04","Katrin Laurits","2019-11-08T08:38:47.203",22]
["Test01","Reimo Kala","2019-11-25T19:46:07.510",98]
["Test01","Artur Piiri","2019-11-14T22:53:42.732",43]
["Test02","Maarja Pihlak","2019-11-06T21:15:02.141",25]
["Test02","Joonas Haljas","2019-11-03T08:04:29.545",56]
["Test04","Urmas Lõhmus","2019-11-12T18:15:30.672",88]
["Test01","Hanna Laid","2019-11-16T19:52:18.677",57]
["Test03","Jana Kiisk","2019-11-07T08:25:27.062",24]
["Test01","Erik Pärn","2019-11-04T20:42:07.446",67]
["Test04","Martin Aavik","2019-11-23T09:07:47.514",73]
["Test03","Viktoria Lumi","2019-11-06T17:56:20.757",57]
["Test02","Hans Kukk","2019-11-03T09:15:23.858",96]
["Test02","Alari Suur","2019-11-20T13:18:55.392",24]
["Test03","Karin Saar","2019-11-29T17:57:52.832",60]
["Test04","Hans Kukk","2019-11-17T20:56:39.749",44]
["Test01","Artur Piiri","2019-11-28T09:21:21.054",33]
["Test02","Robert Lentso","2019-11-02T08:29:41.238",49]
["Test03","Markus Niidas","2019-11-11T20:16:40.960",51]
["Test02","Markus Niidas","2019-11-12T20:19:44.692",44]
["Test01","Anette Lepp","2019-11-04T22:59:56.441",50]
["Test02","Brita Kaljula","2019-11-10T18:51:30.360",58]
["Test02","Erik Pärn","2019-11-01T23:04:09.860",63]
["Test03","Reimo Kala","2019-11-22T11:20:21.016",92]
["Test03","Brita Kaljula","2019-11-01T10:24:09.378",57]
["Test01","Mihkel Kulp","2019-11-29T20:12:26.994",63]
["Test04","Kertu Heinsoo","2019-11-24T16:07:13.085",99]
["Test02","Anette Lepp","2019-11-18T22:34:46.093",96]
["Test02","Carmen Sõrmus","2019-11-10T13:27:49.570",72]
["Test04","Emili Loorits","2019-11-04T14:50:51.560",57]
["Test01","Brita Kaljula","2019-11-03T16:19:23.468",94]
["Test02","Paul Hein","2019-11-24T12:18:30.290",36]
["Test04","Anna Koel","2019-11-19T19:08:05.957",89]
["Test03","Sander Kell","2019-11-29T16:24:28.508",88]
["Test04","Hanna Laid","2019-11-01T09:12:34.780",55]
["Test04","Joonas Haljas","2019-11-01T17:11:15.311",60]
["Test04","Maarja Pihlak","2019-11-30T23:53:07.461",36]
["Test02","Alari Suur","2019-11-20T15:32:06.776",100]
["Test03","Tarvo Järv","2019-11-02T14:05:37.571",94]
["Test01","Artur Piiri","2019-11-29T10:03:38.075",67]
["Test04","Brita Kaljula","2019-11-16T23:22:04.711",72]
["Test01","Maarja Pihlak","2019-11-04T14:26:42.011",73]
["Test02","Sander Kell","2019-11-26T16:15:49.502",55]
["Test04","Anna Koel","2019-11-30T22:15:02.371",69]
["Test03","Reimo Kala","2019-11-04T14:34:42.160",49]
["Test01","Robert Lentso","2019-11-18T10:32:46.369",23]
["Test04","Paul Hein","2019-11-19T09:06:45.178",20]
["Test04","Rasmus Kroon","2019-11-09T12:36:13.740",86]
["Test03","Kaspar Raude","2019-11-23T21:14:15.253",62]
["Test01","Paul Hein","2019-11-30T22:36:56.811",68]
["Test04","Mihkel Kulp","2019-11-15T11:53:33.816",32]
["Test04","Markus Niidas","2019-11-12T23:05:07.965",33]
["Test01","Artur Piiri","2019-11-01T14:41:59.353",43]
["Test04","Alari Suur","2019-11-30T20:16:09.428",62]
["Test04","Joonas Haljas","2019-11-24T09:24:08.380",39]
["Test02","Brita Kaljula","2019-11-18T14:38:36.648",52]
["Test02","Lauri Vahtra","2019-11-26T22:22:55.623",100]
["Test01","Carmen Sõrmus","2019-11-15T11:49:56.367",89]
["Test04","Paul Hein","2019-11-22T19:45:48.997",72]
["Test03","Hanna Laid","2019-11-03T12:59:31.643",50]
["Test03","Egert Vint","2019-11-07T11:33:18.132",75]
["Test03","Tarvo Järv","2019-11-07T17:33:35.697",71]
[{"$f":"INDEX($G$4:$G$7,RANDBETWEEN(1,4))","v":"Test01"},{"$f":"INDEX($I$2:$I$36,RANDBETWEEN(1,35))","v":"Getlin Allas"},{"$f":"RANDBETWEEN($F$2,$G$2)+$F$1+RAND()*($G$1-$F$1)","v":"2019-11-07T17:01:21.090"},{"$f":"RANDBETWEEN(20,100)","v":75}]
["Test04","Maarja Pihlak","2019-11-02T19:05:45.311",79]
["Test01","Paul Hein","2019-11-28T18:14:45.892",29]
["Test03","Sander Kell","2019-11-29T17:51:36.903",69]
["Test02","Martin Aavik","2019-11-14T10:45:14.511",28]
["Test04","Diana Taal","2019-11-06T12:36:23.835",99]
["Test02","Egert Vint","2019-11-12T21:47:24.650",49]
["Test02","Brita Kaljula","2019-11-12T11:25:15.279",79]
["Test04","Joonas Haljas","2019-11-12T17:55:27.292",99]
["Test01","Paul Hein","2019-11-17T22:07:44.090",69]
["Test01","Getlin Allas","2019-11-22T20:10:27.041",37]
["Test01","Brita Kaljula","2019-11-11T12:13:13.966",36]
["Test01","Kristina Merila","2019-11-21T08:45:30.821",29]
["Test02","Diana Taal","2019-11-02T10:46:43.432",46]
["Test03","Lauri Vahtra","2019-11-08T12:12:26.357",47]
["Test03","Kertu Heinsoo","2019-11-11T19:51:56.631",64]
["Test03","Rasmus Kroon","2019-11-09T10:32:02.968",25]
["Test03","Hans Kukk","2019-11-25T17:40:08.363",31]
["Test03","Jaagup Kivi","2019-11-29T11:45:29.309",21]
["Test01","Egert Vint","2019-11-05T21:34:03.789",38]
["Test02","Lauri Vahtra","2019-11-23T10:45:59.110",68]
["Test04","Carmen Sõrmus","2019-11-16T09:21:20.895",83]
["Test04","Kristina Merila","2019-11-04T08:32:27.322",25]
["Test04","Carmen Sõrmus","2019-11-05T19:18:09.486",92]
["Test01","Rasmus Kroon","2019-11-12T12:00:09.275",65]
["Test03","Karin Saar","2019-11-29T13:47:01.574",79]
["Test03","Anette Lepp","2019-11-09T19:07:32.701",68]
["Test01","Markus Niidas","2019-11-26T17:34:56.832",100]
["Test02","Martin Aavik","2019-11-29T18:03:48.961",69]
["Test01","Erik Pärn","2019-11-04T08:45:37.597",29]
["Test03","Urmas Lõhmus","2019-11-06T10:24:53.703",69]
["Test03","Armin Kaasik","2019-11-05T11:24:32.815",73]
["Test01","Diana Taal","2019-11-10T13:37:47.644",67]
["Test04","Paul Hein","2019-11-05T14:53:19.907",74]
["Test02","Robert Lentso","2019-11-02T19:02:01.953",66]
["Test01","Tarvo Järv","2019-11-17T08:55:55.399",51]
["Test02","Tarvo Järv","2019-11-29T09:22:49.329",86]
["Test02","Urmas Lõhmus","2019-11-04T21:56:46.597",31]
["Test03","Kaspar Raude","2019-11-18T16:36:03.005",96]
["Test02","Armin Kaasik","2019-11-10T11:31:25.698",31]
["Test04","Martin Aavik","2019-11-24T17:43:37.756",97]
["Test02","Karin Saar","2019-11-18T18:29:51.350",60]
["Test03","Markus Niidas","2019-11-03T15:52:34.609",38]
["Test01","Hans Kukk","2019-11-06T15:05:17.468",66]
["Test01","Artur Piiri","2019-11-03T10:53:05.860",38]
["Test02","Tarvo Järv","2019-11-03T21:06:26.691",50]
["Test03","Joonas Haljas","2019-11-22T08:26:54.666",48]
["Test02","Markus Niidas","2019-11-07T22:39:48.379",100]
["Test04","Lauri Vahtra","2019-11-21T17:08:44.874",34]
["Test01","Diana Taal","2019-11-04T22:10:39.617",92]
["Test04","Alari Suur","2019-11-16T17:34:39.156",70]
["Test03","Robert Lentso","2019-11-03T15:53:22.965",64]
["Test02","Joonas Haljas","2019-11-07T11:29:12.528",50]
["Test04","Kristina Merila","2019-11-08T23:13:47.355",92]
["Test03","Hanna Laid","2019-11-30T23:19:51.057",79]
["Test04","Jana Kiisk","2019-11-29T19:51:40.510",78]
["Test01","Kaspar Raude","2019-11-08T10:54:03.484",31]
["Test01","Mihkel Kulp","2019-11-30T18:05:09.698",98]
["Test02","Jaagup Kivi","2019-11-05T13:06:29.180",36]
["Test03","Hans Kukk","2019-11-17T10:13:25.180",51]
["Test03","Reimo Kala","2019-11-07T13:46:54.366",33]
["Test02","Getlin Allas","2019-11-10T13:09:01.157",25]
["Test04","Tarvo Järv","2019-11-29T11:14:16.254",27]
["Test02","Paul Hein","2019-11-13T09:54:48.785",72]
[{"$f":"INDEX($G$4:$G$7,RANDBETWEEN(1,4))","v":"Test03"},{"$f":"INDEX($I$2:$I$36,RANDBETWEEN(1,35))","v":"Maarja Pihlak"},{"$f":"RANDBETWEEN($F$2,$G$2)+$F$1+RAND()*($G$1-$F$1)","v":"2019-11-28T15:39:19.283"},{"$f":"RANDBETWEEN(20,100)","v":80}]
["Test03","Armin Kaasik","2019-11-02T23:52:21.587",79]
["Test03","Martin Aavik","2019-11-05T13:05:39.122",29]
["Test03","Anna Koel","2019-11-12T09:40:15.505",34]
["Test04","Joonas Haljas","2019-11-18T12:35:41.347",28]
["Test02","Joonas Haljas","2019-11-20T21:08:50.240",38]
["Test04","Paul Hein","2019-11-24T13:12:34.072",60]
["Test04","Brita Kaljula","2019-11-18T20:23:45.056",64]
["Test02","Artur Piiri","2019-11-25T18:38:12.836",54]
["Test01","Joonas Haljas","2019-11-18T11:05:52.571",66]
["Test04","Sander Kell","2019-11-01T17:32:04.386",100]
["Test01","Brita Kaljula","2019-11-28T13:52:37.558",91]
["Test02","Paul Hein","2019-11-09T23:24:45.070",45]
["Test02","Artur Piiri","2019-11-14T15:22:41.925",42]
["Test01","Brita Kaljula","2019-11-22T17:24:42.618",29]
["Test02","Martin Aavik","2019-11-19T23:31:30.886",89]
["Test03","Anna Koel","2019-11-03T08:26:13.597",44]
["Test03","Kaspar Raude","2019-11-13T11:03:39.974",28]
["Test02","Emili Loorits","2019-11-19T23:25:39.811",93]
["Test04","Carmen Sõrmus","2019-11-14T22:48:34.233",25]
["Test04","Diana Taal","2019-11-20T16:18:30.553",22]
["Test02","Carmen Sõrmus","2019-11-29T10:47:13.291",95]
["Test01","Kertu Heinsoo","2019-11-11T19:33:34.766",84]
["Test04","Anna Koel","2019-11-24T13:53:18.891",88]
["Test04","Katrin Laurits","2019-11-04T19:10:43.864",31]
["Test01","Anna Koel","2019-11-28T18:54:03.816",67]
["Test01","Kristina Merila","2019-11-08T20:00:44.131",35]
["Test03","Martin Aavik","2019-11-15T21:22:35.351",81]
["Test03","Anette Lepp","2019-11-27T16:36:44.638",25]
["Test04","Sander Kell","2019-11-06T11:23:08.186",40]
["Test01","Egert Vint","2019-11-17T18:12:35.081",87]
["Test02","Artur Piiri","2019-11-28T13:37:10.876",58]
["Test03","Joonas Haljas","2019-11-10T21:21:01.654",83]
["Test01","Kaspar Raude","2019-11-07T14:56:56.499",80]
["Test01","Rasmus Kroon","2019-11-17T14:23:25.135",33]
["Test04","Urmas Lõhmus","2019-11-17T08:49:57.502",32]
["Test04","Markus Niidas","2019-11-01T13:15:19.201",97]
["Test04","Paul Hein","2019-11-17T08:47:04.020",72]
["Test03","Brita Kaljula","2019-11-22T17:58:33.955",32]
["Test03","Kertu Heinsoo","2019-11-22T16:34:26.445",32]
["Test02","Jaagup Kivi","2019-11-25T14:03:25.206",56]
["Test03","Getlin Allas","2019-11-30T12:07:59.718",73]
["Test03","Markus Niidas","2019-11-28T14:57:57.404",54]
["Test02","Getlin Allas","2019-11-09T13:49:52.951",57]
["Test01","Jana Kiisk","2019-11-19T09:43:26.550",24]
["Test02","Egert Vint","2019-11-18T18:01:12.802",45]
["Test02","Jaagup Kivi","2019-11-21T22:56:37.385",46]
["Test02","Armin Kaasik","2019-11-11T22:23:09.491",34]
["Test02","Martin Aavik","2019-11-26T20:26:22.433",32]
["Test03","Carmen Sõrmus","2019-11-22T10:51:00.961",32]
["Test03","Kaspar Raude","2019-11-28T19:14:22.571",32]
["Test02","Carmen Sõrmus","2019-11-21T13:36:35.725",85]
["Test03","Hanna Laid","2019-11-27T22:51:48.822",93]
["Test03","Kaspar Raude","2019-11-15T14:27:18.622",53]
["Test03","Carmen Sõrmus","2019-11-01T10:00:47.743",89]
["Test04","Getlin Allas","2019-11-10T15:42:27.195",70]
["Test02","Markus Niidas","2019-11-30T16:51:09.290",38]
["Test01","Urmas Lõhmus","2019-11-03T18:09:52.927",42]
["Test01","Erik Pärn","2019-11-26T22:34:33.036",34]
["Test04","Rasmus Kroon","2019-11-02T20:44:25.630",40]
["Test01","Katrin Laurits","2019-11-12T08:51:14.463",93]
["Test02","Diana Taal","2019-11-30T09:42:48.600",23]
["Test03","Robert Lentso","2019-11-06T16:46:14.255",94]
["Test04","Mihkel Kulp","2019-11-24T15:50:49.476",74]
[{"$f":"INDEX($G$4:$G$7,RANDBETWEEN(1,4))","v":"Test02"},{"$f":"INDEX($I$2:$I$36,RANDBETWEEN(1,35))","v":"Maarja Pihlak"},{"$f":"RANDBETWEEN($F$2,$G$2)+$F$1+RAND()*($G$1-$F$1)","v":"2019-11-06T16:33:52.116"},{"$f":"RANDBETWEEN(20,100)","v":81}]
["Test04","Diana Taal","2019-11-28T12:50:42.186",23]
["Test02","Hans Kukk","2019-11-10T11:11:33.197",58]
["Test03","Kristina Merila","2019-11-25T11:12:28.296",86]
["Test04","Kaspar Raude","2019-11-24T23:48:36.229",87]
["Test01","Martin Aavik","2019-11-09T15:35:38.359",83]
["Test02","Diana Taal","2019-11-14T19:30:25.810",60]
["Test02","Anna Koel","2019-11-12T19:23:11.326",29]
["Test04","Egert Vint","2019-11-09T23:26:22.344",88]
["Test04","Hans Kukk","2019-11-15T14:36:50.641",94]
["Test03","Rasmus Kroon","2019-11-28T14:40:36.491",49]
["Test03","Urmas Lõhmus","2019-11-22T22:57:35.050",49]
["Test02","Tarvo Järv","2019-11-25T09:06:58.395",100]
["Test02","Brita Kaljula","2019-11-09T16:01:03.899",34]
["Test01","Hanna Laid","2019-11-19T15:47:08.073",62]
["Test01","Katrin Laurits","2019-11-04T14:28:01.945",45]
["Test02","Emili Loorits","2019-11-24T09:08:47.134",27]
["Test02","Diana Taal","2019-11-18T15:00:38.302",93]
["Test03","Emili Loorits","2019-11-23T12:38:20.760",57]
["Test04","Getlin Allas","2019-11-05T11:05:03.394",27]
["Test03","Artur Piiri","2019-11-19T21:00:21.372",88]
["Test01","Joonas Haljas","2019-11-09T13:02:21.930",71]
["Test01","Erik Pärn","2019-11-23T12:25:55.070",86]
["Test01","Artur Piiri","2019-11-14T19:31:22.416",96]
["Test02","Carmen Sõrmus","2019-11-24T21:13:24.850",24]
["Test01","Kristina Merila","2019-11-21T23:43:37.277",33]
["Test03","Kristina Merila","2019-11-29T16:00:42.794",42]
["Test01","Kaspar Raude","2019-11-16T08:25:42.673",57]
["Test03","Urmas Lõhmus","2019-11-04T11:21:21.440",46]
["Test04","Brita Kaljula","2019-11-04T19:17:18.390",58]
["Test01","Getlin Allas","2019-11-01T20:22:36.442",79]
["Test01","Katrin Laurits","2019-11-30T19:19:23.496",76]
["Test01","Artur Piiri","2019-11-07T15:14:44.620",49]
["Test02","Kertu Heinsoo","2019-11-24T21:39:55.088",81]
["Test02","Diana Taal","2019-11-20T16:05:20.146",75]
["Test01","Maarja Pihlak","2019-11-05T14:01:44.608",38]
["Test02","Egert Vint","2019-11-09T12:03:13.003",68]
["Test04","Egert Vint","2019-11-07T11:59:55.529",62]
["Test04","Lauri Vahtra","2019-11-06T15:11:51.037",67]
["Test04","Carmen Sõrmus","2019-11-27T09:10:30.607",70]
["Test01","Karin Saar","2019-11-02T22:14:09.179",68]
["Test03","Alari Suur","2019-11-03T11:57:43.771",93]
["Test03","Tarvo Järv","2019-11-10T14:20:48.909",100]
["Test02","Reimo Kala","2019-11-03T18:42:53.872",62]
["Test03","Karin Saar","2019-11-18T09:52:34.474",37]
["Test01","Egert Vint","2019-11-06T13:00:32.857",100]
["Test02","Katrin Laurits","2019-11-08T22:19:28.111",96]
["Test02","Getlin Allas","2019-11-07T17:57:52.672",99]
["Test01","Katrin Laurits","2019-11-17T09:39:41.081",97]
["Test01","Egert Vint","2019-11-14T17:39:52.230",33]
["Test01","Getlin Allas","2019-11-13T14:42:23.324",60]
["Test02","Joonas Haljas","2019-11-20T17:15:56.740",39]
["Test04","Diana Taal","2019-11-15T20:26:16.333",55]
["Test01","Carmen Sõrmus","2019-11-22T12:53:40.411",80]
["Test04","Tarvo Järv","2019-11-26T12:57:06.847",82]
["Test02","Jana Kiisk","2019-11-10T09:39:11.918",38]
["Test04","Anna Koel","2019-11-19T12:27:08.152",75]
["Test02","Getlin Allas","2019-11-02T22:53:32.497",68]
["Test03","Artur Piiri","2019-11-13T19:32:45.145",84]
["Test01","Kaspar Raude","2019-11-15T09:36:12.169",59]
["Test04","Erik Pärn","2019-11-20T23:14:45.512",34]
["Test03","Reimo Kala","2019-11-07T12:27:16.246",71]
["Test03","Sander Kell","2019-11-12T15:19:29.152",92]
["Test04","Diana Taal","2019-11-19T22:10:35.287",50]
[{"$f":"INDEX($G$4:$G$7,RANDBETWEEN(1,4))","v":"Test04"},{"$f":"INDEX($I$2:$I$36,RANDBETWEEN(1,35))","v":"Hans Kukk"},{"$f":"RANDBETWEEN($F$2,$G$2)+$F$1+RAND()*($G$1-$F$1)","v":"2019-11-10T19:11:57.491"},{"$f":"RANDBETWEEN(20,100)","v":24}]
["Test04","Brita Kaljula","2019-11-20T17:24:42.601",42]
["Test04","Sander Kell","2019-11-21T19:25:57.144",89]
["Test04","Hans Kukk","2019-11-16T23:43:07.599",48]
["Test02","Karin Saar","2019-11-25T17:38:08.321",75]
["Test04","Mihkel Kulp","2019-11-08T08:49:17.187",65]
["Test02","Kertu Heinsoo","2019-11-18T21:21:53.068",59]
["Test01","Kristina Merila","2019-11-01T11:29:05.538",24]
["Test02","Anette Lepp","2019-11-11T16:12:05.606",55]
["Test04","Erik Pärn","2019-11-18T19:22:17.572",87]
["Test04","Viktoria Lumi","2019-11-06T21:25:36.949",32]
["Test04","Robert Lentso","2019-11-06T09:24:07.072",100]
["Test02","Anna Koel","2019-11-30T18:49:44.698",78]
["Test03","Hanna Laid","2019-11-20T20:40:46.217",65]
["Test03","Karin Saar","2019-11-09T23:20:45.644",81]
["Test04","Kertu Heinsoo","2019-11-04T19:39:42.861",99]
["Test04","Artur Piiri","2019-11-12T09:37:51.254",26]
["Test02","Joonas Haljas","2019-11-14T19:18:00.781",35]
["Test03","Reimo Kala","2019-11-05T14:47:51.255",26]
["Test01","Katrin Laurits","2019-11-02T11:07:11.498",65]
["Test04","Mihkel Kulp","2019-11-01T15:39:40.456",80]
["Test03","Emili Loorits","2019-11-09T10:23:06.382",29]
["Test01","Sander Kell","2019-11-16T13:57:28.337",55]
["Test03","Joonas Haljas","2019-11-27T09:58:00.834",33]
["Test03","Anette Lepp","2019-11-03T15:47:46.457",83]
["Test02","Hanna Laid","2019-11-26T12:22:34.282",93]
["Test01","Viktoria Lumi","2019-11-03T10:13:24",59]
["Test01","Emili Loorits","2019-11-17T22:43:51.400",34]
["Test02","Jaagup Kivi","2019-11-23T22:46:45.135",99]
["Test02","Karin Saar","2019-11-21T17:42:42.925",47]
["Test02","Brita Kaljula","2019-11-12T19:29:14.428",39]
["Test02","Sander Kell","2019-11-10T14:07:38.519",41]
["Test04","Diana Taal","2019-11-24T16:00:12.787",85]
["Test01","Reimo Kala","2019-11-14T13:06:06.414",57]
["Test03","Kaspar Raude","2019-11-01T13:26:07.005",51]
["Test01","Rasmus Kroon","2019-11-18T22:42:59.369",77]
["Test03","Tarvo Järv","2019-11-02T17:42:00.966",87]
["Test01","Erik Pärn","2019-11-04T09:13:41.030",20]
["Test01","Robert Lentso","2019-11-20T10:02:02.751",21]
["Test04","Egert Vint","2019-11-30T11:29:27.789",81]
["Test03","Artur Piiri","2019-11-19T11:00:38.925",89]
["Test02","Egert Vint","2019-11-21T09:56:08.145",94]
["Test04","Jaagup Kivi","2019-11-14T18:27:00.346",100]
["Test01","Artur Piiri","2019-11-15T23:18:01.224",40]
["Test04","Tarvo Järv","2019-11-08T18:07:48.105",50]
["Test03","Lauri Vahtra","2019-11-02T19:25:30.918",68]
["Test03","Rasmus Kroon","2019-11-30T17:38:47.470",97]
["Test02","Tarvo Järv","2019-11-12T12:51:06.598",24]
["Test03","Hans Kukk","2019-11-06T16:52:36.585",38]
["Test04","Tarvo Järv","2019-11-15T12:10:41.250",81]
["Test04","Emili Loorits","2019-11-11T14:34:00.769",57]
["Test04","Diana Taal","2019-11-09T19:22:56.667",86]
["Test04","Markus Niidas","2019-11-24T17:04:54.296",84]
["Test02","Hans Kukk","2019-11-24T22:01:24.776",85]
["Test01","Egert Vint","2019-11-25T09:10:17.607",94]
["Test03","Robert Lentso","2019-11-09T22:34:01.134",50]
["Test04","Hanna Laid","2019-11-09T13:29:24.533",49]
["Test02","Jaagup Kivi","2019-11-02T12:56:38.613",93]
["Test04","Emili Loorits","2019-11-21T15:54:27.112",47]
["Test02","Maarja Pihlak","2019-11-29T09:47:14.045",64]
["Test04","Katrin Laurits","2019-11-30T14:14:35.436",41]
["Test01","Martin Aavik","2019-11-14T13:03:17.361",61]
["Test02","Reimo Kala","2019-11-01T17:21:00.153",61]
["Test01","Getlin Allas","2019-11-13T16:56:32.963",24]
[{"$f":"INDEX($G$4:$G$7,RANDBETWEEN(1,4))","v":"Test01"},{"$f":"INDEX($I$2:$I$36,RANDBETWEEN(1,35))","v":"Hanna Laid"},{"$f":"RANDBETWEEN($F$2,$G$2)+$F$1+RAND()*($G$1-$F$1)","v":"2019-11-17T21:02:49.832"},{"$f":"RANDBETWEEN(20,100)","v":94}]
["Test01","Kaspar Raude","2019-11-12T20:41:28.830",29]
["Test01","Rasmus Kroon","2019-11-29T09:46:32.024",21]
["Test03","Erik Pärn","2019-11-23T18:52:47.310",75]
["Test03","Reimo Kala","2019-11-12T08:02:27.127",84]
["Test04","Hans Kukk","2019-11-29T08:46:50.056",89]
["Test01","Carmen Sõrmus","2019-11-24T21:24:14.570",89]
["Test02","Jaagup Kivi","2019-11-14T12:41:12.768",59]
["Test04","Sander Kell","2019-11-13T12:33:17.464",92]
["Test02","Diana Taal","2019-11-08T18:15:46.083",97]
["Test03","Jaagup Kivi","2019-11-30T23:00:16.039",60]
["Test03","Urmas Lõhmus","2019-11-22T15:40:52.130",75]
["Test03","Viktoria Lumi","2019-11-11T16:04:19.997",29]
["Test03","Kertu Heinsoo","2019-11-22T08:09:55.644",91]
["Test04","Maarja Pihlak","2019-11-17T23:26:46.328",30]
["Test01","Joonas Haljas","2019-11-09T10:34:15.901",49]
["Test03","Hanna Laid","2019-11-17T18:20:17.397",100]
["Test04","Sander Kell","2019-11-15T21:04:27.669",33]
["Test02","Martin Aavik","2019-11-04T21:57:55.166",54]
["Test04","Martin Aavik","2019-11-08T11:59:47.958",21]
["Test04","Hanna Laid","2019-11-09T13:44:56.887",84]
["Test02","Paul Hein","2019-11-16T11:46:18.704",22]
["Test04","Robert Lentso","2019-11-20T10:37:35.638",23]
["Test04","Mihkel Kulp","2019-11-01T23:53:23.139",42]
["Test01","Alari Suur","2019-11-30T20:02:36.424",91]
["Test02","Viktoria Lumi","2019-11-22T18:28:25.547",43]
["Test02","Viktoria Lumi","2019-11-06T12:41:47.224",71]
["Test01","Diana Taal","2019-11-07T17:13:11.160",63]
["Test02","Brita Kaljula","2019-11-12T20:46:31.616",68]
["Test02","Martin Aavik","2019-11-02T21:29:44.759",22]
["Test02","Armin Kaasik","2019-11-04T14:01:47.515",91]
["Test04","Egert Vint","2019-11-01T22:37:27.732",92]
["Test04","Egert Vint","2019-11-04T10:18:54.876",99]
["Test04","Markus Niidas","2019-11-09T21:21:19.599",43]
["Test02","Anna Koel","2019-11-10T17:33:21.871",54]
["Test03","Rasmus Kroon","2019-11-09T17:52:03.348",84]
["Test04","Hanna Laid","2019-11-19T22:05:48.126",84]
["Test01","Jaagup Kivi","2019-11-13T19:18:05.873",35]
["Test04","Robert Lentso","2019-11-20T17:40:21.554",58]
["Test02","Reimo Kala","2019-11-21T22:14:02.499",84]
["Test01","Jana Kiisk","2019-11-28T10:45:04.461",41]
["Test04","Egert Vint","2019-11-16T08:30:35.841",87]
["Test01","Diana Taal","2019-11-09T17:48:15.003",30]
["Test01","Carmen Sõrmus","2019-11-02T11:45:52.165",42]
["Test01","Alari Suur","2019-11-28T20:14:25.084",31]
["Test01","Martin Aavik","2019-11-28T08:13:55.442",78]
["Test02","Markus Niidas","2019-11-17T12:08:22.501",95]
["Test01","Jana Kiisk","2019-11-03T09:57:22.958",25]
["Test04","Viktoria Lumi","2019-11-14T16:49:12.011",36]
["Test03","Anna Koel","2019-11-13T09:03:51.645",51]
["Test04","Kertu Heinsoo","2019-11-23T09:01:34.032",52]
["Test03","Markus Niidas","2019-11-23T20:56:56.858",87]
["Test04","Martin Aavik","2019-11-27T20:02:58.314",27]
["Test01","Armin Kaasik","2019-11-16T11:57:00.720",67]
["Test04","Rasmus Kroon","2019-11-21T13:51:08.281",50]
["Test03","Reimo Kala","2019-11-23T21:01:21.549",51]
["Test03","Egert Vint","2019-11-25T18:53:17.957",91]
["Test03","Artur Piiri","2019-11-03T22:37:16.071",95]
["Test01","Getlin Allas","2019-11-15T13:09:02.159",31]
["Test02","Hans Kukk","2019-11-29T20:21:13.092",47]
["Test02","Karin Saar","2019-11-05T14:24:09.151",82]
["Test01","Anette Lepp","2019-11-30T11:48:24.835",62]
["Test02","Katrin Laurits","2019-11-24T21:05:01.343",35]
["Test04","Urmas Lõhmus","2019-11-13T22:51:02.966",73]
[{"$f":"INDEX($G$4:$G$7,RANDBETWEEN(1,4))","v":"Test02"},{"$f":"INDEX($I$2:$I$36,RANDBETWEEN(1,35))","v":"Markus Niidas"},{"$f":"RANDBETWEEN($F$2,$G$2)+$F$1+RAND()*($G$1-$F$1)","v":"2019-11-11T20:04:18.774"},{"$f":"RANDBETWEEN(20,100)","v":35}]
["Test03","Erik Pärn","2019-11-25T20:30:29.006",33]
["Test03","Alari Suur","2019-11-13T14:19:28.773",100]
["Test02","Brita Kaljula","2019-11-01T17:24:01.868",46]
["Test04","Urmas Lõhmus","2019-11-23T20:53:47.026",51]
["Test03","Getlin Allas","2019-11-06T20:41:44.426",98]
["Test02","Carmen Sõrmus","2019-11-22T10:52:43.864",92]
["Test04","Anette Lepp","2019-11-26T15:13:29.655",51]
["Test01","Anna Koel","2019-11-04T18:42:38.251",68]
["Test03","Kristina Merila","2019-11-23T21:24:45.178",71]
["Test01","Carmen Sõrmus","2019-11-18T23:40:53.157",78]
["Test01","Maarja Pihlak","2019-11-17T14:04:57.598",75]
["Test03","Kertu Heinsoo","2019-11-23T14:40:23.678",52]
["Test02","Getlin Allas","2019-11-20T17:23:40.871",72]
["Test03","Lauri Vahtra","2019-11-05T17:32:41.336",72]
["Test04","Markus Niidas","2019-11-22T16:44:57.484",53]
["Test04","Kaspar Raude","2019-11-14T15:12:51.982",45]
["Test03","Egert Vint","2019-11-21T13:07:46.494",27]
["Test03","Jaagup Kivi","2019-11-12T23:14:23.713",30]
["Test03","Anette Lepp","2019-11-20T11:06:01.906",94]
["Test04","Paul Hein","2019-11-10T18:23:25.255",95]
["Test01","Getlin Allas","2019-11-13T08:21:05.749",28]
["Test03","Artur Piiri","2019-11-13T23:33:42.205",44]
["Test03","Maarja Pihlak","2019-11-04T18:10:19.676",100]
["Test02","Markus Niidas","2019-11-28T09:13:53.465",47]
["Test04","Emili Loorits","2019-11-12T17:28:43.495",89]
["Test01","Paul Hein","2019-11-16T13:26:00.623",60]
["Test04","Hans Kukk","2019-11-21T15:27:09.955",50]
["Test01","Martin Aavik","2019-11-13T21:56:55.137",67]
["Test02","Egert Vint","2019-11-23T12:19:50.431",56]
["Test04","Kaspar Raude","2019-11-29T08:44:20.803",68]
["Test04","Maarja Pihlak","2019-11-13T14:40:49.671",96]
["Test02","Kaspar Raude","2019-11-27T13:28:29.058",96]
["Test03","Markus Niidas","2019-11-24T15:32:50.466",85]
["Test04","Brita Kaljula","2019-11-20T11:13:48.469",71]
["Test02","Jaagup Kivi","2019-11-06T18:36:37.578",90]
["Test02","Urmas Lõhmus","2019-11-09T23:40:23.355",58]
["Test02","Kristina Merila","2019-11-23T10:37:08.802",43]
["Test02","Brita Kaljula","2019-11-16T09:48:00.793",27]
["Test04","Martin Aavik","2019-11-16T12:07:24.534",45]
["Test01","Karin Saar","2019-11-21T11:31:04.136",66]
["Test02","Tarvo Järv","2019-11-14T18:43:21.644",23]
["Test04","Hans Kukk","2019-11-16T22:03:02.698",99]
["Test04","Alari Suur","2019-11-19T14:51:56.285",89]
["Test04","Markus Niidas","2019-11-26T10:25:50.742",66]
["Test02","Kertu Heinsoo","2019-11-28T19:18:03.802",75]
["Test04","Lauri Vahtra","2019-11-22T09:24:59.440",57]
["Test03","Lauri Vahtra","2019-11-28T09:40:34.974",88]
["Test03","Karin Saar","2019-11-26T13:46:57.909",61]
["Test02","Brita Kaljula","2019-11-21T15:45:08.249",91]
["Test02","Brita Kaljula","2019-11-15T08:53:39.712",87]
["Test03","Kertu Heinsoo","2019-11-04T19:19:37.088",90]
["Test04","Kertu Heinsoo","2019-11-28T08:49:44.393",97]
["Test03","Anna Koel","2019-11-23T23:49:28.790",90]
["Test01","Carmen Sõrmus","2019-11-10T13:09:31.099",44]
["Test02","Rasmus Kroon","2019-11-11T12:50:54.406",24]
["Test03","Martin Aavik","2019-11-11T15:17:32.117",71]
["Test02","Armin Kaasik","2019-11-07T18:49:28.170",93]
["Test03","Brita Kaljula","2019-11-06T21:47:10.698",53]
["Test03","Hanna Laid","2019-11-20T20:45:50.330",95]
["Test03","Katrin Laurits","2019-11-07T21:23:27.382",90]
["Test02","Markus Niidas","2019-11-08T23:13:13.908",60]
["Test01","Maarja Pihlak","2019-11-20T21:59:03.279",71]
["Test04","Jaagup Kivi","2019-11-21T10:39:24.773",84]
[{"$f":"INDEX($G$4:$G$7,RANDBETWEEN(1,4))","v":"Test02"},{"$f":"INDEX($I$2:$I$36,RANDBETWEEN(1,35))","v":"Anette Lepp"},{"$f":"RANDBETWEEN($F$2,$G$2)+$F$1+RAND()*($G$1-$F$1)","v":"2019-11-17T18:49:43.440"},{"$f":"RANDBETWEEN(20,100)","v":79}]
["Test04","Anna Koel","2019-11-08T20:51:44.774",94]
["Test03","Kertu Heinsoo","2019-11-11T20:08:33.129",76]
["Test02","Anette Lepp","2019-11-12T13:00:58.186",62]
["Test01","Maarja Pihlak","2019-11-06T21:58:20.657",33]
["Test02","Rasmus Kroon","2019-11-20T09:17:37.898",26]
["Test04","Lauri Vahtra","2019-11-09T13:57:38.618",22]
["Test04","Hanna Laid","2019-11-05T22:57:27.430",23]
["Test04","Carmen Sõrmus","2019-11-16T14:36:52.849",57]
["Test01","Tarvo Järv","2019-11-24T10:34:12.013",39]
["Test03","Anna Koel","2019-11-16T18:08:42.037",70]
["Test02","Martin Aavik","2019-11-25T09:01:20.935",48]
["Test02","Karin Saar","2019-11-23T14:50:52.183",91]
["Test04","Tarvo Järv","2019-11-26T17:24:30.315",74]
["Test04","Hanna Laid","2019-11-24T11:25:51.118",95]
["Test01","Egert Vint","2019-11-10T18:53:45.013",34]
["Test02","Artur Piiri","2019-11-01T18:39:32.949",94]
["Test01","Jana Kiisk","2019-11-11T09:04:28.178",43]
["Test04","Martin Aavik","2019-11-21T20:39:49.007",22]
["Test02","Anna Koel","2019-11-09T08:03:20.235",30]
["Test01","Erik Pärn","2019-11-29T22:49:57.987",30]
["Test04","Joonas Haljas","2019-11-19T23:22:24.095",93]
["Test03","Paul Hein","2019-11-14T18:24:02.283",43]
["Test01","Martin Aavik","2019-11-18T18:40:23.486",34]
["Test04","Artur Piiri","2019-11-11T14:19:07.584",59]
["Test01","Egert Vint","2019-11-12T20:07:53.396",25]
["Test03","Getlin Allas","2019-11-22T11:38:01.231",23]
["Test04","Jana Kiisk","2019-11-21T22:04:33.463",89]
["Test01","Maarja Pihlak","2019-11-23T18:12:37.550",29]
["Test01","Paul Hein","2019-11-27T23:20:26.860",26]
["Test03","Hanna Laid","2019-11-23T15:11:18.866",31]
["Test04","Kristina Merila","2019-11-03T10:26:54.713",33]
["Test04","Sander Kell","2019-11-21T09:52:53.682",48]
["Test01","Diana Taal","2019-11-12T14:31:43.400",65]
["Test03","Brita Kaljula","2019-11-14T17:39:26.403",95]
["Test04","Carmen Sõrmus","2019-11-24T21:17:07.561",48]
["Test03","Egert Vint","2019-11-26T11:17:37.828",34]
["Test03","Brita Kaljula","2019-11-16T23:08:30.642",63]
["Test04","Jana Kiisk","2019-11-04T18:49:09.072",42]
["Test02","Sander Kell","2019-11-07T20:27:20.903",54]
["Test02","Erik Pärn","2019-11-05T23:26:22.120",38]
["Test03","Maarja Pihlak","2019-11-07T20:43:20.861",54]
["Test02","Rasmus Kroon","2019-11-14T08:23:04.892",23]
["Test01","Joonas Haljas","2019-11-03T23:42:12.442",100]
["Test03","Markus Niidas","2019-11-25T09:49:24.840",51]
["Test02","Jana Kiisk","2019-11-29T21:20:57.495",22]
["Test02","Carmen Sõrmus","2019-11-30T14:55:10.855",89]
["Test04","Anette Lepp","2019-11-01T21:48:50.501",31]
["Test03","Karin Saar","2019-11-03T15:42:53.359",54]
["Test02","Diana Taal","2019-11-18T16:16:35.022",77]
["Test02","Brita Kaljula","2019-11-13T16:33:32.003",90]
["Test03","Katrin Laurits","2019-11-22T21:22:39.102",76]
["Test01","Kertu Heinsoo","2019-11-24T14:52:31.948",26]
["Test04","Brita Kaljula","2019-11-09T17:12:15.900",37]
["Test01","Kaspar Raude","2019-11-18T08:14:19.895",30]
["Test01","Sander Kell","2019-11-02T17:00:05.154",74]
["Test02","Lauri Vahtra","2019-11-11T23:07:12.813",55]
["Test03","Anette Lepp","2019-11-12T21:32:58.016",26]
["Test01","Reimo Kala","2019-11-21T18:24:55.206",74]
["Test04","Armin Kaasik","2019-11-09T22:35:45.996",46]
["Test02","Mihkel Kulp","2019-11-17T14:06:54.666",59]
["Test04","Maarja Pihlak","2019-11-16T09:33:35.999",28]
["Test02","Alari Suur","2019-11-04T19:24:46.079",20]
["Test04","Artur Piiri","2019-11-24T11:30:50.133",54]
[{"$f":"INDEX($G$4:$G$7,RANDBETWEEN(1,4))","v":"Test04"},{"$f":"INDEX($I$2:$I$36,RANDBETWEEN(1,35))","v":"Jaagup Kivi"},{"$f":"RANDBETWEEN($F$2,$G$2)+$F$1+RAND()*($G$1-$F$1)","v":"2019-11-10T22:37:36.231"},{"$f":"RANDBETWEEN(20,100)","v":36}]
["Test03","Jaagup Kivi","2019-11-15T17:43:06.170",64]
["Test01","Lauri Vahtra","2019-11-21T17:29:10.402",62]
["Test03","Getlin Allas","2019-11-30T10:07:54.463",91]
["Test03","Paul Hein","2019-11-12T22:42:44.862",96]
["Test01","Tarvo Järv","2019-11-03T17:47:38.051",40]
["Test03","Jana Kiisk","2019-11-18T13:32:11.287",81]
["Test02","Armin Kaasik","2019-11-30T23:27:50.194",26]
["Test04","Egert Vint","2019-11-10T23:35:51.538",77]
["Test02","Sander Kell","2019-11-09T11:03:33.485",82]
["Test02","Katrin Laurits","2019-11-17T13:43:18.426",64]
["Test04","Hanna Laid","2019-11-28T20:49:49.869",61]
["Test04","Brita Kaljula","2019-11-07T17:35:36.276",98]
["Test01","Rasmus Kroon","2019-11-28T12:11:41.871",59]
["Test02","Kaspar Raude","2019-11-15T20:23:55.367",60]
["Test01","Reimo Kala","2019-11-27T16:28:43.721",59]