{"text_format":"1","workbook":"xlsx","n_sheets":4,"sheets":["Viitenumber","tudengid","testid","testid (2)"],"not_rendered":{"charts":0,"images":0,"macros":1,"external_links":0,"defined_names":12,"comments":0,"pivot_tables":2},"unopened":[],"bounds":{"document_bytes":16777216,"sheet_cells":100000,"rows_first":2000,"rows_last":500,"rows_between":2000,"halvings":0,"cell_chars":16384,"cell_head_chars":4096},"cells_cut":0,"cells_raw":0,"read":"whole","date_system":"1900"}

{"sheet":"Viitenumber","index":0,"n_rows":17,"n_cols":4,"rows_kept":17,"cut":false,"hidden":false,"merged":[]}
[]
[]
[]
[]
[]
[]
[]
[]
[null,"Algne number","Kontrolljärk","Viitenumber"]
[null,3698525,{"$f":"kontroll_nr(B10)","v":4},{"$f":"IFERROR(viitenumber(B10),\"\")","v":36985254}]
[null,201911458,{"$f":"kontroll_nr(B11)","v":7},{"$f":"IFERROR(viitenumber(B11),\"\")","v":2019114587}]
[null,369,{"$f":"kontroll_nr(B12)","v":6},{"$f":"IFERROR(viitenumber(B12),\"\")","v":3696}]
[null,"A1458",{"$f":"kontroll_nr(B13)","v":{"$error":"#VALUE!"}},{"$f":"IFERROR(viitenumber(B13),\"\")","v":""}]
[null,20085789125,{"$f":"kontroll_nr(B14)","v":9},{"$f":"IFERROR(viitenumber(B14),\"\")","v":200857891259}]
[null,25874,{"$f":"kontroll_nr(B15)","v":2},{"$f":"IFERROR(viitenumber(B15),\"\")","v":258742}]
[null,134589,{"$f":"kontroll_nr(B16)","v":0},{"$f":"IFERROR(viitenumber(B16),\"\")","v":1345890}]
[null,1,{"$f":"kontroll_nr(B17)","v":3},{"$f":"IFERROR(viitenumber(B17),\"\")","v":13}]

{"sheet":"tudengid","index":1,"n_rows":39,"n_cols":4,"rows_kept":39,"cut":false,"hidden":false,"merged":[]}
[]
[]
[]
["Rühm","Eesnimi","Perenimi","Nimi"]
["R2","Katrin","Laurits",{"$f":"Eesnimi & \" \" &Perenimi","v":"Katrin Laurits"}]
["R1","Anette","Lepp","Anette Lepp"]
["R3","Reimo","Kala","Reimo Kala"]
["R3","Egert","Vint","Egert Vint"]
["R2","Carmen","Sõrmus","Carmen Sõrmus"]
["R2","Armin","Kaasik","Armin Kaasik"]
["R3","Jana","Kiisk","Jana Kiisk"]
["R1","Kaspar","Raude","Kaspar Raude"]
["R3","Karin","Saar","Karin Saar"]
["R2","Hanna","Laid","Hanna Laid"]
["R1","Mihkel","Kulp","Mihkel Kulp"]
["R1","Markus","Niidas","Markus Niidas"]
["R2","Alari","Suur","Alari Suur"]
["R1","Erik","Pärn","Erik Pärn"]
["R1","Martin","Aavik","Martin Aavik"]
["R3","Maarja","Pihlak","Maarja Pihlak"]
{"$rows_left_out":20}
{"sheet":"testid","index":2,"n_rows":1173,"n_cols":35,"rows_kept":1173,"cut":false,"hidden":false,"merged":[]}
[]
[null,null,null,null,null,null,null,null,"1. Leida iga tudengi iga testi kolme viimase testisoorituse aritmeetiline keskmine",null,null,null,null,null,null,"1. Leida iga tudengi iga testi kolme viimase testisoorituse aritmeetiline keskmine"]
[null,null,null,null,null,null,null,null,null,null,null,null,null,null,null,"(valemiga)",null,null,null,null,{"$f":"_xlfn.FORMULATEXT(U7)","v":"=INDEX(Rühm;MATCH(P7;Harjutus14.xlsm!Nimi;0))"}]
["Test","Nimi","Aeg","Tulemus","Jnr","Rühm",null,null,"Jnr","(Multiple Items)",null,null,null,null,null,null,{"$f":"_xlfn.FORMULATEXT(Q7)","v":"=AVERAGEIFS(Tulemus;Nimi;$P7;Test;Q$6;Jnr;\"<=3\")"},null,null,null,null,null,null,"2. Iga tudengi iga testi parim tulemus (liigendtabeliga)",null,null,null,null,null,null,"2. Iga tudengi iga testi parim tulemus (valemiga)"]
["Test02","Robert Lentso","2019-11-12T13:16:35.251",37,{"$f":"COUNTIFS(Test,A5,Nimi,B5,Aeg,\">=\"&C5)","v":8}]
["Test01","Robert Lentso","2019-11-30T09:20:24.603",22,{"$f":"COUNTIFS(Test,A6,Nimi,B6,Aeg,\">=\"&C6)","v":1},null,null,null,"Average of Tulemus","Column Labels",null,null,null,null,null,"Nimi","Test01","Test02","Test03","Test04","Rühm",null,null,"Max. of Tulemus","Column Labels",null,null,null,null,null,"Nimi","Test01","Test02","Test03","Test04"]
["Test03","Sander Kell","2019-11-14T08:35:59.974",55,{"$f":"COUNTIFS(Test,A7,Nimi,B7,Aeg,\">=\"&C7)","v":2},null,null,null,"Row Labels","Test01","Test02","Test03","Test04","Grand Total",null,"Karin Saar",{"$f":"AVERAGEIFS(Tulemus,Nimi,$P7,Test,Q$6,Jnr,\"<=3\")","v":92},{"$f":"AVERAGEIFS(Tulemus,Nimi,$P7,Test,R$6,Jnr,\"<=3\")","v":58.333333333333336},{"$f":"AVERAGEIFS(Tulemus,Nimi,$P7,Test,S$6,Jnr,\"<=3\")","v":71.333333333333329},{"$f":"AVERAGEIFS(Tulemus,Nimi,$P7,Test,T$6,Jnr,\"<=3\")","v":65},{"$f":"INDEX(Rühm,MATCH(P7,[0]!Nimi,0))","v":"R3"},null,null,"Row Labels","Test01","Test02","Test03","Test04","Grand Total",null,"Alari Suur",{"$f":"_xlfn.MAXIFS(Tulemus,Nimi,$AE7,Test,AF$6)","v":96},{"$f":"_xlfn.MAXIFS(Tulemus,Nimi,$AE7,Test,AG$6)","v":91},{"$f":"_xlfn.MAXIFS(Tulemus,Nimi,$AE7,Test,AH$6)","v":88},{"$f":"_xlfn.MAXIFS(Tulemus,Nimi,$AE7,Test,AI$6)","v":93}]
["Test04","Kristina Merila","2019-11-21T20:48:11.179",78,{"$f":"COUNTIFS(Test,A8,Nimi,B8,Aeg,\">=\"&C8)","v":5},null,null,null,"Alari Suur",79,68.666666666666671,61,56,66.166666666666671,null,"Maarja Pihlak",{"$f":"AVERAGEIFS(Tulemus,Nimi,$P8,Test,Q$6,Jnr,\"<=3\")","v":92},{"$f":"AVERAGEIFS(Tulemus,Nimi,$P8,Test,R$6,Jnr,\"<=3\")","v":69},{"$f":"AVERAGEIFS(Tulemus,Nimi,$P8,Test,S$6,Jnr,\"<=3\")","v":79.666666666666671},{"$f":"AVERAGEIFS(Tulemus,Nimi,$P8,Test,T$6,Jnr,\"<=3\")","v":62.666666666666664},{"$f":"INDEX(Rühm,MATCH(P8,[0]!Nimi,0))","v":"R3"},null,null,"Alari Suur",96,91,88,93,96,null,"Anette Lepp",{"$f":"_xlfn.MAXIFS(Tulemus,Nimi,$AE8,Test,AF$6)","v":94},{"$f":"_xlfn.MAXIFS(Tulemus,Nimi,$AE8,Test,AG$6)","v":99},{"$f":"_xlfn.MAXIFS(Tulemus,Nimi,$AE8,Test,AH$6)","v":97},{"$f":"_xlfn.MAXIFS(Tulemus,Nimi,$AE8,Test,AI$6)","v":80}]
["Test01","Kertu Heinsoo","2019-11-28T19:05:40.022",70,{"$f":"COUNTIFS(Test,A9,Nimi,B9,Aeg,\">=\"&C9)","v":3},null,null,null,"Anette Lepp",76.333333333333329,63.333333333333336,71,37.666666666666664,62.083333333333336,null,"Jaagup Kivi",{"$f":"AVERAGEIFS(Tulemus,Nimi,$P9,Test,Q$6,Jnr,\"<=3\")","v":85.666666666666671},{"$f":"AVERAGEIFS(Tulemus,Nimi,$P9,Test,R$6,Jnr,\"<=3\")","v":70.666666666666671},{"$f":"AVERAGEIFS(Tulemus,Nimi,$P9,Test,S$6,Jnr,\"<=3\")","v":54.333333333333336},{"$f":"AVERAGEIFS(Tulemus,Nimi,$P9,Test,T$6,Jnr,\"<=3\")","v":65},{"$f":"INDEX(Rühm,MATCH(P9,[0]!Nimi,0))","v":"R2"},null,null,"Anette Lepp",94,99,97,80,99,null,"Anna Koel",{"$f":"_xlfn.MAXIFS(Tulemus,Nimi,$AE9,Test,AF$6)","v":72},{"$f":"_xlfn.MAXIFS(Tulemus,Nimi,$AE9,Test,AG$6)","v":99},{"$f":"_xlfn.MAXIFS(Tulemus,Nimi,$AE9,Test,AH$6)","v":81},{"$f":"_xlfn.MAXIFS(Tulemus,Nimi,$AE9,Test,AI$6)","v":100}]
["Test03","Kertu Heinsoo","2019-11-20T20:41:35.651",75,{"$f":"COUNTIFS(Test,A10,Nimi,B10,Aeg,\">=\"&C10)","v":6},null,null,null,"Anna Koel",51.333333333333336,50,48.333333333333336,59.666666666666664,52.333333333333336,null,"Brita Kaljula",{"$f":"AVERAGEIFS(Tulemus,Nimi,$P10,Test,Q$6,Jnr,\"<=3\")","v":83},{"$f":"AVERAGEIFS(Tulemus,Nimi,$P10,Test,R$6,Jnr,\"<=3\")","v":62.666666666666664},{"$f":"AVERAGEIFS(Tulemus,Nimi,$P10,Test,S$6,Jnr,\"<=3\")","v":54.333333333333336},{"$f":"AVERAGEIFS(Tulemus,Nimi,$P10,Test,T$6,Jnr,\"<=3\")","v":43.666666666666664},{"$f":"INDEX(Rühm,MATCH(P10,[0]!Nimi,0))","v":"R1"},null,null,"Anna Koel",72,99,81,100,100,null,"Armin Kaasik",{"$f":"_xlfn.MAXIFS(Tulemus,Nimi,$AE10,Test,AF$6)","v":95},{"$f":"_xlfn.MAXIFS(Tulemus,Nimi,$AE10,Test,AG$6)","v":79},{"$f":"_xlfn.MAXIFS(Tulemus,Nimi,$AE10,Test,AH$6)","v":100},{"$f":"_xlfn.MAXIFS(Tulemus,Nimi,$AE10,Test,AI$6)","v":56}]
["Test01","Urmas Lõhmus","2019-11-13T14:20:00.655",45,{"$f":"COUNTIFS(Test,A11,Nimi,B11,Aeg,\">=\"&C11)","v":4},null,null,null,"Armin Kaasik",75,46.666666666666664,61.666666666666664,42,56.333333333333336,null,"Alari Suur",{"$f":"AVERAGEIFS(Tulemus,Nimi,$P11,Test,Q$6,Jnr,\"<=3\")","v":79},{"$f":"AVERAGEIFS(Tulemus,Nimi,$P11,Test,R$6,Jnr,\"<=3\")","v":68.666666666666671},{"$f":"AVERAGEIFS(Tulemus,Nimi,$P11,Test,S$6,Jnr,\"<=3\")","v":61},{"$f":"AVERAGEIFS(Tulemus,Nimi,$P11,Test,T$6,Jnr,\"<=3\")","v":56},{"$f":"INDEX(Rühm,MATCH(P11,[0]!Nimi,0))","v":"R2"},null,null,"Armin Kaasik",95,79,100,56,100,null,"Artur Piiri",{"$f":"_xlfn.MAXIFS(Tulemus,Nimi,$AE11,Test,AF$6)","v":98},{"$f":"_xlfn.MAXIFS(Tulemus,Nimi,$AE11,Test,AG$6)","v":97},{"$f":"_xlfn.MAXIFS(Tulemus,Nimi,$AE11,Test,AH$6)","v":99},{"$f":"_xlfn.MAXIFS(Tulemus,Nimi,$AE11,Test,AI$6)","v":93}]
["Test04","Robert Lentso","2019-11-17T20:51:19.625",59,{"$f":"COUNTIFS(Test,A12,Nimi,B12,Aeg,\">=\"&C12)","v":3},null,null,null,"Artur Piiri",68.333333333333329,84.333333333333329,56.666666666666664,88,74.333333333333329,null,"Joonas Haljas",{"$f":"AVERAGEIFS(Tulemus,Nimi,$P12,Test,Q$6,Jnr,\"<=3\")","v":78.333333333333329},{"$f":"AVERAGEIFS(Tulemus,Nimi,$P12,Test,R$6,Jnr,\"<=3\")","v":35.666666666666664},{"$f":"AVERAGEIFS(Tulemus,Nimi,$P12,Test,S$6,Jnr,\"<=3\")","v":66.666666666666671},{"$f":"AVERAGEIFS(Tulemus,Nimi,$P12,Test,T$6,Jnr,\"<=3\")","v":57},{"$f":"INDEX(Rühm,MATCH(P12,[0]!Nimi,0))","v":"R3"},null,null,"Artur Piiri",98,97,99,93,99,null,"Brita Kaljula",{"$f":"_xlfn.MAXIFS(Tulemus,Nimi,$AE12,Test,AF$6)","v":99},{"$f":"_xlfn.MAXIFS(Tulemus,Nimi,$AE12,Test,AG$6)","v":100},{"$f":"_xlfn.MAXIFS(Tulemus,Nimi,$AE12,Test,AH$6)","v":97},{"$f":"_xlfn.MAXIFS(Tulemus,Nimi,$AE12,Test,AI$6)","v":100}]
["Test03","Joonas Haljas","2019-11-23T08:56:43.995",40,{"$f":"COUNTIFS(Test,A13,Nimi,B13,Aeg,\">=\"&C13)","v":2},null,null,null,"Brita Kaljula",83,62.666666666666664,54.333333333333336,43.666666666666664,60.916666666666664,null,"Anette Lepp",{"$f":"AVERAGEIFS(Tulemus,Nimi,$P13,Test,Q$6,Jnr,\"<=3\")","v":76.333333333333329},{"$f":"AVERAGEIFS(Tulemus,Nimi,$P13,Test,R$6,Jnr,\"<=3\")","v":63.333333333333336},{"$f":"AVERAGEIFS(Tulemus,Nimi,$P13,Test,S$6,Jnr,\"<=3\")","v":71},{"$f":"AVERAGEIFS(Tulemus,Nimi,$P13,Test,T$6,Jnr,\"<=3\")","v":37.666666666666664},{"$f":"INDEX(Rühm,MATCH(P13,[0]!Nimi,0))","v":"R1"},null,null,"Brita Kaljula",99,100,97,100,100,null,"Carmen Sõrmus",{"$f":"_xlfn.MAXIFS(Tulemus,Nimi,$AE13,Test,AF$6)","v":70},{"$f":"_xlfn.MAXIFS(Tulemus,Nimi,$AE13,Test,AG$6)","v":97},{"$f":"_xlfn.MAXIFS(Tulemus,Nimi,$AE13,Test,AH$6)","v":67},{"$f":"_xlfn.MAXIFS(Tulemus,Nimi,$AE13,Test,AI$6)","v":86}]
["Test04","Urmas Lõhmus","2019-11-23T15:08:20.630",96,{"$f":"COUNTIFS(Test,A14,Nimi,B14,Aeg,\">=\"&C14)","v":2},null,null,null,"Carmen Sõrmus",31.333333333333332,57.333333333333336,45.666666666666664,73.333333333333329,51.916666666666664,null,"Armin Kaasik",{"$f":"AVERAGEIFS(Tulemus,Nimi,$P14,Test,Q$6,Jnr,\"<=3\")","v":75},{"$f":"AVERAGEIFS(Tulemus,Nimi,$P14,Test,R$6,Jnr,\"<=3\")","v":46.666666666666664},{"$f":"AVERAGEIFS(Tulemus,Nimi,$P14,Test,S$6,Jnr,\"<=3\")","v":61.666666666666664},{"$f":"AVERAGEIFS(Tulemus,Nimi,$P14,Test,T$6,Jnr,\"<=3\")","v":42},{"$f":"INDEX(Rühm,MATCH(P14,[0]!Nimi,0))","v":"R2"},null,null,"Carmen Sõrmus",70,97,67,86,97,null,"Diana Taal",{"$f":"_xlfn.MAXIFS(Tulemus,Nimi,$AE14,Test,AF$6)","v":86},{"$f":"_xlfn.MAXIFS(Tulemus,Nimi,$AE14,Test,AG$6)","v":93},{"$f":"_xlfn.MAXIFS(Tulemus,Nimi,$AE14,Test,AH$6)","v":95},{"$f":"_xlfn.MAXIFS(Tulemus,Nimi,$AE14,Test,AI$6)","v":93}]
["Test02","Robert Lentso","2019-11-13T17:35:12.257",68,{"$f":"COUNTIFS(Test,A15,Nimi,B15,Aeg,\">=\"&C15)","v":7},null,null,null,"Diana Taal",53,79.333333333333329,62.666666666666664,78,68.25,null,"Hans Kukk",{"$f":"AVERAGEIFS(Tulemus,Nimi,$P15,Test,Q$6,Jnr,\"<=3\")","v":75},{"$f":"AVERAGEIFS(Tulemus,Nimi,$P15,Test,R$6,Jnr,\"<=3\")","v":58.666666666666664},{"$f":"AVERAGEIFS(Tulemus,Nimi,$P15,Test,S$6,Jnr,\"<=3\")","v":69.666666666666671},{"$f":"AVERAGEIFS(Tulemus,Nimi,$P15,Test,T$6,Jnr,\"<=3\")","v":53},{"$f":"INDEX(Rühm,MATCH(P15,[0]!Nimi,0))","v":"R1"},null,null,"Diana Taal",86,93,95,93,95,null,"Egert Vint",{"$f":"_xlfn.MAXIFS(Tulemus,Nimi,$AE15,Test,AF$6)","v":100},{"$f":"_xlfn.MAXIFS(Tulemus,Nimi,$AE15,Test,AG$6)","v":81},{"$f":"_xlfn.MAXIFS(Tulemus,Nimi,$AE15,Test,AH$6)","v":84},{"$f":"_xlfn.MAXIFS(Tulemus,Nimi,$AE15,Test,AI$6)","v":78}]
["Test03","Kristina Merila","2019-11-15T16:15:08.575",59,{"$f":"COUNTIFS(Test,A16,Nimi,B16,Aeg,\">=\"&C16)","v":6},null,null,null,"Egert Vint",44,41.666666666666664,64,38.333333333333336,47,null,"Reimo Kala",{"$f":"AVERAGEIFS(Tulemus,Nimi,$P16,Test,Q$6,Jnr,\"<=3\")","v":75},{"$f":"AVERAGEIFS(Tulemus,Nimi,$P16,Test,R$6,Jnr,\"<=3\")","v":79.666666666666671},{"$f":"AVERAGEIFS(Tulemus,Nimi,$P16,Test,S$6,Jnr,\"<=3\")","v":51.666666666666664},{"$f":"AVERAGEIFS(Tulemus,Nimi,$P16,Test,T$6,Jnr,\"<=3\")","v":76.333333333333329},{"$f":"INDEX(Rühm,MATCH(P16,[0]!Nimi,0))","v":"R3"},null,null,"Egert Vint",100,81,84,78,100,null,"Emili Loorits",{"$f":"_xlfn.MAXIFS(Tulemus,Nimi,$AE16,Test,AF$6)","v":69},{"$f":"_xlfn.MAXIFS(Tulemus,Nimi,$AE16,Test,AG$6)","v":100},{"$f":"_xlfn.MAXIFS(Tulemus,Nimi,$AE16,Test,AH$6)","v":85},{"$f":"_xlfn.MAXIFS(Tulemus,Nimi,$AE16,Test,AI$6)","v":84}]
["Test02","Hans Kukk","2019-11-01T10:22:42.466",26,{"$f":"COUNTIFS(Test,A17,Nimi,B17,Aeg,\">=\"&C17)","v":9},null,null,null,"Emili Loorits",56.333333333333336,74.666666666666671,31.666666666666668,44,51.666666666666664,null,"Erik Pärn",{"$f":"AVERAGEIFS(Tulemus,Nimi,$P17,Test,Q$6,Jnr,\"<=3\")","v":71.333333333333329},{"$f":"AVERAGEIFS(Tulemus,Nimi,$P17,Test,R$6,Jnr,\"<=3\")","v":59},{"$f":"AVERAGEIFS(Tulemus,Nimi,$P17,Test,S$6,Jnr,\"<=3\")","v":66},{"$f":"AVERAGEIFS(Tulemus,Nimi,$P17,Test,T$6,Jnr,\"<=3\")","v":86.666666666666671},{"$f":"INDEX(Rühm,MATCH(P17,[0]!Nimi,0))","v":"R1"},null,null,"Emili Loorits",69,100,85,84,100,null,"Erik Pärn",{"$f":"_xlfn.MAXIFS(Tulemus,Nimi,$AE17,Test,AF$6)","v":93},{"$f":"_xlfn.MAXIFS(Tulemus,Nimi,$AE17,Test,AG$6)","v":94},{"$f":"_xlfn.MAXIFS(Tulemus,Nimi,$AE17,Test,AH$6)","v":84},{"$f":"_xlfn.MAXIFS(Tulemus,Nimi,$AE17,Test,AI$6)","v":98}]
["Test03","Rasmus Kroon","2019-11-11T14:22:22.170",73,{"$f":"COUNTIFS(Test,A18,Nimi,B18,Aeg,\">=\"&C18)","v":7},null,null,null,"Erik Pärn",71.333333333333329,59,66,86.666666666666671,70.75,null,"Hanna Laid",{"$f":"AVERAGEIFS(Tulemus,Nimi,$P18,Test,Q$6,Jnr,\"<=3\")","v":70.333333333333329},{"$f":"AVERAGEIFS(Tulemus,Nimi,$P18,Test,R$6,Jnr,\"<=3\")","v":53.666666666666664},{"$f":"AVERAGEIFS(Tulemus,Nimi,$P18,Test,S$6,Jnr,\"<=3\")","v":69.666666666666671},{"$f":"AVERAGEIFS(Tulemus,Nimi,$P18,Test,T$6,Jnr,\"<=3\")","v":49.333333333333336},{"$f":"INDEX(Rühm,MATCH(P18,[0]!Nimi,0))","v":"R2"},null,null,"Erik Pärn",93,94,84,98,98,null,"Getlin Allas",{"$f":"_xlfn.MAXIFS(Tulemus,Nimi,$AE18,Test,AF$6)","v":97},{"$f":"_xlfn.MAXIFS(Tulemus,Nimi,$AE18,Test,AG$6)","v":92},{"$f":"_xlfn.MAXIFS(Tulemus,Nimi,$AE18,Test,AH$6)","v":85},{"$f":"_xlfn.MAXIFS(Tulemus,Nimi,$AE18,Test,AI$6)","v":98}]
["Test01","Maarja Pihlak","2019-11-29T09:41:58.019",89,{"$f":"COUNTIFS(Test,A19,Nimi,B19,Aeg,\">=\"&C19)","v":1},null,null,null,"Getlin Allas",67.333333333333329,62.666666666666664,63.666666666666664,51.666666666666664,61.333333333333336,null,"Artur Piiri",{"$f":"AVERAGEIFS(Tulemus,Nimi,$P19,Test,Q$6,Jnr,\"<=3\")","v":68.333333333333329},{"$f":"AVERAGEIFS(Tulemus,Nimi,$P19,Test,R$6,Jnr,\"<=3\")","v":84.333333333333329},{"$f":"AVERAGEIFS(Tulemus,Nimi,$P19,Test,S$6,Jnr,\"<=3\")","v":56.666666666666664},{"$f":"AVERAGEIFS(Tulemus,Nimi,$P19,Test,T$6,Jnr,\"<=3\")","v":88},{"$f":"INDEX(Rühm,MATCH(P19,[0]!Nimi,0))","v":"R1"},null,null,"Getlin Allas",97,92,85,98,98,null,"Hanna Laid",{"$f":"_xlfn.MAXIFS(Tulemus,Nimi,$AE19,Test,AF$6)","v":92},{"$f":"_xlfn.MAXIFS(Tulemus,Nimi,$AE19,Test,AG$6)","v":84},{"$f":"_xlfn.MAXIFS(Tulemus,Nimi,$AE19,Test,AH$6)","v":99},{"$f":"_xlfn.MAXIFS(Tulemus,Nimi,$AE19,Test,AI$6)","v":99}]
["Test01","Sander Kell","2019-11-09T13:18:08.716",30,{"$f":"COUNTIFS(Test,A20,Nimi,B20,Aeg,\">=\"&C20)","v":9},null,null,null,"Hanna Laid",70.333333333333329,53.666666666666664,69.666666666666671,49.333333333333336,60.75,null,"Getlin Allas",{"$f":"AVERAGEIFS(Tulemus,Nimi,$P20,Test,Q$6,Jnr,\"<=3\")","v":67.333333333333329},{"$f":"AVERAGEIFS(Tulemus,Nimi,$P20,Test,R$6,Jnr,\"<=3\")","v":62.666666666666664},{"$f":"AVERAGEIFS(Tulemus,Nimi,$P20,Test,S$6,Jnr,\"<=3\")","v":63.666666666666664},{"$f":"AVERAGEIFS(Tulemus,Nimi,$P20,Test,T$6,Jnr,\"<=3\")","v":51.666666666666664},{"$f":"INDEX(Rühm,MATCH(P20,[0]!Nimi,0))","v":"R2"},null,null,"Hanna Laid",92,84,99,99,99,null,"Hans Kukk",{"$f":"_xlfn.MAXIFS(Tulemus,Nimi,$AE20,Test,AF$6)","v":100},{"$f":"_xlfn.MAXIFS(Tulemus,Nimi,$AE20,Test,AG$6)","v":97},{"$f":"_xlfn.MAXIFS(Tulemus,Nimi,$AE20,Test,AH$6)","v":100},{"$f":"_xlfn.MAXIFS(Tulemus,Nimi,$AE20,Test,AI$6)","v":96}]
{"$rows_left_out":1154}
{"sheet":"testid (2)","index":3,"n_rows":1173,"n_cols":13,"rows_kept":1173,"cut":false,"hidden":true,"merged":[]}
[null,null,null,null,null,"08:00:00","23:55:00",null,null,"Test01","Test02","Test03","Test04"]
[null,null,null,null,null,"2019-11-01","2019-11-30",null,"Katrin Laurits",{"$f":"COUNTIFS($A:$A,J$1,$B:$B,$I2)","v":10},{"$f":"COUNTIFS($A:$A,K$1,$B:$B,$I2)","v":7},10,8]
[null,null,null,null,null,null,null,null,"Anette Lepp",{"$f":"COUNTIFS($A:$A,J$1,$B:$B,$I3)","v":6},8,10,7]
["Test","Nimi","Aeg","Tulemus",null,null,"Test01",null,"Reimo Kala",7,7,10,5]
[{"$f":"INDEX($G$4:$G$7,RANDBETWEEN(1,4))","v":"Test03"},{"$f":"INDEX($I$2:$I$36,RANDBETWEEN(1,35))","v":"Markus Niidas"},{"$f":"RANDBETWEEN($F$2,$G$2)+$F$1+RAND()*($G$1-$F$1)","v":"2019-11-17T23:32:28.184"},{"$f":"RANDBETWEEN(20,100)","v":57},null,null,"Test02",null,"Egert Vint",13,12,6,14]
[{"$f":"INDEX($G$4:$G$7,RANDBETWEEN(1,4))","v":"Test02"},{"$f":"INDEX($I$2:$I$36,RANDBETWEEN(1,35))","v":"Egert Vint"},{"$f":"RANDBETWEEN($F$2,$G$2)+$F$1+RAND()*($G$1-$F$1)","v":"2019-11-02T19:10:31.461"},{"$f":"RANDBETWEEN(20,100)","v":81},null,null,"Test03",null,"Carmen Sõrmus",11,8,5,17]
["Test01","Anna Koel","2019-11-11T16:07:42.342",25,null,null,"Test04",null,"Armin Kaasik",5,8,6,6]
["Test01","Artur Piiri","2019-11-11T19:30:25.092",89,null,null,null,null,"Jana Kiisk",5,5,4,6]
["Test03","Getlin Allas","2019-11-24T18:31:32.922",67,null,null,null,null,"Kaspar Raude",13,9,9,9]
["Test03","Tarvo Järv","2019-11-12T11:36:24.656",23,null,35,null,null,"Karin Saar",11,10,13,6]
["Test02","Lauri Vahtra","2019-11-18T22:49:49.800",90,null,4,null,null,"Hanna Laid",4,4,10,11]
["Test04","Diana Taal","2019-11-30T12:24:30.892",31,null,5,null,null,"Mihkel Kulp",7,11,3,13]
["Test04","Maarja Pihlak","2019-11-18T16:24:00.655",68,null,{"$f":"F10*F11*F12","v":700},null,null,"Markus Niidas",10,17,11,12]
["Test03","Emili Loorits","2019-11-21T16:12:45.132",81,null,null,null,null,"Alari Suur",6,11,7,8]
["Test01","Kertu Heinsoo","2019-11-21T20:30:38.929",70,null,null,null,null,"Erik Pärn",8,5,4,6]
["Test03","Hans Kukk","2019-11-24T23:22:13.735",80,null,null,null,null,"Martin Aavik",6,11,7,11]
["Test04","Carmen Sõrmus","2019-11-13T10:50:23.362",21,null,null,null,null,"Maarja Pihlak",12,7,7,14]
["Test03","Reimo Kala","2019-11-24T15:30:56.871",28,null,null,null,null,"Urmas Lõhmus",6,4,11,12]
["Test02","Markus Niidas","2019-11-15T21:16:36.970",20,null,null,null,null,"Lauri Vahtra",5,8,7,9]
["Test04","Markus Niidas","2019-11-05T12:36:05.297",99,null,null,null,null,"Emili Loorits",9,4,9,8]
{"$rows_left_out":1153}