{"text_format":"1","workbook":"xlsx","n_sheets":5,"sheets":["Viitenumber","tudengid","testid","Liigendtabelid","testid (2)"],"not_rendered":{"charts":0,"images":0,"macros":1,"external_links":0,"defined_names":12,"comments":0,"pivot_tables":2},"unopened":[],"bounds":{"document_bytes":16777216,"sheet_cells":100000,"rows_first":2000,"rows_last":500,"rows_between":2000,"halvings":0,"cell_chars":16384,"cell_head_chars":4096},"cells_cut":0,"cells_raw":0,"read":"whole","date_system":"1900"}

{"sheet":"Viitenumber","index":0,"n_rows":17,"n_cols":4,"rows_kept":17,"cut":false,"hidden":false,"merged":[]}
[]
[]
[]
[]
[]
[]
[]
[]
[null,"Algne number","Kontrolljärk","Viitenumber"]
[null,3698525,{"$f":"kontroll_nr(B10)","v":4},{"$f":"IFERROR(viitenumber(B10), \"\")","v":36985254}]
[null,201911458,{"$f":"kontroll_nr(B11)","v":7},{"$f":"IFERROR(viitenumber(B11), \"\")","v":2019114587}]
[null,369,{"$f":"kontroll_nr(B12)","v":6},{"$f":"IFERROR(viitenumber(B12), \"\")","v":3696}]
[null,"A1458",{"$f":"kontroll_nr(B13)","v":{"$error":"#VALUE!"}},{"$f":"IFERROR(viitenumber(B13), \"\")","v":""}]
[null,20085789125,{"$f":"kontroll_nr(B14)","v":9},{"$f":"IFERROR(viitenumber(B14), \"\")","v":200857891259}]
[null,25874,{"$f":"kontroll_nr(B15)","v":2},{"$f":"IFERROR(viitenumber(B15), \"\")","v":258742}]
[null,134589,{"$f":"kontroll_nr(B16)","v":0},{"$f":"IFERROR(viitenumber(B16), \"\")","v":1345890}]
[null,1,{"$f":"kontroll_nr(B17)","v":3},{"$f":"IFERROR(viitenumber(B17), \"\")","v":13}]

{"sheet":"tudengid","index":1,"n_rows":39,"n_cols":4,"rows_kept":39,"cut":false,"hidden":false,"merged":[]}
[]
[]
[]
["Rühm","Eesnimi","Perenimi","Nimi"]
["R2","Katrin","Laurits",{"$f":"Eesnimi&\" \"&Perenimi","v":"Katrin Laurits"}]
["R1","Anette","Lepp","Anette Lepp"]
["R3","Reimo","Kala","Reimo Kala"]
["R3","Egert","Vint","Egert Vint"]
["R2","Carmen","Sõrmus","Carmen Sõrmus"]
["R2","Armin","Kaasik","Armin Kaasik"]
["R3","Jana","Kiisk","Jana Kiisk"]
["R1","Kaspar","Raude","Kaspar Raude"]
["R3","Karin","Saar","Karin Saar"]
["R2","Hanna","Laid","Hanna Laid"]
["R1","Mihkel","Kulp","Mihkel Kulp"]
["R1","Markus","Niidas","Markus Niidas"]
["R2","Alari","Suur","Alari Suur"]
["R1","Erik","Pärn","Erik Pärn"]
["R1","Martin","Aavik","Martin Aavik"]
["R3","Maarja","Pihlak","Maarja Pihlak"]
["R2","Urmas","Lõhmus","Urmas Lõhmus"]
["R3","Lauri","Vahtra","Lauri Vahtra"]
["R1","Emili","Loorits","Emili Loorits"]
["R2","Jaagup","Kivi","Jaagup Kivi"]
["R3","Joonas","Haljas","Joonas Haljas"]
["R1","Robert","Lentso","Robert Lentso"]
["R3","Viktoria","Lumi","Viktoria Lumi"]
["R2","Sander","Kell","Sander Kell"]
["R1","Hans","Kukk","Hans Kukk"]
["R2","Diana","Taal","Diana Taal"]
["R3","Kertu","Heinsoo","Kertu Heinsoo"]
["R3","Tarvo","Järv","Tarvo Järv"]
["R1","Paul","Hein","Paul Hein"]
["R1","Artur","Piiri","Artur Piiri"]
["R2","Getlin","Allas","Getlin Allas"]
["R1","Brita","Kaljula","Brita Kaljula"]
["R1","Anna","Koel","Anna Koel"]
["R3","Kristina","Merila","Kristina Merila"]
["R2","Rasmus","Kroon","Rasmus Kroon"]

{"sheet":"testid","index":2,"n_rows":1173,"n_cols":20,"rows_kept":1173,"cut":false,"hidden":false,"merged":[]}
[null,null,null,{"$f":"_xlfn.FORMULATEXT(E5)","v":"=COUNTIFS(Test; A5;Nimi;B5;Aeg;\">=\" &C5)"},null,null,null,{"$f":"_xlfn.FORMULATEXT(H5)","v":"=MAXIFS(Tulemus;Nimi;$G5;Test;H$4)"},null,null,null,null,null,{"$f":"_xlfn.FORMULATEXT(N5)","v":"=AVERAGEIFS(Tulemus;Nimi;$M5;Test;N$4;Jnr;\"<=3\")"},null,null,null,null,null,{"$f":"_xlfn.FORMULATEXT(R5)","v":"=INDEX(Rühm;MATCH(M5;tudengid!Nimi;0))"}]
[null,null,null,null,null,null,"2. Iga tudengi iga testi parim tulemus (valemiga)",null,null,null,null,null,"1. Iga tudengi iga testi kolme viimase testisoorituse aritmeetiline keskmine (valemiga)"]
[null,null,null,null,null,null,null,null,null,null,null,null,null,null,null,null,null,"(lisatud kolmanda ülesande jaoks)"]
["Test","Nimi","Aeg","Tulemus","Jnr",null,"Nimi","Test01","Test02","Test03","Test04",null,"Nimi","Test01","Test02","Test03","Test04","Rühm"]
["Test02","Robert Lentso","2019-11-12T13:16:35.251",37,{"$f":"COUNTIFS(Test, A5,Nimi,B5,Aeg,\">=\" &C5)","v":8},null,"Alari Suur",{"$f":"_xlfn.MAXIFS(Tulemus,Nimi,$G5,Test,H$4)","v":96},91,88,93,null,"Alari Suur",{"$f":"AVERAGEIFS(Tulemus,Nimi,$M5,Test,N$4,Jnr,\"<=3\")","v":79},68.666666666666671,61,56,{"$f":"INDEX(Rühm,MATCH(M5,tudengid!Nimi,0))","v":"R2"}]
["Test01","Robert Lentso","2019-11-30T09:20:24.603",22,{"$f":"COUNTIFS(Test, A6,Nimi,B6,Aeg,\">=\" &C6)","v":1},null,"Anette Lepp",94,99,97,80,null,"Anette Lepp",76.333333333333329,63.333333333333336,71,37.666666666666664,{"$f":"INDEX(Rühm,MATCH(M6,tudengid!Nimi,0))","v":"R1"}]
["Test03","Sander Kell","2019-11-14T08:35:59.974",55,2,null,"Anna Koel",72,99,81,100,null,"Anna Koel",51.333333333333336,50,48.333333333333336,59.666666666666664,{"$f":"INDEX(Rühm,MATCH(M7,tudengid!Nimi,0))","v":"R1"}]
["Test04","Kristina Merila","2019-11-21T20:48:11.179",78,5,null,"Armin Kaasik",95,79,100,56,null,"Armin Kaasik",75,46.666666666666664,61.666666666666664,42,{"$f":"INDEX(Rühm,MATCH(M8,tudengid!Nimi,0))","v":"R2"}]
["Test01","Kertu Heinsoo","2019-11-28T19:05:40.022",70,3,null,"Artur Piiri",98,97,99,93,null,"Artur Piiri",68.333333333333329,84.333333333333329,56.666666666666664,88,{"$f":"INDEX(Rühm,MATCH(M9,tudengid!Nimi,0))","v":"R1"}]
["Test03","Kertu Heinsoo","2019-11-20T20:41:35.651",75,6,null,"Brita Kaljula",99,100,97,100,null,"Brita Kaljula",83,62.666666666666664,54.333333333333336,43.666666666666664,{"$f":"INDEX(Rühm,MATCH(M10,tudengid!Nimi,0))","v":"R1"}]
["Test01","Urmas Lõhmus","2019-11-13T14:20:00.655",45,4,null,"Carmen Sõrmus",70,97,67,86,null,"Carmen Sõrmus",31.333333333333332,57.333333333333336,45.666666666666664,73.333333333333329,{"$f":"INDEX(Rühm,MATCH(M11,tudengid!Nimi,0))","v":"R2"}]
["Test04","Robert Lentso","2019-11-17T20:51:19.625",59,3,null,"Diana Taal",86,93,95,93,null,"Diana Taal",53,79.333333333333329,62.666666666666664,78,{"$f":"INDEX(Rühm,MATCH(M12,tudengid!Nimi,0))","v":"R2"}]
["Test03","Joonas Haljas","2019-11-23T08:56:43.995",40,2,null,"Egert Vint",100,81,84,78,null,"Egert Vint",44,41.666666666666664,64,38.333333333333336,{"$f":"INDEX(Rühm,MATCH(M13,tudengid!Nimi,0))","v":"R3"}]
["Test04","Urmas Lõhmus","2019-11-23T15:08:20.630",96,2,null,"Emili Loorits",69,100,85,84,null,"Emili Loorits",56.333333333333336,74.666666666666671,31.666666666666668,44,{"$f":"INDEX(Rühm,MATCH(M14,tudengid!Nimi,0))","v":"R1"}]
["Test02","Robert Lentso","2019-11-13T17:35:12.257",68,7,null,"Erik Pärn",93,94,84,98,null,"Erik Pärn",71.333333333333329,59,66,86.666666666666671,{"$f":"INDEX(Rühm,MATCH(M15,tudengid!Nimi,0))","v":"R1"}]
["Test03","Kristina Merila","2019-11-15T16:15:08.575",59,6,null,"Getlin Allas",97,92,85,98,null,"Getlin Allas",67.333333333333329,62.666666666666664,63.666666666666664,51.666666666666664,{"$f":"INDEX(Rühm,MATCH(M16,tudengid!Nimi,0))","v":"R2"}]
["Test02","Hans Kukk","2019-11-01T10:22:42.466",26,9,null,"Hanna Laid",92,84,99,99,null,"Hanna Laid",70.333333333333329,53.666666666666664,69.666666666666671,49.333333333333336,{"$f":"INDEX(Rühm,MATCH(M17,tudengid!Nimi,0))","v":"R2"}]
["Test03","Rasmus Kroon","2019-11-11T14:22:22.170",73,7,null,"Hans Kukk",100,97,100,96,null,"Hans Kukk",75,58.666666666666664,69.666666666666671,53,{"$f":"INDEX(Rühm,MATCH(M18,tudengid!Nimi,0))","v":"R1"}]
["Test01","Maarja Pihlak","2019-11-29T09:41:58.019",89,1,null,"Jaagup Kivi",98,97,87,93,null,"Jaagup Kivi",85.666666666666671,70.666666666666671,54.333333333333336,65,{"$f":"INDEX(Rühm,MATCH(M19,tudengid!Nimi,0))","v":"R2"}]
["Test01","Sander Kell","2019-11-09T13:18:08.716",30,9,null,"Jana Kiisk",84,91,90,91,null,"Jana Kiisk",54,63,64.666666666666671,91,{"$f":"INDEX(Rühm,MATCH(M20,tudengid!Nimi,0))","v":"R3"}]
["Test04","Joonas Haljas","2019-11-22T16:27:02.789",57,1,null,"Joonas Haljas",92,98,99,86,null,"Joonas Haljas",78.333333333333329,35.666666666666664,66.666666666666671,57,{"$f":"INDEX(Rühm,MATCH(M21,tudengid!Nimi,0))","v":"R3"}]
["Test02","Reimo Kala","2019-11-22T16:20:40.046",87,2,null,"Karin Saar",95,80,96,98,null,"Karin Saar",92,58.333333333333336,71.333333333333329,65,{"$f":"INDEX(Rühm,MATCH(M22,tudengid!Nimi,0))","v":"R3"}]
["Test02","Urmas Lõhmus","2019-11-02T10:17:31.185",45,10,null,"Kaspar Raude",95,94,91,89,null,"Kaspar Raude",47,79.333333333333329,70,63,{"$f":"INDEX(Rühm,MATCH(M23,tudengid!Nimi,0))","v":"R1"}]
["Test03","Martin Aavik","2019-11-25T21:13:36.966",63,3,null,"Katrin Laurits",98,84,99,97,null,"Katrin Laurits",46.333333333333336,39,78,64,{"$f":"INDEX(Rühm,MATCH(M24,tudengid!Nimi,0))","v":"R2"}]
["Test02","Lauri Vahtra","2019-11-25T17:23:27.962",27,3,null,"Kertu Heinsoo",{"$f":"_xlfn.MAXIFS(Tulemus,Nimi,$G25,Test,H$4)","v":90},82,95,100,null,"Kertu Heinsoo",{"$f":"AVERAGEIFS(Tulemus,Nimi,$M25,Test,N$4,Jnr,\"<=3\")","v":61.666666666666664},55.666666666666664,44,54,{"$f":"INDEX(Rühm,MATCH(M25,tudengid!Nimi,0))","v":"R3"}]
["Test01","Getlin Allas","2019-11-11T21:10:26.773",41,8,null,"Kristina Merila",72,99,97,94,null,"Kristina Merila",45,57.333333333333336,72.333333333333329,39,{"$f":"INDEX(Rühm,MATCH(M26,tudengid!Nimi,0))","v":"R3"}]
["Test01","Karin Saar","2019-11-24T08:00:23.699",88,2,null,"Lauri Vahtra",98,93,99,97,null,"Lauri Vahtra",52.666666666666664,67.666666666666671,65.333333333333329,50,{"$f":"INDEX(Rühm,MATCH(M27,tudengid!Nimi,0))","v":"R3"}]
["Test01","Egert Vint","2019-11-30T14:29:20.273",29,1,null,"Maarja Pihlak",99,97,87,91,null,"Maarja Pihlak",92,69,79.666666666666671,62.666666666666664,{"$f":"INDEX(Rühm,MATCH(M28,tudengid!Nimi,0))","v":"R3"}]
["Test04","Hanna Laid","2019-11-16T11:05:59.488",36,6,null,"Markus Niidas",51,89,79,92,null,"Markus Niidas",39.666666666666664,77.666666666666671,57,67.666666666666671,{"$f":"INDEX(Rühm,MATCH(M29,tudengid!Nimi,0))","v":"R1"}]
["Test02","Maarja Pihlak","2019-11-03T11:24:19.446",81,10,null,"Martin Aavik",91,89,98,99,null,"Martin Aavik",41.333333333333336,46.666666666666664,59.333333333333336,76.666666666666671,{"$f":"INDEX(Rühm,MATCH(M30,tudengid!Nimi,0))","v":"R1"}]
["Test02","Alari Suur","2019-11-14T12:26:57.555",41,5,null,"Mihkel Kulp",88,92,94,95,null,"Mihkel Kulp",48.333333333333336,75.666666666666671,87,83,{"$f":"INDEX(Rühm,MATCH(M31,tudengid!Nimi,0))","v":"R1"}]
["Test01","Anette Lepp","2019-11-10T23:07:57.484",43,5,null,"Paul Hein",97,88,97,83,null,"Paul Hein",52.333333333333336,65,56.666666666666664,49.666666666666664,{"$f":"INDEX(Rühm,MATCH(M32,tudengid!Nimi,0))","v":"R1"}]
["Test01","Carmen Sõrmus","2019-11-17T08:44:30.313",32,3,null,"Rasmus Kroon",83,95,73,95,null,"Rasmus Kroon",66,61.333333333333336,35.333333333333336,84,{"$f":"INDEX(Rühm,MATCH(M33,tudengid!Nimi,0))","v":"R2"}]
["Test04","Rasmus Kroon","2019-11-06T09:20:30.688",95,3,null,"Reimo Kala",95,90,98,92,null,"Reimo Kala",75,79.666666666666671,51.666666666666664,76.333333333333329,{"$f":"INDEX(Rühm,MATCH(M34,tudengid!Nimi,0))","v":"R3"}]
["Test01","Viktoria Lumi","2019-11-18T17:25:51.432",93,3,null,"Robert Lentso",76,99,85,97,null,"Robert Lentso",35.666666666666664,63.333333333333336,49,69,{"$f":"INDEX(Rühm,MATCH(M35,tudengid!Nimi,0))","v":"R1"}]
["Test03","Markus Niidas","2019-11-03T13:01:48.405",66,4,null,"Sander Kell",94,86,93,93,null,"Sander Kell",59.333333333333336,43.666666666666664,69.333333333333329,42.333333333333336,{"$f":"INDEX(Rühm,MATCH(M36,tudengid!Nimi,0))","v":"R2"}]
["Test01","Urmas Lõhmus","2019-11-23T17:32:21.250",69,1,null,"Tarvo Järv",87,97,97,99,null,"Tarvo Järv",61.666666666666664,49.333333333333336,53.333333333333336,91,{"$f":"INDEX(Rühm,MATCH(M37,tudengid!Nimi,0))","v":"R3"}]
["Test02","Lauri Vahtra","2019-11-08T19:49:14.237",47,9,null,"Urmas Lõhmus",73,89,99,96,null,"Urmas Lõhmus",60.666666666666664,45,57.333333333333336,77,{"$f":"INDEX(Rühm,MATCH(M38,tudengid!Nimi,0))","v":"R2"}]
["Test04","Kristina Merila","2019-11-27T19:38:03.161",27,3,null,"Viktoria Lumi",93,98,100,98,null,"Viktoria Lumi",46.666666666666664,63.333333333333336,80,62.333333333333336,{"$f":"INDEX(Rühm,MATCH(M39,tudengid!Nimi,0))","v":"R3"}]
["Test03","Robert Lentso","2019-11-16T21:01:02.483",85,9]
["Test01","Anette Lepp","2019-11-10T12:18:50.568",66,6]
["Test04","Kertu Heinsoo","2019-11-01T17:20:52.084",25,9,null,"3. Igast rühmast esimeses testis kolme viimase katse keskmisena parima tulemuse saanud tudeng"]
["Test02","Markus Niidas","2019-11-07T13:03:59.704",26,7,null,null,{"$f":"_xlfn.FORMULATEXT(H45)","v":"=MAXIFS(Test01;Rühm_1;G45)"},{"$f":"_xlfn.FORMULATEXT(I45)","v":"=INDEX(Nimi_1;MATCH(1;(Rühm_1=G45)*(Test01=H45);0))"}]
["Test01","Kaspar Raude","2019-11-10T09:32:52.618",70,5,null,"Rühm","Parim tulemus","Nimi"]
["Test04","Hanna Laid","2019-11-19T15:29:08.312",52,4,null,"R1",{"$f":"_xlfn.MAXIFS(Test01,Rühm_1,G45)","v":83},{"$f":"INDEX(Nimi_1,MATCH(1,(Rühm_1=G45)*(Test01=H45),0))","v":"Brita Kaljula"}]
["Test04","Viktoria Lumi","2019-11-26T17:49:25.919",98,2,null,"R2",{"$f":"_xlfn.MAXIFS(Test01,Rühm_1,G46)","v":85.666666666666671},{"$f":"INDEX(Nimi_1,MATCH(1,(Rühm_1=G46)*(Test01=H46),0))","v":"Jaagup Kivi"}]
["Test02","Tarvo Järv","2019-11-15T17:04:37.910",45,8,null,"R3",{"$f":"_xlfn.MAXIFS(Test01,Rühm_1,G47)","v":92},{"$f":"INDEX(Nimi_1,MATCH(1,(Rühm_1=G47)*(Test01=H47),0))","v":"Karin Saar"}]
["Test02","Tarvo Järv","2019-11-25T16:48:34.680",48,4]
["Test04","Kaspar Raude","2019-11-03T14:36:34.996",65,8]
["Test01","Armin Kaasik","2019-11-06T12:10:20.256",95,5]
["Test04","Hans Kukk","2019-11-26T21:49:28.605",73,4]
["Test01","Sander Kell","2019-11-04T22:27:01.154",30,10]
["Test02","Tarvo Järv","2019-11-08T19:47:42.241",64,10]
["Test03","Katrin Laurits","2019-11-15T13:04:57.541",41,5]
["Test01","Diana Taal","2019-11-01T12:10:37.538",86,8]
["Test04","Brita Kaljula","2019-11-08T08:30:49.316",30,8]
["Test02","Emili Loorits","2019-11-19T19:00:03.572",92,4]
["Test04","Viktoria Lumi","2019-11-04T17:02:17.438",79,7]
["Test01","Alari Suur","2019-11-20T19:46:51.184",43,4]
["Test04","Jaagup Kivi","2019-11-14T11:07:38.995",72,7]
{"$rows_left_out":1114}
{"sheet":"Liigendtabelid","index":3,"n_rows":43,"n_cols":13,"rows_kept":43,"cut":false,"hidden":false,"merged":[]}
[]
["2. Iga tudengi iga testi parim tulemus ",null,null,null,null,null,null,"1. Iga tudengi iga testi kolme viimase testisoorituse aritmeetiline keskmine"]
[]
["Max. of Tulemus","Column Labels",null,null,null,null,null,"Jnr","(Multiple Items)"]
["Row Labels","Test01","Test02","Test03","Test04","Grand Total"]
["Alari Suur",96,91,88,93,96,null,"Average of Tulemus","Column Labels"]
["Anette Lepp",94,99,97,80,99,null,"Row Labels","Test01","Test02","Test03","Test04","Grand Total"]
["Anna Koel",72,99,81,100,100,null,"Alari Suur",79,68.666666666666671,61,56,66.166666666666671]
["Armin Kaasik",95,79,100,56,100,null,"Anette Lepp",76.333333333333329,63.333333333333336,71,37.666666666666664,62.083333333333336]
["Artur Piiri",98,97,99,93,99,null,"Anna Koel",51.333333333333336,50,48.333333333333336,59.666666666666664,52.333333333333336]
["Brita Kaljula",99,100,97,100,100,null,"Armin Kaasik",75,46.666666666666664,61.666666666666664,42,56.333333333333336]
["Carmen Sõrmus",70,97,67,86,97,null,"Artur Piiri",68.333333333333329,84.333333333333329,56.666666666666664,88,74.333333333333329]
["Diana Taal",86,93,95,93,95,null,"Brita Kaljula",83,62.666666666666664,54.333333333333336,43.666666666666664,60.916666666666664]
["Egert Vint",100,81,84,78,100,null,"Carmen Sõrmus",31.333333333333332,57.333333333333336,45.666666666666664,73.333333333333329,51.916666666666664]
["Emili Loorits",69,100,85,84,100,null,"Diana Taal",53,79.333333333333329,62.666666666666664,78,68.25]
["Erik Pärn",93,94,84,98,98,null,"Egert Vint",44,41.666666666666664,64,38.333333333333336,47]
["Getlin Allas",97,92,85,98,98,null,"Emili Loorits",56.333333333333336,74.666666666666671,31.666666666666668,44,51.666666666666664]
["Hanna Laid",92,84,99,99,99,null,"Erik Pärn",71.333333333333329,59,66,86.666666666666671,70.75]
["Hans Kukk",100,97,100,96,100,null,"Getlin Allas",67.333333333333329,62.666666666666664,63.666666666666664,51.666666666666664,61.333333333333336]
["Jaagup Kivi",98,97,87,93,98,null,"Hanna Laid",70.333333333333329,53.666666666666664,69.666666666666671,49.333333333333336,60.75]
["Jana Kiisk",84,91,90,91,91,null,"Hans Kukk",75,58.666666666666664,69.666666666666671,53,64.083333333333329]
["Joonas Haljas",92,98,99,86,99,null,"Jaagup Kivi",85.666666666666671,70.666666666666671,54.333333333333336,65,68.916666666666671]
["Karin Saar",95,80,96,98,98,null,"Jana Kiisk",54,63,64.666666666666671,91,63.6]
["Kaspar Raude",95,94,91,89,95,null,"Joonas Haljas",78.333333333333329,35.666666666666664,66.666666666666671,57,59.416666666666664]
["Katrin Laurits",98,84,99,97,99,null,"Karin Saar",92,58.333333333333336,71.333333333333329,65,71.666666666666671]
["Kertu Heinsoo",90,82,95,100,100,null,"Kaspar Raude",47,79.333333333333329,70,63,64.833333333333329]
["Kristina Merila",72,99,97,94,99,null,"Katrin Laurits",46.333333333333336,39,78,64,56.833333333333336]
["Lauri Vahtra",98,93,99,97,99,null,"Kertu Heinsoo",61.666666666666664,55.666666666666664,44,54,53.833333333333336]
["Maarja Pihlak",99,97,87,91,99,null,"Kristina Merila",45,57.333333333333336,72.333333333333329,39,53.416666666666664]
["Markus Niidas",51,89,79,92,92,null,"Lauri Vahtra",52.666666666666664,67.666666666666671,65.333333333333329,50,58.916666666666664]
["Martin Aavik",91,89,98,99,99,null,"Maarja Pihlak",92,69,79.666666666666671,62.666666666666664,75.833333333333329]
["Mihkel Kulp",88,92,94,95,95,null,"Markus Niidas",39.666666666666664,77.666666666666671,57,67.666666666666671,60.5]
["Paul Hein",97,88,97,83,97,null,"Martin Aavik",41.333333333333336,46.666666666666664,59.333333333333336,76.666666666666671,56]
["Rasmus Kroon",83,95,73,95,95,null,"Mihkel Kulp",48.333333333333336,75.666666666666671,87,83,73.5]
["Reimo Kala",95,90,98,92,98,null,"Paul Hein",52.333333333333336,65,56.666666666666664,49.666666666666664,55.916666666666664]
["Robert Lentso",76,99,85,97,99,null,"Rasmus Kroon",66,61.333333333333336,35.333333333333336,84,61.666666666666664]
["Sander Kell",94,86,93,93,94,null,"Reimo Kala",75,79.666666666666671,51.666666666666664,76.333333333333329,70.666666666666671]
["Tarvo Järv",87,97,97,99,99,null,"Robert Lentso",35.666666666666664,63.333333333333336,49,69,54.25]
["Urmas Lõhmus",73,89,99,96,99,null,"Sander Kell",59.333333333333336,43.666666666666664,69.333333333333329,42.333333333333336,53.666666666666664]
["Viktoria Lumi",93,98,100,98,100,null,"Tarvo Järv",61.666666666666664,49.333333333333336,53.333333333333336,91,63.833333333333336]
["Grand Total",100,100,100,100,100,null,"Urmas Lõhmus",60.666666666666664,45,57.333333333333336,77,60]
[null,null,null,null,null,null,null,"Viktoria Lumi",46.666666666666664,63.333333333333336,80,62.333333333333336,63.083333333333336]
[null,null,null,null,null,null,null,"Grand Total",61.228571428571428,60.828571428571429,61.38095238095238,62.04854368932039,61.368421052631582]

{"sheet":"testid (2)","index":4,"n_rows":1173,"n_cols":13,"rows_kept":1173,"cut":false,"hidden":true,"merged":[]}
[null,null,null,null,null,"08:00:00","23:55:00",null,null,"Test01","Test02","Test03","Test04"]
[null,null,null,null,null,"2019-11-01","2019-11-30",null,"Katrin Laurits",{"$f":"COUNTIFS($A:$A,J$1,$B:$B,$I2)","v":8},{"$f":"COUNTIFS($A:$A,K$1,$B:$B,$I2)","v":8},12,12]
[null,null,null,null,null,null,null,null,"Anette Lepp",{"$f":"COUNTIFS($A:$A,J$1,$B:$B,$I3)","v":11},8,8,13]
["Test","Nimi","Aeg","Tulemus",null,null,"Test01",null,"Reimo Kala",8,3,7,4]
[{"$f":"INDEX($G$4:$G$7,RANDBETWEEN(1,4))","v":"Test01"},{"$f":"INDEX($I$2:$I$36,RANDBETWEEN(1,35))","v":"Urmas Lõhmus"},{"$f":"RANDBETWEEN($F$2,$G$2)+$F$1+RAND()*($G$1-$F$1)","v":"2019-11-01T09:58:44.581"},{"$f":"RANDBETWEEN(20,100)","v":74},null,null,"Test02",null,"Egert Vint",10,10,8,7]
[{"$f":"INDEX($G$4:$G$7,RANDBETWEEN(1,4))","v":"Test03"},{"$f":"INDEX($I$2:$I$36,RANDBETWEEN(1,35))","v":"Brita Kaljula"},{"$f":"RANDBETWEEN($F$2,$G$2)+$F$1+RAND()*($G$1-$F$1)","v":"2019-11-15T10:28:52.574"},{"$f":"RANDBETWEEN(20,100)","v":84},null,null,"Test03",null,"Carmen Sõrmus",11,6,6,11]
["Test01","Joonas Haljas","2019-11-09T15:44:43.198",75,null,null,"Test04",null,"Armin Kaasik",9,7,10,7]
["Test04","Jana Kiisk","2019-11-25T08:25:07.547",80,null,null,null,null,"Jana Kiisk",6,10,8,10]
["Test02","Getlin Allas","2019-11-01T10:19:20.846",74,null,null,null,null,"Kaspar Raude",15,12,9,10]
["Test02","Kaspar Raude","2019-11-14T11:29:23.093",58,null,35,null,null,"Karin Saar",7,4,10,4]
["Test02","Anna Koel","2019-11-16T10:44:22.632",55,null,4,null,null,"Hanna Laid",7,10,6,7]
["Test04","Kertu Heinsoo","2019-11-20T11:26:37.293",49,null,5,null,null,"Mihkel Kulp",7,7,13,9]
["Test01","Carmen Sõrmus","2019-11-18T21:42:00.371",88,null,{"$f":"F10*F11*F12","v":700},null,null,"Markus Niidas",9,15,8,7]
["Test01","Urmas Lõhmus","2019-11-24T12:28:38.327",93,null,null,null,null,"Alari Suur",9,11,9,11]
["Test04","Maarja Pihlak","2019-11-17T11:39:16.918",37,null,null,null,null,"Erik Pärn",9,9,6,8]
["Test01","Kertu Heinsoo","2019-11-03T23:49:04.151",24,null,null,null,null,"Martin Aavik",8,10,10,3]
["Test02","Karin Saar","2019-11-08T12:13:02.792",43,null,null,null,null,"Maarja Pihlak",8,4,3,12]
["Test03","Alari Suur","2019-11-24T19:54:42.426",29,null,null,null,null,"Urmas Lõhmus",10,8,14,15]
["Test03","Sander Kell","2019-11-01T12:26:39.021",27,null,null,null,null,"Lauri Vahtra",11,10,8,4]
["Test01","Reimo Kala","2019-11-29T15:08:48.096",39,null,null,null,null,"Emili Loorits",10,13,6,9]
["Test03","Katrin Laurits","2019-11-03T16:18:14.990",93,null,null,null,null,"Jaagup Kivi",7,9,8,5]
["Test01","Emili Loorits","2019-11-05T20:12:31.647",41,null,null,null,null,"Joonas Haljas",5,7,6,9]
["Test04","Artur Piiri","2019-11-14T18:09:29.260",30,null,null,null,null,"Robert Lentso",9,9,8,13]
["Test01","Kaspar Raude","2019-11-05T21:46:16.887",96,null,null,null,null,"Viktoria Lumi",12,10,9,13]
["Test03","Viktoria Lumi","2019-11-04T14:52:35.276",70,null,null,null,null,"Sander Kell",2,7,6,8]
["Test02","Markus Niidas","2019-11-07T21:03:31.059",25,null,null,null,null,"Hans Kukk",3,10,3,6]
["Test03","Sander Kell","2019-11-04T15:39:58.699",96,null,null,null,null,"Diana Taal",5,5,6,6]
["Test04","Alari Suur","2019-11-25T08:28:08.933",28,null,null,null,null,"Kertu Heinsoo",11,13,5,10]
["Test02","Brita Kaljula","2019-11-02T19:33:58.036",58,null,null,null,null,"Tarvo Järv",10,8,7,9]
["Test01","Mihkel Kulp","2019-11-24T21:50:41.223",51,null,null,null,null,"Paul Hein",9,9,6,5]
["Test01","Carmen Sõrmus","2019-11-14T17:20:58.111",65,null,null,null,null,"Artur Piiri",10,9,12,8]
["Test03","Brita Kaljula","2019-11-09T10:12:32.781",89,null,null,null,null,"Getlin Allas",5,7,9,5]
["Test03","Urmas Lõhmus","2019-11-24T14:50:03.885",93,null,null,null,null,"Brita Kaljula",13,11,5,9]
["Test01","Brita Kaljula","2019-11-29T23:01:01.396",28,null,null,null,null,"Anna Koel",13,7,5,6]
["Test04","Egert Vint","2019-11-02T08:41:55.063",100,null,null,null,null,"Kristina Merila",10,4,10,6]
["Test03","Carmen Sõrmus","2019-11-01T17:29:45.028",98,null,null,null,null,"Rasmus Kroon",6,10,8,11]
["Test03","Tarvo Järv","2019-11-24T13:00:21.486",85]
["Test03","Anna Koel","2019-11-09T22:35:35.982",58]
["Test04","Viktoria Lumi","2019-11-17T19:56:36.254",97]
["Test02","Alari Suur","2019-11-14T17:04:42.047",83]
["Test03","Anna Koel","2019-11-09T11:26:31.168",35]
["Test02","Hans Kukk","2019-11-09T14:33:32.029",68]
["Test01","Kaspar Raude","2019-11-06T18:53:12.889",33]
["Test02","Brita Kaljula","2019-11-11T23:21:17.788",37]
["Test04","Egert Vint","2019-11-13T20:08:17.701",37]
["Test02","Emili Loorits","2019-11-08T10:58:13.821",30]
["Test03","Jaagup Kivi","2019-11-09T14:48:56.095",94]
["Test01","Paul Hein","2019-11-15T11:11:31.812",89]
["Test01","Viktoria Lumi","2019-11-03T20:21:52.910",40]
["Test04","Diana Taal","2019-11-04T09:28:57.008",37]
["Test04","Viktoria Lumi","2019-11-20T16:55:28.181",91]
["Test01","Anna Koel","2019-11-23T13:47:39.978",31]
["Test04","Robert Lentso","2019-11-25T10:15:14.365",64]
["Test04","Joonas Haljas","2019-11-17T14:25:09.415",58]
["Test02","Hans Kukk","2019-11-28T13:18:53.561",57]
["Test02","Mihkel Kulp","2019-11-14T19:15:21.541",95]
["Test04","Tarvo Järv","2019-11-20T17:25:28.089",21]
["Test01","Mihkel Kulp","2019-11-15T13:25:34.652",68]
["Test01","Sander Kell","2019-11-05T20:26:17.233",85]
["Test02","Emili Loorits","2019-11-07T09:33:50.324",27]
{"$rows_left_out":1113}