{"text_format":"1","workbook":"xlsx","n_sheets":5,"sheets":["Viitenumber","tudengid","testid","Liigendtabelid","testid (2)"],"not_rendered":{"charts":0,"images":0,"macros":1,"external_links":0,"defined_names":12,"comments":0,"pivot_tables":2},"unopened":[],"bounds":{"document_bytes":16777216,"sheet_cells":100000,"rows_first":2000,"rows_last":500,"rows_between":2000,"halvings":0,"cell_chars":16384,"cell_head_chars":4096},"cells_cut":0,"cells_raw":0,"read":"whole","date_system":"1900"}

{"sheet":"Viitenumber","index":0,"n_rows":17,"n_cols":4,"rows_kept":17,"cut":false,"hidden":false,"merged":[]}
[]
[]
[]
[]
[]
[]
[]
[]
[null,"Algne number","Kontrolljärk","Viitenumber"]
[null,3698525,{"$f":"kontroll_nr(B10)","v":4},{"$f":"IFERROR(viitenumber(B10), \"\")","v":36985254}]
[null,201911458,{"$f":"kontroll_nr(B11)","v":7},{"$f":"IFERROR(viitenumber(B11), \"\")","v":2019114587}]
[null,369,{"$f":"kontroll_nr(B12)","v":6},{"$f":"IFERROR(viitenumber(B12), \"\")","v":3696}]
[null,"A1458",{"$f":"kontroll_nr(B13)","v":{"$error":"#VALUE!"}},{"$f":"IFERROR(viitenumber(B13), \"\")","v":""}]
[null,20085789125,{"$f":"kontroll_nr(B14)","v":9},{"$f":"IFERROR(viitenumber(B14), \"\")","v":200857891259}]
[null,25874,{"$f":"kontroll_nr(B15)","v":2},{"$f":"IFERROR(viitenumber(B15), \"\")","v":258742}]
[null,134589,{"$f":"kontroll_nr(B16)","v":0},{"$f":"IFERROR(viitenumber(B16), \"\")","v":1345890}]
[null,1,{"$f":"kontroll_nr(B17)","v":3},{"$f":"IFERROR(viitenumber(B17), \"\")","v":13}]

{"sheet":"tudengid","index":1,"n_rows":39,"n_cols":4,"rows_kept":39,"cut":false,"hidden":false,"merged":[]}
[]
[]
[]
["Rühm","Eesnimi","Perenimi","Nimi"]
["R2","Katrin","Laurits",{"$f":"Eesnimi&\" \"&Perenimi","v":"Katrin Laurits"}]
["R1","Anette","Lepp","Anette Lepp"]
["R3","Reimo","Kala","Reimo Kala"]
["R3","Egert","Vint","Egert Vint"]
["R2","Carmen","Sõrmus","Carmen Sõrmus"]
["R2","Armin","Kaasik","Armin Kaasik"]
["R3","Jana","Kiisk","Jana Kiisk"]
["R1","Kaspar","Raude","Kaspar Raude"]
["R3","Karin","Saar","Karin Saar"]
["R2","Hanna","Laid","Hanna Laid"]
["R1","Mihkel","Kulp","Mihkel Kulp"]
["R1","Markus","Niidas","Markus Niidas"]
["R2","Alari","Suur","Alari Suur"]
["R1","Erik","Pärn","Erik Pärn"]
["R1","Martin","Aavik","Martin Aavik"]
["R3","Maarja","Pihlak","Maarja Pihlak"]
["R2","Urmas","Lõhmus","Urmas Lõhmus"]
["R3","Lauri","Vahtra","Lauri Vahtra"]
["R1","Emili","Loorits","Emili Loorits"]
["R2","Jaagup","Kivi","Jaagup Kivi"]
["R3","Joonas","Haljas","Joonas Haljas"]
["R1","Robert","Lentso","Robert Lentso"]
["R3","Viktoria","Lumi","Viktoria Lumi"]
["R2","Sander","Kell","Sander Kell"]
["R1","Hans","Kukk","Hans Kukk"]
["R2","Diana","Taal","Diana Taal"]
["R3","Kertu","Heinsoo","Kertu Heinsoo"]
["R3","Tarvo","Järv","Tarvo Järv"]
["R1","Paul","Hein","Paul Hein"]
["R1","Artur","Piiri","Artur Piiri"]
["R2","Getlin","Allas","Getlin Allas"]
["R1","Brita","Kaljula","Brita Kaljula"]
["R1","Anna","Koel","Anna Koel"]
["R3","Kristina","Merila","Kristina Merila"]
["R2","Rasmus","Kroon","Rasmus Kroon"]

{"sheet":"testid","index":2,"n_rows":1173,"n_cols":20,"rows_kept":1173,"cut":false,"hidden":false,"merged":[]}
[null,null,null,{"$f":"_xlfn.FORMULATEXT(E5)","v":"=COUNTIFS(Test; A5;Nimi;B5;Aeg;\">=\" &C5)"},null,null,null,{"$f":"_xlfn.FORMULATEXT(H5)","v":"=MAXIFS(Tulemus;Nimi;$G5;Test;H$4)"},null,null,null,null,null,{"$f":"_xlfn.FORMULATEXT(N5)","v":"=AVERAGEIFS(Tulemus;Nimi;$M5;Test;N$4;Jnr;\"<=3\")"},null,null,null,null,null,{"$f":"_xlfn.FORMULATEXT(R5)","v":"=INDEX(Rühm;MATCH(M5;tudengid!Nimi;0))"}]
[null,null,null,null,null,null,"2. Iga tudengi iga testi parim tulemus (valemiga)",null,null,null,null,null,"1. Iga tudengi iga testi kolme viimase testisoorituse aritmeetiline keskmine (valemiga)"]
[null,null,null,null,null,null,null,null,null,null,null,null,null,null,null,null,null,"(lisatud kolmanda ülesande jaoks)"]
["Test","Nimi","Aeg","Tulemus","Jnr",null,"Nimi","Test01","Test02","Test03","Test04",null,"Nimi","Test01","Test02","Test03","Test04","Rühm"]
["Test02","Robert Lentso","2019-11-12T13:16:35.251",37,{"$f":"COUNTIFS(Test, A5,Nimi,B5,Aeg,\">=\" &C5)","v":8},null,"Alari Suur",{"$f":"_xlfn.MAXIFS(Tulemus,Nimi,$G5,Test,H$4)","v":96},91,88,93,null,"Alari Suur",{"$f":"AVERAGEIFS(Tulemus,Nimi,$M5,Test,N$4,Jnr,\"<=3\")","v":79},68.666666666666671,61,56,{"$f":"INDEX(Rühm,MATCH(M5,tudengid!Nimi,0))","v":"R2"}]
["Test01","Robert Lentso","2019-11-30T09:20:24.603",22,{"$f":"COUNTIFS(Test, A6,Nimi,B6,Aeg,\">=\" &C6)","v":1},null,"Anette Lepp",94,99,97,80,null,"Anette Lepp",76.333333333333329,63.333333333333336,71,37.666666666666664,{"$f":"INDEX(Rühm,MATCH(M6,tudengid!Nimi,0))","v":"R1"}]
["Test03","Sander Kell","2019-11-14T08:35:59.974",55,2,null,"Anna Koel",72,99,81,100,null,"Anna Koel",51.333333333333336,50,48.333333333333336,59.666666666666664,{"$f":"INDEX(Rühm,MATCH(M7,tudengid!Nimi,0))","v":"R1"}]
["Test04","Kristina Merila","2019-11-21T20:48:11.179",78,5,null,"Armin Kaasik",95,79,100,56,null,"Armin Kaasik",75,46.666666666666664,61.666666666666664,42,{"$f":"INDEX(Rühm,MATCH(M8,tudengid!Nimi,0))","v":"R2"}]
["Test01","Kertu Heinsoo","2019-11-28T19:05:40.022",70,3,null,"Artur Piiri",98,97,99,93,null,"Artur Piiri",68.333333333333329,84.333333333333329,56.666666666666664,88,{"$f":"INDEX(Rühm,MATCH(M9,tudengid!Nimi,0))","v":"R1"}]
["Test03","Kertu Heinsoo","2019-11-20T20:41:35.651",75,6,null,"Brita Kaljula",99,100,97,100,null,"Brita Kaljula",83,62.666666666666664,54.333333333333336,43.666666666666664,{"$f":"INDEX(Rühm,MATCH(M10,tudengid!Nimi,0))","v":"R1"}]
["Test01","Urmas Lõhmus","2019-11-13T14:20:00.655",45,4,null,"Carmen Sõrmus",70,97,67,86,null,"Carmen Sõrmus",31.333333333333332,57.333333333333336,45.666666666666664,73.333333333333329,{"$f":"INDEX(Rühm,MATCH(M11,tudengid!Nimi,0))","v":"R2"}]
["Test04","Robert Lentso","2019-11-17T20:51:19.625",59,3,null,"Diana Taal",86,93,95,93,null,"Diana Taal",53,79.333333333333329,62.666666666666664,78,{"$f":"INDEX(Rühm,MATCH(M12,tudengid!Nimi,0))","v":"R2"}]
["Test03","Joonas Haljas","2019-11-23T08:56:43.995",40,2,null,"Egert Vint",100,81,84,78,null,"Egert Vint",44,41.666666666666664,64,38.333333333333336,{"$f":"INDEX(Rühm,MATCH(M13,tudengid!Nimi,0))","v":"R3"}]
["Test04","Urmas Lõhmus","2019-11-23T15:08:20.630",96,2,null,"Emili Loorits",69,100,85,84,null,"Emili Loorits",56.333333333333336,74.666666666666671,31.666666666666668,44,{"$f":"INDEX(Rühm,MATCH(M14,tudengid!Nimi,0))","v":"R1"}]
["Test02","Robert Lentso","2019-11-13T17:35:12.257",68,7,null,"Erik Pärn",93,94,84,98,null,"Erik Pärn",71.333333333333329,59,66,86.666666666666671,{"$f":"INDEX(Rühm,MATCH(M15,tudengid!Nimi,0))","v":"R1"}]
["Test03","Kristina Merila","2019-11-15T16:15:08.575",59,6,null,"Getlin Allas",97,92,85,98,null,"Getlin Allas",67.333333333333329,62.666666666666664,63.666666666666664,51.666666666666664,{"$f":"INDEX(Rühm,MATCH(M16,tudengid!Nimi,0))","v":"R2"}]
["Test02","Hans Kukk","2019-11-01T10:22:42.466",26,9,null,"Hanna Laid",92,84,99,99,null,"Hanna Laid",70.333333333333329,53.666666666666664,69.666666666666671,49.333333333333336,{"$f":"INDEX(Rühm,MATCH(M17,tudengid!Nimi,0))","v":"R2"}]
["Test03","Rasmus Kroon","2019-11-11T14:22:22.170",73,7,null,"Hans Kukk",100,97,100,96,null,"Hans Kukk",75,58.666666666666664,69.666666666666671,53,{"$f":"INDEX(Rühm,MATCH(M18,tudengid!Nimi,0))","v":"R1"}]
["Test01","Maarja Pihlak","2019-11-29T09:41:58.019",89,1,null,"Jaagup Kivi",98,97,87,93,null,"Jaagup Kivi",85.666666666666671,70.666666666666671,54.333333333333336,65,{"$f":"INDEX(Rühm,MATCH(M19,tudengid!Nimi,0))","v":"R2"}]
["Test01","Sander Kell","2019-11-09T13:18:08.716",30,9,null,"Jana Kiisk",84,91,90,91,null,"Jana Kiisk",54,63,64.666666666666671,91,{"$f":"INDEX(Rühm,MATCH(M20,tudengid!Nimi,0))","v":"R3"}]
["Test04","Joonas Haljas","2019-11-22T16:27:02.789",57,1,null,"Joonas Haljas",92,98,99,86,null,"Joonas Haljas",78.333333333333329,35.666666666666664,66.666666666666671,57,{"$f":"INDEX(Rühm,MATCH(M21,tudengid!Nimi,0))","v":"R3"}]
["Test02","Reimo Kala","2019-11-22T16:20:40.046",87,2,null,"Karin Saar",95,80,96,98,null,"Karin Saar",92,58.333333333333336,71.333333333333329,65,{"$f":"INDEX(Rühm,MATCH(M22,tudengid!Nimi,0))","v":"R3"}]
["Test02","Urmas Lõhmus","2019-11-02T10:17:31.185",45,10,null,"Kaspar Raude",95,94,91,89,null,"Kaspar Raude",47,79.333333333333329,70,63,{"$f":"INDEX(Rühm,MATCH(M23,tudengid!Nimi,0))","v":"R1"}]
["Test03","Martin Aavik","2019-11-25T21:13:36.966",63,3,null,"Katrin Laurits",98,84,99,97,null,"Katrin Laurits",46.333333333333336,39,78,64,{"$f":"INDEX(Rühm,MATCH(M24,tudengid!Nimi,0))","v":"R2"}]
["Test02","Lauri Vahtra","2019-11-25T17:23:27.962",27,3,null,"Kertu Heinsoo",{"$f":"_xlfn.MAXIFS(Tulemus,Nimi,$G25,Test,H$4)","v":90},82,95,100,null,"Kertu Heinsoo",{"$f":"AVERAGEIFS(Tulemus,Nimi,$M25,Test,N$4,Jnr,\"<=3\")","v":61.666666666666664},55.666666666666664,44,54,{"$f":"INDEX(Rühm,MATCH(M25,tudengid!Nimi,0))","v":"R3"}]
["Test01","Getlin Allas","2019-11-11T21:10:26.773",41,8,null,"Kristina Merila",72,99,97,94,null,"Kristina Merila",45,57.333333333333336,72.333333333333329,39,{"$f":"INDEX(Rühm,MATCH(M26,tudengid!Nimi,0))","v":"R3"}]
["Test01","Karin Saar","2019-11-24T08:00:23.699",88,2,null,"Lauri Vahtra",98,93,99,97,null,"Lauri Vahtra",52.666666666666664,67.666666666666671,65.333333333333329,50,{"$f":"INDEX(Rühm,MATCH(M27,tudengid!Nimi,0))","v":"R3"}]
["Test01","Egert Vint","2019-11-30T14:29:20.273",29,1,null,"Maarja Pihlak",99,97,87,91,null,"Maarja Pihlak",92,69,79.666666666666671,62.666666666666664,{"$f":"INDEX(Rühm,MATCH(M28,tudengid!Nimi,0))","v":"R3"}]
["Test04","Hanna Laid","2019-11-16T11:05:59.488",36,6,null,"Markus Niidas",51,89,79,92,null,"Markus Niidas",39.666666666666664,77.666666666666671,57,67.666666666666671,{"$f":"INDEX(Rühm,MATCH(M29,tudengid!Nimi,0))","v":"R1"}]
["Test02","Maarja Pihlak","2019-11-03T11:24:19.446",81,10,null,"Martin Aavik",91,89,98,99,null,"Martin Aavik",41.333333333333336,46.666666666666664,59.333333333333336,76.666666666666671,{"$f":"INDEX(Rühm,MATCH(M30,tudengid!Nimi,0))","v":"R1"}]
["Test02","Alari Suur","2019-11-14T12:26:57.555",41,5,null,"Mihkel Kulp",88,92,94,95,null,"Mihkel Kulp",48.333333333333336,75.666666666666671,87,83,{"$f":"INDEX(Rühm,MATCH(M31,tudengid!Nimi,0))","v":"R1"}]
["Test01","Anette Lepp","2019-11-10T23:07:57.484",43,5,null,"Paul Hein",97,88,97,83,null,"Paul Hein",52.333333333333336,65,56.666666666666664,49.666666666666664,{"$f":"INDEX(Rühm,MATCH(M32,tudengid!Nimi,0))","v":"R1"}]
["Test01","Carmen Sõrmus","2019-11-17T08:44:30.313",32,3,null,"Rasmus Kroon",83,95,73,95,null,"Rasmus Kroon",66,61.333333333333336,35.333333333333336,84,{"$f":"INDEX(Rühm,MATCH(M33,tudengid!Nimi,0))","v":"R2"}]
["Test04","Rasmus Kroon","2019-11-06T09:20:30.688",95,3,null,"Reimo Kala",95,90,98,92,null,"Reimo Kala",75,79.666666666666671,51.666666666666664,76.333333333333329,{"$f":"INDEX(Rühm,MATCH(M34,tudengid!Nimi,0))","v":"R3"}]
["Test01","Viktoria Lumi","2019-11-18T17:25:51.432",93,3,null,"Robert Lentso",76,99,85,97,null,"Robert Lentso",35.666666666666664,63.333333333333336,49,69,{"$f":"INDEX(Rühm,MATCH(M35,tudengid!Nimi,0))","v":"R1"}]
["Test03","Markus Niidas","2019-11-03T13:01:48.405",66,4,null,"Sander Kell",94,86,93,93,null,"Sander Kell",59.333333333333336,43.666666666666664,69.333333333333329,42.333333333333336,{"$f":"INDEX(Rühm,MATCH(M36,tudengid!Nimi,0))","v":"R2"}]
["Test01","Urmas Lõhmus","2019-11-23T17:32:21.250",69,1,null,"Tarvo Järv",87,97,97,99,null,"Tarvo Järv",61.666666666666664,49.333333333333336,53.333333333333336,91,{"$f":"INDEX(Rühm,MATCH(M37,tudengid!Nimi,0))","v":"R3"}]
["Test02","Lauri Vahtra","2019-11-08T19:49:14.237",47,9,null,"Urmas Lõhmus",73,89,99,96,null,"Urmas Lõhmus",60.666666666666664,45,57.333333333333336,77,{"$f":"INDEX(Rühm,MATCH(M38,tudengid!Nimi,0))","v":"R2"}]
["Test04","Kristina Merila","2019-11-27T19:38:03.161",27,3,null,"Viktoria Lumi",93,98,100,98,null,"Viktoria Lumi",46.666666666666664,63.333333333333336,80,62.333333333333336,{"$f":"INDEX(Rühm,MATCH(M39,tudengid!Nimi,0))","v":"R3"}]
["Test03","Robert Lentso","2019-11-16T21:01:02.483",85,9]
["Test01","Anette Lepp","2019-11-10T12:18:50.568",66,6]
["Test04","Kertu Heinsoo","2019-11-01T17:20:52.084",25,9,null,"3. Igast rühmast esimeses testis kolme viimase katse keskmisena parima tulemuse saanud tudeng"]
["Test02","Markus Niidas","2019-11-07T13:03:59.704",26,7,null,null,{"$f":"_xlfn.FORMULATEXT(H45)","v":"=MAXIFS(Test01;Rühm_1;G45)"},{"$f":"_xlfn.FORMULATEXT(I45)","v":"=INDEX(Nimi_1;MATCH(1;(Rühm_1=G45)*(Test01=H45);0))"}]
["Test01","Kaspar Raude","2019-11-10T09:32:52.618",70,5,null,"Rühm","Parim tulemus","Nimi"]
["Test04","Hanna Laid","2019-11-19T15:29:08.312",52,4,null,"R1",{"$f":"_xlfn.MAXIFS(Test01,Rühm_1,G45)","v":83},{"$f":"INDEX(Nimi_1,MATCH(1,(Rühm_1=G45)*(Test01=H45),0))","v":"Brita Kaljula"}]
["Test04","Viktoria Lumi","2019-11-26T17:49:25.919",98,2,null,"R2",{"$f":"_xlfn.MAXIFS(Test01,Rühm_1,G46)","v":85.666666666666671},{"$f":"INDEX(Nimi_1,MATCH(1,(Rühm_1=G46)*(Test01=H46),0))","v":"Jaagup Kivi"}]
["Test02","Tarvo Järv","2019-11-15T17:04:37.910",45,8,null,"R3",{"$f":"_xlfn.MAXIFS(Test01,Rühm_1,G47)","v":92},{"$f":"INDEX(Nimi_1,MATCH(1,(Rühm_1=G47)*(Test01=H47),0))","v":"Karin Saar"}]
["Test02","Tarvo Järv","2019-11-25T16:48:34.680",48,4]
["Test04","Kaspar Raude","2019-11-03T14:36:34.996",65,8]
["Test01","Armin Kaasik","2019-11-06T12:10:20.256",95,5]
["Test04","Hans Kukk","2019-11-26T21:49:28.605",73,4]
["Test01","Sander Kell","2019-11-04T22:27:01.154",30,10]
["Test02","Tarvo Järv","2019-11-08T19:47:42.241",64,10]
["Test03","Katrin Laurits","2019-11-15T13:04:57.541",41,5]
["Test01","Diana Taal","2019-11-01T12:10:37.538",86,8]
["Test04","Brita Kaljula","2019-11-08T08:30:49.316",30,8]
["Test02","Emili Loorits","2019-11-19T19:00:03.572",92,4]
["Test04","Viktoria Lumi","2019-11-04T17:02:17.438",79,7]
["Test01","Alari Suur","2019-11-20T19:46:51.184",43,4]
["Test04","Jaagup Kivi","2019-11-14T11:07:38.995",72,7]
["Test03","Robert Lentso","2019-11-29T23:36:45.387",24,3]
["Test01","Jaagup Kivi","2019-11-14T13:05:29.465",29,4]
["Test02","Anette Lepp","2019-11-02T23:02:55.140",70,6]
["Test01","Tarvo Järv","2019-11-06T15:43:19.934",87,4]
["Test04","Getlin Allas","2019-11-11T10:28:27.646",28,3]
["Test03","Anette Lepp","2019-11-28T18:36:14.503",97,3]
["Test02","Rasmus Kroon","2019-11-11T11:13:28.317",45,6]
["Test03","Maarja Pihlak","2019-11-22T17:55:23.982",87,3]
["Test01","Kristina Merila","2019-11-14T14:52:28.851",72,{"$f":"COUNTIFS(Test, A69,Nimi,B69,Aeg,\">=\" &C69)","v":1}]
["Test04","Lauri Vahtra","2019-11-24T23:10:52.883",33,2]
["Test04","Brita Kaljula","2019-11-25T10:04:14.109",60,2]
["Test04","Robert Lentso","2019-11-10T15:07:43.267",52,6]
["Test02","Joonas Haljas","2019-11-24T11:24:39.626",55,4]
["Test04","Mihkel Kulp","2019-11-26T15:44:50.085",88,1]
["Test03","Viktoria Lumi","2019-11-22T21:30:12.893",98,4]
["Test03","Tarvo Järv","2019-11-16T15:42:06.281",24,4]
["Test04","Anette Lepp","2019-11-08T12:53:06.590",74,9]
["Test01","Rasmus Kroon","2019-11-01T23:48:33.011",83,11]
["Test01","Artur Piiri","2019-11-18T10:58:29.104",98,2]
["Test02","Erik Pärn","2019-11-01T21:18:20.191",71,15]
["Test01","Armin Kaasik","2019-11-22T22:30:37.591",84,3]
["Test01","Jana Kiisk","2019-11-29T11:20:48.827",53,2]
["Test02","Markus Niidas","2019-11-29T16:10:32.418",87,1]
["Test03","Diana Taal","2019-11-24T14:27:31.071",95,3]
["Test04","Hanna Laid","2019-11-15T17:54:59.868",34,8]
["Test04","Paul Hein","2019-11-20T15:38:03.244",44,1]
["Test03","Jaagup Kivi","2019-11-16T16:21:24.109",27,6]
["Test02","Viktoria Lumi","2019-11-23T11:45:25.515",89,2]
["Test02","Anna Koel","2019-11-05T13:18:36.109",25,5]
["Test04","Hans Kukk","2019-11-26T18:55:40.466",66,5]
["Test03","Reimo Kala","2019-11-19T14:51:21.555",26,2]
["Test04","Alari Suur","2019-11-23T08:33:36.310",65,3]
["Test02","Brita Kaljula","2019-11-11T12:18:53.300",24,5]
["Test02","Egert Vint","2019-11-06T17:07:34.860",37,6]
["Test02","Mihkel Kulp","2019-11-25T22:48:53.848",43,5]
["Test02","Diana Taal","2019-11-25T18:09:02.690",93,2]
["Test02","Getlin Allas","2019-11-28T10:20:51.957",59,1]
["Test01","Tarvo Järv","2019-11-11T12:35:57.181",66,2]
["Test01","Carmen Sõrmus","2019-11-09T23:11:27.574",55,6]
["Test01","Kaspar Raude","2019-11-08T17:08:49.728",61,6]
["Test04","Kaspar Raude","2019-11-05T23:39:20.081",31,6]
["Test03","Martin Aavik","2019-11-02T18:30:33.260",23,15]
["Test02","Mihkel Kulp","2019-11-28T21:32:53.818",92,2]
["Test03","Tarvo Järv","2019-11-07T09:18:25.008",97,9]
["Test02","Armin Kaasik","2019-11-14T20:43:09.474",23,6]
["Test03","Urmas Lõhmus","2019-11-12T09:38:19.905",24,6]
["Test04","Jaagup Kivi","2019-11-30T22:52:37.393",82,2]
["Test01","Armin Kaasik","2019-11-27T21:55:55.696",87,1]
["Test03","Brita Kaljula","2019-11-22T10:11:56.271",92,4]
["Test03","Hans Kukk","2019-11-16T11:50:16.527",71,8]
["Test03","Jana Kiisk","2019-11-04T12:24:03.817",39,7]
["Test04","Martin Aavik","2019-11-20T10:51:47.910",99,3]
["Test02","Katrin Laurits","2019-11-15T08:40:33.908",84,5]
["Test02","Maarja Pihlak","2019-11-21T18:37:39.613",55,3]
["Test04","Paul Hein","2019-11-17T12:43:23.509",83,2]
["Test02","Maarja Pihlak","2019-11-22T20:37:05.053",84,2]
["Test04","Viktoria Lumi","2019-11-24T21:35:52.299",52,4]
["Test04","Alari Suur","2019-11-03T17:13:56.298",66,9]
["Test02","Katrin Laurits","2019-11-07T23:11:38.610",62,6]
["Test02","Paul Hein","2019-11-23T22:54:27.058",49,3]
["Test02","Kristina Merila","2019-11-15T21:39:52.344",52,6]
["Test03","Getlin Allas","2019-11-01T21:21:23.168",79,9]
["Test04","Carmen Sõrmus","2019-11-04T12:56:59.157",86,3]
["Test04","Kertu Heinsoo","2019-11-25T12:41:03.433",25,2]
["Test04","Karin Saar","2019-11-04T10:04:34.492",32,9]
["Test03","Kristina Merila","2019-11-01T16:42:02.460",34,9]
["Test02","Emili Loorits","2019-11-11T17:46:54.434",84,8]
["Test04","Tarvo Järv","2019-11-04T11:43:29.423",85,8]
["Test04","Urmas Lõhmus","2019-11-25T23:16:05.398",85,1]
["Test04","Joonas Haljas","2019-11-01T13:09:36.835",28,7]
["Test04","Alari Suur","2019-11-18T18:09:08.869",20,7]
["Test03","Getlin Allas","2019-11-07T10:16:15.309",35,6]
["Test02","Anette Lepp","2019-11-17T15:22:08.392",52,{"$f":"COUNTIFS(Test, A133,Nimi,B133,Aeg,\">=\" &C133)","v":3}]
["Test02","Kristina Merila","2019-11-15T17:59:01.733",59,7]
["Test03","Getlin Allas","2019-11-14T08:50:00.581",37,5]
["Test01","Sander Kell","2019-11-28T13:40:17.971",52,2]
["Test02","Viktoria Lumi","2019-11-20T08:21:57.267",73,3]
["Test04","Alari Suur","2019-11-19T23:03:32.204",35,6]
["Test02","Markus Niidas","2019-11-18T10:56:39.202",50,5]
["Test04","Diana Taal","2019-11-09T14:33:14.092",85,7]
["Test02","Maarja Pihlak","2019-11-10T16:22:13.249",31,7]
["Test04","Artur Piiri","2019-11-04T16:55:50.081",22,7]
["Test02","Robert Lentso","2019-11-29T19:52:59.877",85,2]
["Test03","Kertu Heinsoo","2019-11-07T22:05:38.694",72,13]
["Test02","Sander Kell","2019-11-27T19:24:57.675",23,1]
["Test03","Artur Piiri","2019-11-18T18:39:09.688",26,5]
["Test01","Reimo Kala","2019-11-13T12:39:48.620",91,4]
["Test02","Maarja Pihlak","2019-11-04T20:58:10.732",71,9]
["Test02","Jana Kiisk","2019-11-17T11:56:09.027",26,6]
["Test01","Martin Aavik","2019-11-12T16:40:37.776",33,8]
["Test03","Kertu Heinsoo","2019-11-26T16:39:22.651",60,2]
["Test01","Artur Piiri","2019-11-28T17:52:28.280",78,1]
["Test04","Brita Kaljula","2019-11-02T15:57:33.053",100,10]
["Test03","Tarvo Järv","2019-11-21T17:38:41.594",69,1]
["Test02","Erik Pärn","2019-11-24T22:47:55.696",55,4]
["Test02","Kristina Merila","2019-11-29T10:47:29.306",83,1]
["Test02","Tarvo Järv","2019-11-13T13:05:21.533",87,9]
["Test03","Kertu Heinsoo","2019-11-04T13:22:43.512",48,14]
["Test01","Kertu Heinsoo","2019-11-20T23:09:53.955",52,5]
["Test01","Hanna Laid","2019-11-19T12:40:09.048",92,6]
["Test02","Emili Loorits","2019-11-01T19:30:00.732",89,11]
["Test03","Alari Suur","2019-11-03T10:22:53.782",81,8]
["Test03","Carmen Sõrmus","2019-11-09T22:21:38.750",46,6]
["Test04","Urmas Lõhmus","2019-11-12T17:48:20.799",32,5]
["Test03","Katrin Laurits","2019-11-28T14:38:45.536",49,1]
["Test01","Tarvo Järv","2019-11-08T21:24:09.366",40,3]
["Test04","Lauri Vahtra","2019-11-18T11:42:19.225",90,3]
["Test04","Anna Koel","2019-11-27T19:23:51.203",66,5]
["Test04","Tarvo Järv","2019-11-02T13:21:11.477",60,9]
["Test02","Anna Koel","2019-11-28T09:54:05.430",32,1]
["Test03","Artur Piiri","2019-11-25T11:25:27.279",35,1]
["Test02","Egert Vint","2019-11-02T22:50:38.213",81,8]
["Test03","Kertu Heinsoo","2019-11-13T19:31:17.253",63,8]
["Test03","Lauri Vahtra","2019-11-06T09:33:37.903",25,10]
["Test02","Joonas Haljas","2019-11-08T10:33:20.504",25,10]
["Test03","Brita Kaljula","2019-11-16T08:19:11.680",57,6]
["Test02","Emili Loorits","2019-11-11T20:52:58.476",72,7]
["Test04","Armin Kaasik","2019-11-25T19:39:25.035",54,3]
["Test01","Emili Loorits","2019-11-17T19:27:05.584",62,3]
["Test03","Getlin Allas","2019-11-24T15:10:58.980",65,1]
["Test03","Joonas Haljas","2019-11-16T15:29:16.307",43,6]
["Test02","Mihkel Kulp","2019-11-01T13:03:03.548",37,11]
["Test02","Hanna Laid","2019-11-03T08:57:56.563",56,3]
["Test01","Viktoria Lumi","2019-11-06T10:19:12.386",86,7]
["Test04","Hanna Laid","2019-11-03T15:47:04.312",32,15]
["Test03","Getlin Allas","2019-11-19T23:46:40.880",74,3]
["Test04","Karin Saar","2019-11-13T22:53:57.480",21,4]
["Test02","Kristina Merila","2019-11-09T09:30:06.068",38,12]
["Test01","Maarja Pihlak","2019-11-15T17:42:36.640",45,5]
["Test01","Kertu Heinsoo","2019-11-30T22:23:05.473",47,1]
["Test01","Kristina Merila","2019-11-13T08:08:38.401",26,3]
["Test01","Martin Aavik","2019-11-22T09:07:55.238",48,4]
["Test02","Anna Koel","2019-11-07T09:56:49.567",61,4]
["Test04","Getlin Allas","2019-11-24T16:32:33.448",38,2]
["Test02","Diana Taal","2019-11-18T08:09:05.990",46,4]
["Test04","Hanna Laid","2019-11-23T23:06:37.372",57,3]
["Test02","Emili Loorits","2019-11-23T22:01:46.344",51,{"$f":"COUNTIFS(Test, A197,Nimi,B197,Aeg,\">=\" &C197)","v":2}]
["Test01","Lauri Vahtra","2019-11-01T22:28:04.754",64,4]
["Test02","Brita Kaljula","2019-11-24T09:26:52.902",83,2]
["Test01","Katrin Laurits","2019-11-22T22:30:32.207",75,1]
["Test01","Reimo Kala","2019-11-20T21:18:40.694",41,1]
["Test02","Sander Kell","2019-11-05T09:02:04.211",60,9]
["Test01","Lauri Vahtra","2019-11-07T11:23:24.923",35,3]
["Test02","Karin Saar","2019-11-11T16:51:06.062",51,7]
["Test02","Brita Kaljula","2019-11-06T13:47:31.633",100,8]
["Test01","Hanna Laid","2019-11-20T09:30:42.188",81,5]
["Test02","Joonas Haljas","2019-11-18T10:40:58.136",98,6]
["Test03","Tarvo Järv","2019-11-18T22:00:02.101",48,3]
["Test02","Egert Vint","2019-11-23T15:00:39.795",40,1]
["Test03","Erik Pärn","2019-11-14T12:08:58.125",45,5]
["Test01","Karin Saar","2019-11-22T18:37:41.144",95,3]
["Test01","Urmas Lõhmus","2019-11-14T17:17:27.217",71,3]
["Test02","Robert Lentso","2019-11-30T23:44:35.957",84,1]
["Test02","Hanna Laid","2019-11-19T18:48:05.611",84,1]
["Test03","Emili Loorits","2019-11-02T22:06:58.760",85,5]
["Test01","Armin Kaasik","2019-11-12T12:27:25.392",44,4]
["Test02","Reimo Kala","2019-11-05T21:53:48.497",51,5]
["Test04","Rasmus Kroon","2019-11-09T12:00:20.809",92,2]
["Test03","Brita Kaljula","2019-11-26T08:06:08.801",36,2]
["Test01","Jaagup Kivi","2019-11-23T15:10:15.393",87,2]
["Test02","Erik Pärn","2019-11-20T23:06:51.128",94,6]
["Test03","Jaagup Kivi","2019-11-15T14:24:26.149",87,8]
["Test04","Kaspar Raude","2019-11-07T19:28:08.703",87,5]
["Test03","Sander Kell","2019-11-09T13:49:15.486",77,4]
["Test02","Joonas Haljas","2019-11-29T09:43:35.393",51,2]
["Test03","Urmas Lõhmus","2019-11-08T20:17:01.805",99,8]
["Test04","Kertu Heinsoo","2019-11-07T21:06:00.666",61,5]
["Test04","Martin Aavik","2019-11-28T19:44:12.980",84,1]
["Test04","Egert Vint","2019-11-27T11:44:49.921",35,1]
["Test02","Getlin Allas","2019-11-24T13:15:48.906",71,4]
["Test01","Armin Kaasik","2019-11-02T17:43:45.010",77,6]
["Test01","Reimo Kala","2019-11-19T10:18:32.173",89,3]
["Test03","Hans Kukk","2019-11-27T20:58:59.960",51,4]
["Test02","Kristina Merila","2019-11-16T15:06:23.968",73,4]
["Test02","Maarja Pihlak","2019-11-01T10:10:07.908",97,11]
["Test03","Lauri Vahtra","2019-11-09T09:03:18.909",58,7]
["Test02","Jana Kiisk","2019-11-11T17:05:12.773",37,7]
["Test02","Getlin Allas","2019-11-03T12:35:38.461",35,13]
["Test02","Maarja Pihlak","2019-11-19T10:00:00.201",45,4]
["Test01","Anette Lepp","2019-11-07T15:04:56.018",63,7]
["Test02","Viktoria Lumi","2019-11-13T17:32:32.522",77,6]
["Test04","Anette Lepp","2019-11-06T08:51:36.932",22,10]
["Test04","Anna Koel","2019-11-23T11:26:03.532",43,8]
["Test01","Reimo Kala","2019-11-08T14:31:45.646",38,7]
["Test04","Jaagup Kivi","2019-11-01T08:04:11.164",72,14]
["Test02","Erik Pärn","2019-11-26T14:19:45.904",73,2]
["Test01","Anette Lepp","2019-11-01T21:01:08.587",80,12]
["Test04","Tarvo Järv","2019-11-30T17:11:17.226",81,1]
["Test03","Maarja Pihlak","2019-11-24T14:56:08.406",84,2]
["Test02","Kertu Heinsoo","2019-11-19T18:15:21.990",62,4]
["Test02","Viktoria Lumi","2019-11-03T16:46:57.446",38,11]
["Test03","Alari Suur","2019-11-24T21:23:39.521",55,2]
["Test03","Tarvo Järv","2019-11-13T20:37:33.708",62,7]
["Test01","Alari Suur","2019-11-18T17:00:07.126",22,5]
["Test03","Hans Kukk","2019-11-30T13:30:38.512",78,1]
["Test04","Lauri Vahtra","2019-11-12T09:34:53.105",62,6]
["Test02","Sander Kell","2019-11-13T18:19:03.776",50,6]
["Test01","Lauri Vahtra","2019-11-27T13:57:22.505",98,1]
["Test01","Markus Niidas","2019-11-27T17:09:34.639",26,2]
["Test01","Maarja Pihlak","2019-11-22T12:34:24.357",60,4]
["Test01","Hanna Laid","2019-11-23T18:51:57.535",37,{"$f":"COUNTIFS(Test, A261,Nimi,B261,Aeg,\">=\" &C261)","v":3}]
["Test02","Rasmus Kroon","2019-11-29T14:22:49.607",33,1]
["Test01","Martin Aavik","2019-11-29T22:47:56.400",40,1]
["Test04","Kristina Merila","2019-11-05T22:01:37.046",89,10]
["Test04","Egert Vint","2019-11-08T18:09:13.176",73,6]
["Test02","Lauri Vahtra","2019-11-30T11:27:06.027",93,1]
["Test01","Getlin Allas","2019-11-16T15:09:29.581",80,4]
["Test01","Anette Lepp","2019-11-13T08:18:54.141",42,4]
["Test04","Tarvo Järv","2019-11-14T20:36:27.817",59,4]
["Test02","Karin Saar","2019-11-17T10:12:45.487",35,2]
["Test04","Hans Kukk","2019-11-04T09:03:27.630",96,9]
["Test01","Erik Pärn","2019-11-26T23:25:54.457",36,4]
["Test02","Robert Lentso","2019-11-16T22:58:58.232",67,5]
["Test03","Hanna Laid","2019-11-12T13:00:31.891",96,5]
["Test04","Urmas Lõhmus","2019-11-04T16:08:25.026",87,7]
["Test01","Sander Kell","2019-11-18T13:31:07.386",74,5]
["Test02","Emili Loorits","2019-11-02T09:21:37.935",76,10]
["Test04","Hanna Laid","2019-11-14T23:22:09.569",47,9]
["Test03","Katrin Laurits","2019-11-01T18:51:52.050",94,8]
["Test01","Alari Suur","2019-11-07T17:21:13.536",85,9]
["Test03","Getlin Allas","2019-11-19T13:27:17.989",55,4]
["Test01","Karin Saar","2019-11-07T08:26:39.509",74,8]
["Test03","Anette Lepp","2019-11-30T22:23:26.186",52,1]
["Test02","Getlin Allas","2019-11-04T08:40:49.696",92,12]
["Test04","Maarja Pihlak","2019-11-25T17:10:55.311",41,1]
["Test03","Paul Hein","2019-11-25T23:54:31.669",97,5]
["Test01","Egert Vint","2019-11-10T11:05:36.158",63,6]
["Test02","Sander Kell","2019-11-03T12:50:22.460",49,10]
["Test01","Getlin Allas","2019-11-18T18:11:24.131",42,2]
["Test04","Hans Kukk","2019-11-28T21:13:32.619",52,1]
["Test01","Hans Kukk","2019-11-06T09:12:26.824",65,6]
["Test03","Karin Saar","2019-11-10T14:58:20.221",81,5]
["Test02","Markus Niidas","2019-11-22T20:34:31.240",66,2]
["Test01","Kaspar Raude","2019-11-17T16:33:09.881",95,4]
["Test03","Artur Piiri","2019-11-15T22:33:17.133",33,8]
["Test03","Joonas Haljas","2019-11-04T11:38:26.307",38,8]
["Test02","Kristina Merila","2019-11-09T20:11:53.375",24,11]
["Test04","Paul Hein","2019-11-15T20:06:26.415",22,3]
["Test03","Kaspar Raude","2019-11-08T09:34:29.637",29,3]
["Test02","Alari Suur","2019-11-08T21:14:04.222",86,7]
["Test01","Robert Lentso","2019-11-28T16:26:06.399",55,2]
["Test03","Hanna Laid","2019-11-07T09:02:33.831",53,6]
["Test04","Karin Saar","2019-11-13T09:23:25.356",98,6]
["Test03","Lauri Vahtra","2019-11-06T21:40:34.662",92,9]
["Test01","Sander Kell","2019-11-11T11:28:50.370",77,8]
["Test04","Kristina Merila","2019-11-28T21:02:45.049",70,2]
["Test03","Robert Lentso","2019-11-28T20:42:23.383",68,4]
["Test04","Diana Taal","2019-11-28T14:29:33.431",80,1]
["Test02","Markus Niidas","2019-11-09T20:03:05.742",61,6]
["Test01","Viktoria Lumi","2019-11-20T19:48:49.123",26,1]
["Test01","Sander Kell","2019-11-02T12:48:19.036",55,11]
["Test02","Karin Saar","2019-11-13T22:57:21.662",34,5]
["Test02","Sander Kell","2019-11-25T09:44:25.716",86,4]
["Test02","Brita Kaljula","2019-11-08T21:54:47.300",84,6]
["Test02","Kaspar Raude","2019-11-12T15:11:21.941",94,1]
["Test04","Armin Kaasik","2019-11-08T10:03:44.338",30,7]
["Test03","Alari Suur","2019-11-14T20:08:50.786",63,4]
["Test02","Urmas Lõhmus","2019-11-08T09:05:29.853",46,8]
["Test03","Urmas Lõhmus","2019-11-10T20:55:13.997",43,7]
["Test04","Tarvo Järv","2019-11-10T17:52:56.156",72,6]
["Test04","Jana Kiisk","2019-11-26T16:45:24.264",91,1]
["Test04","Katrin Laurits","2019-11-15T15:06:27.432",92,6]
["Test01","Joonas Haljas","2019-11-30T18:03:35.030",81,1]
["Test03","Rasmus Kroon","2019-11-25T09:39:25.147",49,3]
["Test02","Anette Lepp","2019-11-21T22:44:11.810",88,{"$f":"COUNTIFS(Test, A325,Nimi,B325,Aeg,\">=\" &C325)","v":1}]
["Test03","Kertu Heinsoo","2019-11-22T15:34:38.715",95,5]
["Test02","Viktoria Lumi","2019-11-15T16:44:39.887",76,5]
["Test01","Artur Piiri","2019-11-01T14:58:44.699",79,4]
["Test04","Artur Piiri","2019-11-17T08:25:09.783",40,4]
["Test03","Lauri Vahtra","2019-11-26T15:13:22.436",94,1]
["Test01","Egert Vint","2019-11-22T10:23:23.826",34,3]
["Test03","Artur Piiri","2019-11-17T13:38:40.054",93,6]
["Test04","Hans Kukk","2019-11-08T08:34:48.314",89,7]
["Test02","Erik Pärn","2019-11-06T17:46:41.163",51,11]
["Test04","Artur Piiri","2019-11-10T15:28:33.743",77,5]
["Test02","Martin Aavik","2019-11-17T08:08:55.516",63,3]
["Test04","Kertu Heinsoo","2019-11-04T21:53:06.203",55,8]
["Test03","Kaspar Raude","2019-11-03T23:33:13.333",34,5]
["Test01","Maarja Pihlak","2019-11-26T16:53:34.006",99,2]
["Test02","Viktoria Lumi","2019-11-18T15:44:19.906",98,4]
["Test04","Anette Lepp","2019-11-12T14:45:06.704",40,5]
["Test02","Martin Aavik","2019-11-19T12:11:42.442",49,1]
["Test01","Martin Aavik","2019-11-22T18:33:15.463",52,3]
["Test02","Paul Hein","2019-11-24T19:17:17.190",83,2]
["Test03","Jaagup Kivi","2019-11-17T08:58:10.973",59,5]
["Test04","Maarja Pihlak","2019-11-13T23:46:04.859",91,6]
["Test03","Martin Aavik","2019-11-02T20:18:01.669",93,14]
["Test04","Maarja Pihlak","2019-11-06T16:02:27.904",40,10]
["Test03","Getlin Allas","2019-11-05T20:13:14.726",38,8]
["Test03","Urmas Lõhmus","2019-11-08T13:57:11.465",85,9]
["Test03","Reimo Kala","2019-11-18T20:08:30.435",31,3]
["Test03","Joonas Haljas","2019-11-30T14:47:28.180",62,1]
["Test04","Anette Lepp","2019-11-15T11:09:02.721",30,4]
["Test03","Urmas Lõhmus","2019-11-06T10:38:40.023",74,10]
["Test03","Joonas Haljas","2019-11-22T22:59:05.188",98,3]
["Test02","Alari Suur","2019-11-27T22:38:28.671",91,1]
["Test03","Reimo Kala","2019-11-11T13:19:25.242",97,4]
["Test01","Kertu Heinsoo","2019-11-18T18:42:58.809",89,7]
["Test01","Emili Loorits","2019-11-26T10:01:18.219",38,1]
["Test04","Erik Pärn","2019-11-13T10:37:20.017",45,6]
["Test02","Carmen Sõrmus","2019-11-13T10:24:01.372",97,7]
["Test04","Lauri Vahtra","2019-11-06T08:52:24.461",96,8]
["Test02","Egert Vint","2019-11-19T09:42:55.596",31,2]
["Test01","Martin Aavik","2019-11-06T23:09:38.819",74,9]
["Test02","Diana Taal","2019-11-24T23:38:08.364",71,3]
["Test01","Artur Piiri","2019-11-17T20:43:25.410",29,3]
["Test01","Mihkel Kulp","2019-11-25T08:08:17.260",54,3]
["Test03","Urmas Lõhmus","2019-11-28T16:22:17.438",46,1]
["Test02","Robert Lentso","2019-11-26T21:26:50.317",21,3]
["Test03","Jaagup Kivi","2019-11-17T18:14:35.353",42,4]
["Test03","Anette Lepp","2019-11-07T18:14:22.195",92,11]
["Test01","Kaspar Raude","2019-11-24T10:49:38.599",33,2]
["Test01","Sander Kell","2019-11-17T20:05:43.153",68,6]
["Test01","Mihkel Kulp","2019-11-12T11:43:45.816",77,5]
["Test04","Carmen Sõrmus","2019-11-25T20:29:12.185",62,1]
["Test03","Diana Taal","2019-11-21T17:48:12.547",64,5]
["Test01","Brita Kaljula","2019-11-02T10:17:08.710",99,10]
["Test02","Erik Pärn","2019-11-16T20:56:07.631",84,8]
["Test02","Paul Hein","2019-11-17T11:17:45.292",69,5]
["Test03","Erik Pärn","2019-11-12T16:12:02.061",83,6]
["Test04","Kertu Heinsoo","2019-11-07T12:57:32.760",100,7]
["Test03","Egert Vint","2019-11-17T13:10:11.245",80,3]
["Test03","Diana Taal","2019-11-20T18:46:48.627",85,7]
["Test02","Paul Hein","2019-11-06T09:28:49.975",39,8]
["Test03","Reimo Kala","2019-11-21T14:05:31.166",98,1]
["Test02","Carmen Sõrmus","2019-11-05T17:08:43.875",89,8]
["Test02","Rasmus Kroon","2019-11-16T20:34:22.921",92,5]
["Test02","Martin Aavik","2019-11-15T17:46:33.483",49,4]
["Test02","Kristina Merila","2019-11-12T10:04:30.834",47,{"$f":"COUNTIFS(Test, A389,Nimi,B389,Aeg,\">=\" &C389)","v":9}]
["Test03","Kristina Merila","2019-11-25T17:23:10.128",81,2]
["Test02","Kristina Merila","2019-11-08T20:20:46.311",21,13]
["Test03","Hanna Laid","2019-11-14T11:42:05.611",84,4]
["Test01","Alari Suur","2019-11-17T11:51:42.802",46,6]
["Test03","Kristina Merila","2019-11-20T10:09:49.643",97,4]
["Test03","Robert Lentso","2019-11-20T14:21:04.479",24,8]
["Test02","Diana Taal","2019-11-16T09:15:29.769",38,6]
["Test04","Anette Lepp","2019-11-26T09:11:15.915",23,2]
["Test04","Egert Vint","2019-11-04T17:24:39.785",60,8]
["Test03","Maarja Pihlak","2019-11-28T17:29:21.495",68,1]
["Test02","Brita Kaljula","2019-11-15T16:55:14.887",30,3]
["Test03","Hans Kukk","2019-11-09T22:56:40.665",31,9]
["Test01","Emili Loorits","2019-11-21T18:32:31.398",69,2]
["Test03","Urmas Lõhmus","2019-11-23T12:38:08.781",75,3]
["Test02","Carmen Sõrmus","2019-11-25T15:22:15.192",55,1]
["Test01","Rasmus Kroon","2019-11-21T14:27:48.297",74,6]
["Test02","Jana Kiisk","2019-11-04T21:21:26.022",79,11]
["Test04","Viktoria Lumi","2019-11-01T17:23:39.436",62,9]
["Test03","Kaspar Raude","2019-11-07T16:21:30.962",66,4]
["Test04","Sander Kell","2019-11-23T08:31:52.651",46,2]
["Test03","Paul Hein","2019-11-27T16:07:35.128",88,3]
["Test04","Hanna Laid","2019-11-01T19:02:50.564",38,17]
["Test04","Anna Koel","2019-11-29T14:42:55.113",70,2]
["Test04","Mihkel Kulp","2019-11-10T16:32:28.877",59,5]
["Test01","Diana Taal","2019-11-04T15:56:04.278",70,7]
["Test01","Anette Lepp","2019-11-07T08:42:32.558",88,8]
["Test03","Mihkel Kulp","2019-11-22T08:51:24.983",49,4]
["Test01","Paul Hein","2019-11-19T20:09:24.942",45,3]
["Test02","Karin Saar","2019-11-20T22:15:31.154",62,1]
["Test01","Brita Kaljula","2019-11-20T14:13:47.808",80,4]
["Test03","Sander Kell","2019-11-22T21:53:22.691",60,1]
["Test02","Karin Saar","2019-11-06T11:09:18.574",51,9]
["Test03","Kristina Merila","2019-11-21T20:07:07.937",70,3]
["Test03","Joonas Haljas","2019-11-01T12:24:21.187",99,9]
["Test03","Katrin Laurits","2019-11-22T21:54:22.842",86,2]
["Test03","Rasmus Kroon","2019-11-22T21:42:48.449",27,5]
["Test04","Emili Loorits","2019-11-15T21:59:54.928",84,5]
["Test02","Alari Suur","2019-11-14T22:39:53.589",64,4]
["Test01","Hans Kukk","2019-11-13T10:22:18.402",32,5]
["Test04","Brita Kaljula","2019-11-18T20:04:31.965",54,4]
["Test01","Hans Kukk","2019-11-01T09:48:32.247",100,9]
["Test01","Anette Lepp","2019-11-26T16:36:37.655",60,1]
["Test01","Markus Niidas","2019-11-28T20:17:20.276",50,1]
["Test04","Kristina Merila","2019-11-29T23:29:49.100",20,1]
["Test04","Artur Piiri","2019-11-17T18:01:39.064",92,3]
["Test01","Diana Taal","2019-11-07T14:17:45.983",35,5]
["Test03","Hanna Laid","2019-11-02T22:49:33.783",71,9]
["Test02","Kristina Merila","2019-11-28T20:58:11.340",36,2]
["Test01","Erik Pärn","2019-11-05T11:25:02.448",61,9]
["Test03","Brita Kaljula","2019-11-02T16:35:37.027",43,12]
["Test03","Alari Suur","2019-11-22T08:50:27.050",84,3]
["Test04","Alari Suur","2019-11-01T20:22:22.236",43,10]
["Test04","Getlin Allas","2019-11-09T13:42:46.363",98,5]
["Test01","Erik Pärn","2019-11-06T19:16:11.199",76,7]
["Test04","Katrin Laurits","2019-11-19T17:11:37.357",97,3]
["Test02","Maarja Pihlak","2019-11-23T16:57:10.761",68,1]
["Test04","Emili Loorits","2019-11-07T20:55:59.140",49,6]
["Test03","Robert Lentso","2019-11-02T15:25:20.960",27,14]
["Test02","Brita Kaljula","2019-11-29T19:25:13.203",75,1]
["Test01","Anette Lepp","2019-11-04T21:47:13.005",54,10]
["Test04","Kristina Merila","2019-11-25T20:37:39.192",65,4]
["Test01","Karin Saar","2019-11-19T19:30:16.239",71,5]
["Test02","Paul Hein","2019-11-30T15:28:14.869",63,1]
["Test01","Erik Pärn","2019-11-28T17:25:55.298",34,{"$f":"COUNTIFS(Test, A453,Nimi,B453,Aeg,\">=\" &C453)","v":3}]
["Test02","Jaagup Kivi","2019-11-11T14:44:56.025",97,3]
["Test01","Karin Saar","2019-11-26T17:29:01.923",93,1]
["Test01","Carmen Sõrmus","2019-11-05T14:35:28.632",21,8]
["Test01","Rasmus Kroon","2019-11-22T17:52:00.137",68,4]
["Test02","Mihkel Kulp","2019-11-07T20:45:32.836",22,8]
["Test01","Maarja Pihlak","2019-11-09T22:54:58.729",93,7]
["Test03","Anna Koel","2019-11-09T11:57:42.460",49,5]
["Test03","Anna Koel","2019-11-26T10:43:39.655",29,1]
["Test02","Diana Taal","2019-11-05T12:18:08.313",71,7]
["Test04","Artur Piiri","2019-11-22T19:17:50.218",79,2]
["Test02","Maarja Pihlak","2019-11-15T19:34:58.393",97,6]
["Test02","Emili Loorits","2019-11-03T08:44:43.048",62,9]
["Test02","Joonas Haljas","2019-11-11T12:25:07.977",70,9]
["Test04","Viktoria Lumi","2019-11-27T16:43:11.469",52,1]
["Test01","Anette Lepp","2019-11-14T21:15:12.714",77,3]
["Test04","Tarvo Järv","2019-11-09T17:37:36.767",53,7]
["Test01","Paul Hein","2019-11-23T22:32:39.520",77,2]
["Test01","Diana Taal","2019-11-27T19:14:33.031",52,1]
["Test01","Reimo Kala","2019-11-02T16:08:25.189",43,8]
["Test04","Anna Koel","2019-11-08T20:42:32.487",97,17]
["Test02","Artur Piiri","2019-11-21T08:31:31.958",79,2]
["Test01","Mihkel Kulp","2019-11-27T14:40:31.455",23,1]
["Test04","Egert Vint","2019-11-16T09:16:15.845",59,5]
["Test03","Jana Kiisk","2019-11-04T22:26:54.803",74,6]
["Test02","Lauri Vahtra","2019-11-24T20:33:18.799",66,4]
["Test04","Artur Piiri","2019-11-08T13:49:55.195",73,6]
["Test03","Anette Lepp","2019-11-21T17:25:01.101",94,4]
["Test01","Anette Lepp","2019-11-03T18:38:18.069",30,11]
["Test04","Alari Suur","2019-11-11T23:21:13.805",93,8]
["Test04","Jaagup Kivi","2019-11-30T22:58:37.332",33,1]
["Test04","Kaspar Raude","2019-11-13T14:45:12.350",44,3]
["Test04","Anna Koel","2019-11-25T17:43:02.368",71,7]
["Test03","Joonas Haljas","2019-11-19T13:26:31.660",25,5]
["Test02","Jana Kiisk","2019-11-22T08:57:55.626",78,4]
["Test03","Viktoria Lumi","2019-11-03T19:53:23.056",97,7]
["Test02","Joonas Haljas","2019-11-03T10:15:12.848",72,11]
["Test01","Jana Kiisk","2019-11-22T12:12:23.626",68,3]
["Test02","Urmas Lõhmus","2019-11-17T16:18:58.040",89,6]
["Test01","Hans Kukk","2019-11-26T21:09:02.659",72,1]
["Test02","Anna Koel","2019-11-24T12:23:04.863",35,3]
["Test03","Karin Saar","2019-11-08T10:41:57.151",36,7]
["Test04","Rasmus Kroon","2019-11-04T17:00:18.513",56,4]
["Test04","Hanna Laid","2019-11-18T15:40:09.392",32,5]
["Test02","Erik Pärn","2019-11-30T19:01:20.389",23,1]
["Test03","Emili Loorits","2019-11-27T14:24:38.002",25,2]
["Test01","Alari Suur","2019-11-28T08:41:57.316",75,2]
["Test01","Joonas Haljas","2019-11-16T18:37:21.607",77,7]
["Test03","Hanna Laid","2019-11-04T22:46:27.439",27,8]
["Test02","Rasmus Kroon","2019-11-21T19:31:09.153",20,4]
["Test02","Carmen Sõrmus","2019-11-23T21:10:51.112",63,3]
["Test02","Armin Kaasik","2019-11-09T18:34:29.316",40,9]
["Test04","Urmas Lõhmus","2019-11-10T21:20:51.963",50,6]
["Test02","Urmas Lõhmus","2019-11-27T16:04:25.137",57,2]
["Test02","Getlin Allas","2019-11-07T23:46:53.537",48,10]
["Test03","Kristina Merila","2019-11-27T17:43:09.171",66,1]
["Test02","Urmas Lõhmus","2019-11-23T10:06:19.257",42,4]
["Test02","Sander Kell","2019-11-06T20:29:47.129",43,8]
["Test04","Erik Pärn","2019-11-22T13:27:00.369",70,4]
["Test01","Reimo Kala","2019-11-01T12:27:27.795",31,9]
["Test02","Martin Aavik","2019-11-05T11:05:28.145",89,5]
["Test03","Getlin Allas","2019-11-22T08:42:20.881",52,2]
["Test02","Kertu Heinsoo","2019-11-25T08:05:16.708",25,3]
["Test03","Paul Hein","2019-11-05T17:45:35.784",69,8]
["Test01","Hanna Laid","2019-11-21T09:28:46.214",47,{"$f":"COUNTIFS(Test, A517,Nimi,B517,Aeg,\">=\" &C517)","v":4}]
["Test03","Robert Lentso","2019-11-21T17:48:25.781",28,6]
["Test01","Robert Lentso","2019-11-16T22:54:42.548",76,4]
["Test01","Getlin Allas","2019-11-14T22:04:52.648",43,7]
["Test01","Carmen Sõrmus","2019-11-15T12:33:13.786",34,4]
["Test04","Viktoria Lumi","2019-11-07T22:08:34.056",89,6]
["Test03","Lauri Vahtra","2019-11-25T09:20:09.138",40,3]
["Test03","Anna Koel","2019-11-01T17:19:46.284",24,6]
["Test03","Robert Lentso","2019-11-14T18:34:00.526",44,11]
["Test01","Anna Koel","2019-11-07T09:04:00.897",66,2]
["Test04","Brita Kaljula","2019-11-25T19:04:50.423",48,1]
["Test01","Tarvo Järv","2019-11-30T09:53:45.761",79,1]
["Test04","Anna Koel","2019-11-29T16:37:13.696",73,1]
["Test04","Rasmus Kroon","2019-11-15T14:04:08.413",65,1]
["Test02","Maarja Pihlak","2019-11-06T16:21:18.234",81,8]
["Test03","Tarvo Järv","2019-11-08T13:17:20.622",77,8]
["Test03","Rasmus Kroon","2019-11-25T23:19:33.093",24,2]
["Test03","Viktoria Lumi","2019-11-29T10:59:39.045",58,1]
["Test03","Brita Kaljula","2019-11-27T14:17:52.945",30,1]
["Test04","Armin Kaasik","2019-11-13T08:39:00.862",29,5]
["Test01","Joonas Haljas","2019-11-27T19:28:31.576",92,2]
["Test03","Alari Suur","2019-11-13T21:55:32.555",88,5]
["Test04","Armin Kaasik","2019-11-29T21:56:11.757",49,2]
["Test03","Mihkel Kulp","2019-11-28T11:05:11.773",88,1]
["Test04","Mihkel Kulp","2019-11-11T18:01:15.874",26,4]
["Test01","Erik Pärn","2019-11-05T12:04:17.972",51,8]
["Test04","Maarja Pihlak","2019-11-08T09:59:53.986",48,9]
["Test03","Diana Taal","2019-11-09T13:49:32.999",45,11]
["Test01","Kaspar Raude","2019-11-23T20:10:11.519",64,3]
["Test02","Hans Kukk","2019-11-06T14:22:38.505",53,6]
["Test04","Maarja Pihlak","2019-11-08T16:07:28.825",85,8]
["Test02","Tarvo Järv","2019-11-22T10:52:42.796",41,6]
["Test02","Erik Pärn","2019-11-17T13:54:36.075",53,7]
["Test02","Urmas Lõhmus","2019-11-28T21:56:26.077",33,1]
["Test01","Hans Kukk","2019-11-14T14:05:57.327",43,4]
["Test01","Kaspar Raude","2019-11-02T22:30:50.662",29,7]
["Test03","Robert Lentso","2019-11-30T18:21:59.099",65,2]
["Test01","Martin Aavik","2019-11-17T20:51:50.480",23,6]
["Test03","Robert Lentso","2019-11-04T09:23:09.661",21,13]
["Test02","Reimo Kala","2019-11-20T10:48:34.877",62,3]
["Test03","Hanna Laid","2019-11-15T23:09:40.796",99,2]
["Test01","Karin Saar","2019-11-12T13:17:56.509",66,6]
["Test02","Emili Loorits","2019-11-18T21:04:26.935",87,5]
["Test01","Getlin Allas","2019-11-28T09:37:33.101",73,1]
["Test01","Markus Niidas","2019-11-20T20:01:55.249",43,3]
["Test04","Anna Koel","2019-11-06T19:48:42.276",28,18]
["Test02","Jana Kiisk","2019-11-29T23:14:35.358",37,2]
["Test04","Joonas Haljas","2019-11-21T18:40:43.186",59,2]
["Test04","Erik Pärn","2019-11-27T21:36:21.758",80,1]
["Test03","Markus Niidas","2019-11-27T14:34:47.261",26,2]
["Test03","Paul Hein","2019-11-22T14:12:50.404",50,6]
["Test04","Katrin Laurits","2019-11-16T15:16:28.041",91,5]
["Test01","Viktoria Lumi","2019-11-19T13:45:08.313",21,2]
["Test04","Kaspar Raude","2019-11-05T13:17:43.255",89,7]
["Test02","Joonas Haljas","2019-11-25T19:34:07.771",20,3]
["Test04","Kertu Heinsoo","2019-11-26T11:20:50.179",82,1]
["Test04","Jaagup Kivi","2019-11-10T17:27:18.186",58,9]
["Test03","Karin Saar","2019-11-08T23:45:43.693",96,6]
["Test03","Katrin Laurits","2019-11-12T18:19:24.708",83,6]
["Test02","Karin Saar","2019-11-02T09:42:46.239",80,12]
["Test03","Jana Kiisk","2019-11-22T18:21:36.425",90,2]
["Test02","Kristina Merila","2019-11-11T22:12:46.247",99,10]
["Test02","Kristina Merila","2019-11-16T11:15:44.007",53,5]
["Test02","Tarvo Järv","2019-11-29T13:10:55.285",45,1]
["Test03","Erik Pärn","2019-11-11T14:35:40.891",36,{"$f":"COUNTIFS(Test, A581,Nimi,B581,Aeg,\">=\" &C581)","v":8}]
["Test03","Egert Vint","2019-11-15T13:28:58.681",77,5]
["Test03","Erik Pärn","2019-11-12T15:02:48.164",35,7]
["Test04","Rasmus Kroon","2019-11-01T19:59:00.935",61,5]
["Test01","Erik Pärn","2019-11-28T22:32:35.575",93,2]
["Test02","Jana Kiisk","2019-11-11T09:22:03.927",91,8]
["Test02","Armin Kaasik","2019-11-10T18:42:49.117",79,8]
["Test04","Maarja Pihlak","2019-11-04T18:47:30.092",69,11]
["Test03","Kertu Heinsoo","2019-11-08T18:29:00.304",40,12]
["Test02","Erik Pärn","2019-11-16T14:46:00.543",65,9]
["Test04","Hanna Laid","2019-11-25T11:57:31.304",22,2]
["Test01","Armin Kaasik","2019-11-02T15:25:54.820",95,7]
["Test01","Mihkel Kulp","2019-11-02T23:52:50.952",63,6]
["Test01","Hanna Laid","2019-11-12T19:16:46.304",38,8]
["Test02","Reimo Kala","2019-11-02T16:32:45.741",31,6]
["Test02","Markus Niidas","2019-11-05T23:28:47.201",89,8]
["Test02","Robert Lentso","2019-11-16T15:28:44.172",56,6]
["Test02","Jana Kiisk","2019-11-06T18:57:38.549",27,9]
["Test02","Lauri Vahtra","2019-11-19T12:53:02.033",77,5]
["Test04","Martin Aavik","2019-11-04T22:01:00.351",46,8]
["Test04","Egert Vint","2019-11-18T17:16:30.616",24,3]
["Test04","Joonas Haljas","2019-11-17T20:56:37.670",70,4]
["Test04","Alari Suur","2019-11-22T19:29:56.273",50,4]
["Test03","Robert Lentso","2019-11-23T10:31:06.255",49,5]
["Test02","Erik Pärn","2019-11-02T11:30:18.883",41,14]
["Test03","Alari Suur","2019-11-08T21:04:14.859",40,6]
["Test04","Armin Kaasik","2019-11-30T19:09:40.160",23,1]
["Test03","Markus Niidas","2019-11-17T22:49:55.072",79,3]
["Test01","Rasmus Kroon","2019-11-17T09:17:25.189",69,8]
["Test01","Alari Suur","2019-11-07T14:09:13.834",96,10]
["Test03","Diana Taal","2019-11-11T15:24:34.719",49,10]
["Test03","Hanna Laid","2019-11-06T17:46:39.337",74,7]
["Test04","Hanna Laid","2019-11-26T08:17:47.076",69,1]
["Test01","Maarja Pihlak","2019-11-23T15:04:27.548",88,3]
["Test04","Katrin Laurits","2019-11-23T09:47:17.405",29,1]
["Test02","Anna Koel","2019-11-26T14:16:51.847",83,2]
["Test04","Kertu Heinsoo","2019-11-07T15:33:43.551",91,6]
["Test04","Diana Taal","2019-11-20T14:42:53.832",69,3]
["Test03","Rasmus Kroon","2019-11-04T09:26:08.444",48,8]
["Test03","Lauri Vahtra","2019-11-23T14:48:03.616",95,4]
["Test03","Artur Piiri","2019-11-02T16:36:44.592",59,12]
["Test03","Anette Lepp","2019-11-08T14:57:39.366",96,10]
["Test02","Urmas Lõhmus","2019-11-05T19:25:58.069",52,9]
["Test02","Brita Kaljula","2019-11-04T11:43:01.871",60,9]
["Test03","Anna Koel","2019-11-10T15:22:51.404",35,3]
["Test04","Kristina Merila","2019-11-19T16:52:40.359",37,7]
["Test01","Rasmus Kroon","2019-11-03T16:05:36.591",50,10]
["Test03","Kristina Merila","2019-11-14T10:00:46.655",94,7]
["Test03","Jaagup Kivi","2019-11-26T12:33:55.039",72,2]
["Test04","Hans Kukk","2019-11-14T13:37:32.464",58,6]
["Test04","Mihkel Kulp","2019-11-14T15:38:26.898",95,3]
["Test04","Maarja Pihlak","2019-11-25T12:29:50.839",68,2]
["Test02","Rasmus Kroon","2019-11-01T11:59:12.279",56,9]
["Test01","Egert Vint","2019-11-27T22:24:06.868",69,2]
["Test03","Tarvo Järv","2019-11-16T09:21:34.888",61,5]
["Test04","Tarvo Järv","2019-11-26T19:50:06.709",99,2]
["Test04","Hans Kukk","2019-11-28T09:24:04.633",37,2]
["Test03","Hans Kukk","2019-11-07T08:21:09.827",61,10]
["Test02","Brita Kaljula","2019-11-12T21:03:03.206",92,4]
["Test02","Kertu Heinsoo","2019-11-28T08:27:16.483",82,1]
["Test02","Hans Kukk","2019-11-17T14:07:51.836",97,4]
["Test04","Viktoria Lumi","2019-11-09T08:51:54.123",54,5]
["Test04","Artur Piiri","2019-11-26T08:01:57.760",93,1]
["Test02","Armin Kaasik","2019-11-22T21:23:40.752",44,4]
["Test01","Katrin Laurits","2019-11-08T20:57:53.914",98,{"$f":"COUNTIFS(Test, A645,Nimi,B645,Aeg,\">=\" &C645)","v":4}]
["Test02","Artur Piiri","2019-11-23T12:05:42.783",77,1]
["Test01","Carmen Sõrmus","2019-11-24T18:59:39.437",35,2]
["Test04","Joonas Haljas","2019-11-14T20:05:20.932",86,5]
["Test03","Mihkel Kulp","2019-11-22T20:04:07.571",79,3]
["Test01","Joonas Haljas","2019-11-02T15:25:20.620",29,12]
["Test04","Anna Koel","2019-11-13T09:08:53.468",39,12]
["Test01","Mihkel Kulp","2019-11-24T11:02:03.794",88,4]
["Test03","Artur Piiri","2019-11-22T16:46:45.572",99,2]
["Test02","Brita Kaljula","2019-11-07T23:43:17.721",54,7]
["Test04","Hanna Laid","2019-11-09T11:25:54.355",99,12]
["Test01","Reimo Kala","2019-11-09T21:14:20.045",24,6]
["Test02","Mihkel Kulp","2019-11-07T12:59:39.662",25,9]
["Test03","Lauri Vahtra","2019-11-11T21:33:38.338",99,6]
["Test02","Robert Lentso","2019-11-01T09:58:13.164",99,10]
["Test03","Reimo Kala","2019-11-04T10:29:30.924",62,5]
["Test04","Getlin Allas","2019-11-05T10:58:48.860",41,6]
["Test01","Brita Kaljula","2019-11-13T19:46:23.424",23,5]
["Test02","Markus Niidas","2019-11-04T16:07:34.854",75,9]
["Test04","Katrin Laurits","2019-11-19T12:07:13.937",79,4]
["Test02","Hans Kukk","2019-11-06T09:11:44.022",40,7]
["Test03","Joonas Haljas","2019-11-15T12:14:42.467",78,7]
["Test04","Anna Koel","2019-11-09T11:40:34.327",97,16]
["Test04","Erik Pärn","2019-11-26T16:55:01.071",82,3]
["Test01","Rasmus Kroon","2019-11-17T22:25:10.179",67,7]
["Test02","Tarvo Järv","2019-11-24T16:05:24.021",35,5]
["Test03","Urmas Lõhmus","2019-11-22T16:02:28.689",39,4]
["Test02","Hans Kukk","2019-11-10T17:10:59.741",91,5]
["Test01","Getlin Allas","2019-11-18T11:43:08.147",87,3]
["Test04","Urmas Lõhmus","2019-11-03T14:37:32.826",41,8]
["Test02","Lauri Vahtra","2019-11-25T20:37:19.919",83,2]
["Test03","Martin Aavik","2019-11-21T14:49:24.704",98,5]
["Test01","Urmas Lõhmus","2019-11-07T09:19:47.186",73,6]
["Test03","Diana Taal","2019-11-28T22:23:09.497",45,2]
["Test01","Martin Aavik","2019-11-28T20:58:37.101",32,2]
["Test03","Tarvo Järv","2019-11-05T10:48:19.999",22,10]
["Test04","Getlin Allas","2019-11-03T09:47:01.183",58,8]
["Test04","Hanna Laid","2019-11-16T09:26:58.995",52,7]
["Test01","Getlin Allas","2019-11-15T08:45:52.623",59,6]
["Test03","Armin Kaasik","2019-11-07T12:30:18.980",99,6]
["Test01","Jana Kiisk","2019-11-16T23:34:20.323",79,5]
["Test04","Kertu Heinsoo","2019-11-12T13:00:10.935",28,4]
["Test04","Markus Niidas","2019-11-07T16:59:16.393",70,4]
["Test04","Jaagup Kivi","2019-11-13T18:24:16.764",93,8]
["Test03","Hans Kukk","2019-11-23T18:16:46",95,5]
["Test03","Emili Loorits","2019-11-24T22:48:49.352",47,3]
["Test02","Lauri Vahtra","2019-11-08T22:40:55.958",70,8]
["Test03","Hans Kukk","2019-11-20T18:19:51.258",100,6]
["Test03","Brita Kaljula","2019-11-15T08:49:31.736",75,7]
["Test01","Reimo Kala","2019-11-11T16:19:34.690",70,5]
["Test02","Tarvo Järv","2019-11-06T08:19:46.755",28,11]
["Test01","Egert Vint","2019-11-13T11:03:55.007",84,5]
["Test03","Emili Loorits","2019-11-13T13:31:22.155",82,4]
["Test03","Diana Taal","2019-11-14T15:54:22.298",83,9]
["Test04","Markus Niidas","2019-11-28T23:01:38.579",59,1]
["Test04","Karin Saar","2019-11-21T16:45:45.644",24,2]
["Test01","Robert Lentso","2019-11-13T18:10:42.621",66,5]
["Test04","Sander Kell","2019-11-05T23:21:57.300",83,5]
["Test01","Alari Suur","2019-11-10T15:20:14.634",30,8]
["Test03","Martin Aavik","2019-11-30T13:04:32.313",64,2]
["Test03","Robert Lentso","2019-11-20T15:42:01.063",36,7]
["Test02","Getlin Allas","2019-11-04T23:29:41.217",37,11]
["Test03","Urmas Lõhmus","2019-11-12T16:39:47.906",99,5]
["Test01","Joonas Haljas","2019-11-21T14:14:43.850",89,5]
["Test03","Maarja Pihlak","2019-11-11T22:24:54.917",61,{"$f":"COUNTIFS(Test, A709,Nimi,B709,Aeg,\">=\" &C709)","v":4}]
["Test02","Sander Kell","2019-11-22T18:36:14.947",55,5]
["Test04","Martin Aavik","2019-11-02T20:37:48.463",34,9]
["Test02","Kaspar Raude","2019-11-01T09:34:02.595",89,3]
["Test03","Artur Piiri","2019-11-20T15:54:33.906",47,4]
["Test04","Reimo Kala","2019-11-19T14:03:49.307",58,3]
["Test03","Artur Piiri","2019-11-10T13:26:01.217",31,10]
["Test04","Armin Kaasik","2019-11-11T19:32:36.323",56,6]
["Test02","Viktoria Lumi","2019-11-07T21:25:20.001",26,9]
["Test02","Sander Kell","2019-11-26T21:58:25.736",38,3]
["Test02","Tarvo Järv","2019-11-03T15:42:20.303",65,13]
["Test04","Lauri Vahtra","2019-11-12T23:17:28.263",97,5]
["Test02","Mihkel Kulp","2019-11-16T21:24:41.768",76,7]
["Test02","Anette Lepp","2019-11-12T23:27:15.321",44,4]
["Test03","Mihkel Kulp","2019-11-01T14:23:06.680",86,8]
["Test04","Getlin Allas","2019-11-09T21:07:43.697",50,4]
["Test01","Jaagup Kivi","2019-11-11T13:50:53.936",74,5]
["Test03","Anette Lepp","2019-11-14T21:28:05.061",33,7]
["Test01","Jaagup Kivi","2019-11-17T16:45:57.543",98,3]
["Test01","Paul Hein","2019-11-03T16:34:11.686",97,5]
["Test03","Markus Niidas","2019-11-30T17:00:45.158",66,1]
["Test01","Armin Kaasik","2019-11-25T22:07:02.781",54,2]
["Test03","Mihkel Kulp","2019-11-14T14:31:37.811",54,7]
["Test03","Jana Kiisk","2019-11-08T20:18:45.693",40,5]
["Test04","Lauri Vahtra","2019-11-29T18:51:16.366",27,1]
["Test03","Alari Suur","2019-11-06T08:24:05.227",44,7]
["Test04","Maarja Pihlak","2019-11-16T13:59:26.529",84,4]
["Test03","Brita Kaljula","2019-11-24T11:05:40.972",97,3]
["Test02","Rasmus Kroon","2019-11-25T19:00:43.589",95,2]
["Test03","Mihkel Kulp","2019-11-18T19:34:16.142",35,5]
["Test04","Anna Koel","2019-11-28T08:38:35.990",75,4]
["Test03","Martin Aavik","2019-11-15T21:32:19.429",90,7]
["Test04","Hanna Laid","2019-11-13T08:08:25.343",27,11]
["Test04","Robert Lentso","2019-11-13T21:20:33.446",21,5]
["Test02","Lauri Vahtra","2019-11-07T12:03:32.769",26,10]
["Test03","Jaagup Kivi","2019-11-29T20:49:37.252",57,1]
["Test03","Armin Kaasik","2019-11-27T15:43:27.739",25,3]
["Test03","Erik Pärn","2019-11-02T14:18:29.860",63,10]
["Test01","Anette Lepp","2019-11-16T23:14:33.289",92,2]
["Test02","Viktoria Lumi","2019-11-04T17:20:04.951",23,10]
["Test04","Anna Koel","2019-11-10T21:19:18.691",50,15]
["Test02","Tarvo Järv","2019-11-28T14:32:00.955",56,2]
["Test03","Kaspar Raude","2019-11-10T20:09:31.691",90,1]
["Test01","Mihkel Kulp","2019-11-25T17:31:29.808",68,2]
["Test04","Jaagup Kivi","2019-11-15T18:28:37.957",56,6]
["Test04","Emili Loorits","2019-11-24T10:26:08.627",74,1]
["Test02","Egert Vint","2019-11-03T17:07:53.281",35,7]
["Test02","Tarvo Järv","2019-11-21T14:46:10.192",97,7]
["Test01","Reimo Kala","2019-11-19T14:11:17.763",95,2]
["Test01","Tarvo Järv","2019-11-01T20:36:26.272",65,5]
["Test03","Kertu Heinsoo","2019-11-22T23:10:34.095",33,4]
["Test03","Anette Lepp","2019-11-28T18:47:23.779",64,2]
["Test02","Joonas Haljas","2019-11-12T09:34:33.999",55,7]
["Test03","Diana Taal","2019-11-23T16:04:57.325",63,4]
["Test03","Alari Suur","2019-11-29T14:49:48.769",44,1]
["Test03","Martin Aavik","2019-11-10T18:05:17.676",49,11]
["Test03","Viktoria Lumi","2019-11-06T17:23:47.186",92,6]
["Test04","Emili Loorits","2019-11-20T11:25:01.850",20,3]
["Test03","Jana Kiisk","2019-11-26T22:33:20.501",55,1]
["Test04","Brita Kaljula","2019-11-23T12:13:00.736",23,3]
["Test03","Diana Taal","2019-11-06T15:51:40.745",68,12]
["Test03","Rasmus Kroon","2019-11-23T13:24:14.117",73,4]
["Test04","Erik Pärn","2019-11-13T18:03:42.239",38,5]
["Test01","Karin Saar","2019-11-07T19:56:53.779",78,7]
["Test01","Jana Kiisk","2019-11-16T17:10:14.300",46,{"$f":"COUNTIFS(Test, A773,Nimi,B773,Aeg,\">=\" &C773)","v":6}]
["Test04","Diana Taal","2019-11-03T14:55:18.607",93,9]
["Test04","Robert Lentso","2019-11-25T09:46:52.579",97,1]
["Test04","Alari Suur","2019-11-26T11:22:04.714",59,2]
["Test03","Viktoria Lumi","2019-11-25T20:48:29.613",82,3]
["Test02","Erik Pärn","2019-11-25T22:53:40.002",81,3]
["Test04","Egert Vint","2019-11-20T22:49:00.657",56,2]
["Test02","Egert Vint","2019-11-02T11:31:57.144",73,9]
["Test02","Anna Koel","2019-11-03T20:56:18.397",99,6]
["Test02","Hanna Laid","2019-11-15T23:47:40.838",21,2]
["Test04","Markus Niidas","2019-11-19T19:33:25.408",52,2]
["Test02","Erik Pärn","2019-11-04T23:37:40.382",71,13]
["Test02","Mihkel Kulp","2019-11-26T08:38:40.999",84,4]
["Test02","Kristina Merila","2019-11-14T16:55:41.246",89,8]
["Test03","Paul Hein","2019-11-17T21:17:03.593",76,7]
["Test02","Rasmus Kroon","2019-11-01T19:59:52.952",86,8]
["Test02","Kristina Merila","2019-11-02T23:48:55.221",77,16]
["Test02","Karin Saar","2019-11-15T08:40:24.783",78,3]
["Test01","Jana Kiisk","2019-11-19T22:19:27.163",29,4]
["Test01","Carmen Sõrmus","2019-11-29T10:50:32.917",27,1]
["Test01","Getlin Allas","2019-11-02T15:23:55.830",91,9]
["Test01","Alari Suur","2019-11-29T20:21:38.494",79,1]
["Test03","Erik Pärn","2019-11-24T19:23:18.132",31,3]
["Test01","Kristina Merila","2019-11-13T14:18:59.610",37,2]
["Test03","Martin Aavik","2019-11-11T18:19:54.928",66,10]
["Test03","Martin Aavik","2019-11-16T22:04:11.893",59,6]
["Test02","Kristina Merila","2019-11-04T10:28:07.403",77,15]
["Test01","Sander Kell","2019-11-16T15:40:20.034",84,7]
["Test03","Artur Piiri","2019-11-20T15:56:41.858",36,3]
["Test04","Joonas Haljas","2019-11-01T18:09:34.549",65,6]
["Test02","Alari Suur","2019-11-02T17:18:22.701",41,8]
["Test04","Diana Taal","2019-11-09T18:14:23.771",23,6]
["Test04","Tarvo Järv","2019-11-19T22:26:42.025",93,3]
["Test04","Anna Koel","2019-11-01T12:45:57.730",67,21]
["Test01","Viktoria Lumi","2019-11-01T12:55:49.215",64,9]
["Test04","Hanna Laid","2019-11-06T11:08:41.039",97,14]
["Test04","Maarja Pihlak","2019-11-16T08:29:09.896",23,5]
["Test02","Karin Saar","2019-11-06T08:09:32.177",65,10]
["Test04","Anna Koel","2019-11-02T19:13:28.196",80,20]
["Test03","Kaspar Raude","2019-11-09T12:09:10.821",91,2]
["Test04","Brita Kaljula","2019-11-04T19:39:20.520",24,9]
["Test04","Viktoria Lumi","2019-11-25T11:10:55.920",37,3]
["Test02","Jaagup Kivi","2019-11-19T15:13:57.459",78,1]
["Test01","Katrin Laurits","2019-11-20T18:42:01.208",35,2]
["Test03","Rasmus Kroon","2019-11-30T10:42:34.697",33,1]
["Test01","Viktoria Lumi","2019-11-17T18:45:04.273",59,4]
["Test02","Reimo Kala","2019-11-07T15:48:44.429",33,4]
["Test01","Egert Vint","2019-11-03T17:52:50.559",27,7]
["Test03","Artur Piiri","2019-11-05T20:09:40.587",26,11]
["Test04","Egert Vint","2019-11-17T09:16:08.206",61,4]
["Test03","Brita Kaljula","2019-11-01T22:36:18.260",33,13]
["Test02","Maarja Pihlak","2019-11-18T11:42:13.053",31,5]
["Test01","Kertu Heinsoo","2019-11-01T10:36:16.038",85,11]
["Test03","Egert Vint","2019-11-14T12:22:02.598",41,6]
["Test03","Erik Pärn","2019-11-26T11:27:52.208",83,1]
["Test03","Tarvo Järv","2019-11-20T22:07:55.667",43,2]
["Test04","Anna Koel","2019-11-27T18:48:16.785",24,6]
["Test02","Carmen Sõrmus","2019-11-15T22:09:29.731",57,4]
["Test03","Kertu Heinsoo","2019-11-11T09:42:52.320",50,10]
["Test02","Getlin Allas","2019-11-27T17:32:36.326",39,2]
["Test01","Markus Niidas","2019-11-19T20:16:21.343",51,4]
["Test03","Anette Lepp","2019-11-10T08:48:55.445",33,8]
["Test02","Joonas Haljas","2019-11-20T21:37:48.744",21,5]
["Test02","Erik Pärn","2019-11-05T16:38:45.481",59,12]
["Test03","Martin Aavik","2019-11-21T20:34:41.713",62,{"$f":"COUNTIFS(Test, A837,Nimi,B837,Aeg,\">=\" &C837)","v":4}]
["Test04","Alari Suur","2019-11-20T21:37:22.996",71,5]
["Test04","Robert Lentso","2019-11-20T17:25:37.342",51,2]
["Test03","Paul Hein","2019-11-26T10:29:02.492",30,4]
["Test02","Urmas Lõhmus","2019-11-25T12:30:52.644",45,3]
["Test01","Egert Vint","2019-11-18T09:40:40.688",100,4]
["Test02","Katrin Laurits","2019-11-04T08:22:04.922",55,7]
["Test02","Joonas Haljas","2019-11-29T10:55:39.515",36,1]
["Test03","Carmen Sõrmus","2019-11-30T16:00:27.246",60,1]
["Test04","Lauri Vahtra","2019-11-08T11:05:51.816",69,7]
["Test01","Jaagup Kivi","2019-11-29T09:00:27.266",72,1]
["Test01","Urmas Lõhmus","2019-11-11T22:52:48.861",49,5]
["Test01","Paul Hein","2019-11-25T12:36:14.208",35,1]
["Test04","Getlin Allas","2019-11-05T10:25:44.115",24,7]
["Test04","Brita Kaljula","2019-11-11T13:24:09.472",100,6]
["Test02","Carmen Sõrmus","2019-11-14T22:31:59.354",60,6]
["Test04","Lauri Vahtra","2019-11-13T18:09:32.168",37,4]
["Test02","Markus Niidas","2019-11-19T21:37:20.681",70,4]
["Test03","Martin Aavik","2019-11-04T17:02:21.724",73,13]
["Test03","Kertu Heinsoo","2019-11-27T15:11:05.388",37,1]
["Test01","Joonas Haljas","2019-11-04T21:44:58.968",62,10]
["Test02","Kertu Heinsoo","2019-11-13T08:15:39.562",63,5]
["Test03","Egert Vint","2019-11-30T17:05:08.491",28,1]
["Test02","Kaspar Raude","2019-11-09T18:17:10.155",55,2]
["Test02","Hans Kukk","2019-11-29T22:49:47.549",22,1]
["Test01","Erik Pärn","2019-11-06T21:52:30.220",83,6]
["Test03","Viktoria Lumi","2019-11-10T12:07:08.497",99,5]
["Test03","Anette Lepp","2019-11-16T20:37:17.551",54,6]
["Test04","Katrin Laurits","2019-11-10T12:14:26.241",61,7]
["Test04","Robert Lentso","2019-11-01T19:11:04.369",65,7]
["Test04","Sander Kell","2019-11-30T17:29:59.060",34,1]
["Test02","Alari Suur","2019-11-09T17:55:10.561",53,6]
["Test01","Rasmus Kroon","2019-11-21T17:34:30.003",25,5]
["Test02","Erik Pärn","2019-11-24T12:26:41.089",22,5]
["Test01","Kertu Heinsoo","2019-11-15T19:29:47.198",68,8]
["Test04","Hanna Laid","2019-11-02T19:49:08.605",51,16]
["Test02","Markus Niidas","2019-11-20T12:12:43.040",80,3]
["Test04","Anna Koel","2019-11-22T09:01:15.779",62,9]
["Test03","Jaagup Kivi","2019-11-21T13:23:54.317",34,3]
["Test01","Erik Pärn","2019-11-21T20:30:59.487",24,5]
["Test04","Hanna Laid","2019-11-14T19:09:23.278",97,10]
["Test03","Mihkel Kulp","2019-11-27T08:11:49.568",94,2]
["Test04","Alari Suur","2019-11-29T17:01:39.518",44,1]
["Test04","Anette Lepp","2019-11-11T18:37:44.496",28,7]
["Test03","Brita Kaljula","2019-11-10T15:56:12.786",51,9]
["Test02","Armin Kaasik","2019-11-30T12:01:33.673",44,2]
["Test03","Karin Saar","2019-11-23T13:49:58.653",85,3]
["Test01","Brita Kaljula","2019-11-27T11:36:58.890",80,1]
["Test04","Hans Kukk","2019-11-27T19:20:51.094",70,3]
["Test03","Rasmus Kroon","2019-11-21T14:39:41.750",63,6]
["Test04","Anna Koel","2019-11-11T23:33:11.434",97,13]
["Test03","Hanna Laid","2019-11-22T20:16:58.494",87,1]
["Test03","Viktoria Lumi","2019-11-03T12:39:27.985",71,8]
["Test04","Anna Koel","2019-11-05T17:28:40.618",100,19]
["Test03","Hans Kukk","2019-11-28T20:21:02.569",62,3]
["Test02","Getlin Allas","2019-11-12T23:18:33.075",50,6]
["Test02","Kertu Heinsoo","2019-11-07T22:02:23.092",41,6]
["Test03","Kertu Heinsoo","2019-11-10T17:05:12.910",63,11]
["Test04","Kristina Merila","2019-11-03T22:29:31.623",62,11]
["Test01","Sander Kell","2019-11-20T23:49:17.010",94,4]
["Test04","Emili Loorits","2019-11-02T18:13:46.469",38,7]
["Test04","Karin Saar","2019-11-23T14:37:37.813",73,1]
["Test02","Lauri Vahtra","2019-11-17T18:45:14.427",26,7]
["Test02","Urmas Lõhmus","2019-11-11T18:02:51.107",54,7]
["Test04","Markus Niidas","2019-11-06T20:07:34.502",84,{"$f":"COUNTIFS(Test, A901,Nimi,B901,Aeg,\">=\" &C901)","v":5}]
["Test02","Jaagup Kivi","2019-11-17T22:34:35.747",37,2]
["Test04","Martin Aavik","2019-11-06T21:25:31.077",24,7]
["Test03","Jana Kiisk","2019-11-21T15:19:02.960",49,3]
["Test04","Maarja Pihlak","2019-11-13T20:45:52.497",81,7]
["Test04","Urmas Lõhmus","2019-11-18T20:44:53.025",67,4]
["Test01","Paul Hein","2019-11-09T08:05:10.645",32,4]
["Test04","Anna Koel","2019-11-28T10:16:03.402",36,3]
["Test01","Viktoria Lumi","2019-11-09T09:04:35.293",71,6]
["Test02","Karin Saar","2019-11-14T15:43:46.417",40,4]
["Test03","Diana Taal","2019-11-19T19:20:19.876",94,8]
["Test03","Kertu Heinsoo","2019-11-23T22:44:01.899",35,3]
["Test02","Paul Hein","2019-11-10T17:29:21.649",67,6]
["Test02","Alari Suur","2019-11-16T09:03:49.753",55,3]
["Test02","Robert Lentso","2019-11-11T16:37:19.266",82,9]
["Test02","Tarvo Järv","2019-11-26T20:34:06.369",47,3]
["Test02","Diana Taal","2019-11-29T13:41:10.761",74,1]
["Test03","Armin Kaasik","2019-11-01T21:10:05.028",80,7]
["Test04","Diana Taal","2019-11-25T23:43:16.032",85,2]
["Test01","Alari Suur","2019-11-16T20:29:10.926",30,7]
["Test04","Kertu Heinsoo","2019-11-24T20:16:09.001",55,3]
["Test02","Kertu Heinsoo","2019-11-06T10:01:34.725",57,7]
["Test02","Sander Kell","2019-11-08T12:03:05.439",70,7]
["Test04","Egert Vint","2019-11-08T08:32:23.996",78,7]
["Test04","Urmas Lõhmus","2019-11-19T13:02:41.695",50,3]
["Test02","Kertu Heinsoo","2019-11-25T20:08:26.772",60,2]
["Test01","Joonas Haljas","2019-11-11T08:27:31.453",23,8]
["Test02","Egert Vint","2019-11-17T10:12:47.344",54,3]
["Test02","Karin Saar","2019-11-01T19:17:58.366",77,13]
["Test02","Rasmus Kroon","2019-11-23T16:03:35.395",56,3]
["Test01","Lauri Vahtra","2019-11-23T19:10:08.938",25,2]
["Test02","Armin Kaasik","2019-11-20T10:45:55.392",23,5]
["Test04","Martin Aavik","2019-11-18T17:55:39.785",20,4]
["Test03","Karin Saar","2019-11-27T18:33:30.749",40,2]
["Test04","Diana Taal","2019-11-10T10:02:27.472",25,5]
["Test04","Jaagup Kivi","2019-11-19T23:06:07.943",80,3]
["Test04","Armin Kaasik","2019-11-23T21:25:30.337",24,4]
["Test02","Jana Kiisk","2019-11-19T10:45:43.001",58,5]
["Test04","Anette Lepp","2019-11-23T10:23:22.376",41,3]
["Test01","Hanna Laid","2019-11-29T22:24:26.191",89,1]
["Test04","Karin Saar","2019-11-10T18:40:06.643",59,7]
["Test03","Katrin Laurits","2019-11-08T14:49:59.496",71,7]
["Test04","Joonas Haljas","2019-11-21T08:55:54.954",55,3]
["Test01","Hans Kukk","2019-11-22T18:31:22.279",53,2]
["Test03","Egert Vint","2019-11-17T10:20:35.570",67,4]
["Test01","Brita Kaljula","2019-11-03T16:54:28.454",43,9]
["Test04","Anette Lepp","2019-11-11T19:46:20.215",24,6]
["Test04","Jaagup Kivi","2019-11-18T18:08:38.035",47,4]
["Test03","Egert Vint","2019-11-28T08:51:58.986",84,2]
["Test02","Jana Kiisk","2019-11-30T23:53:33.008",71,1]
["Test03","Joonas Haljas","2019-11-21T22:38:26.774",31,4]
["Test04","Sander Kell","2019-11-14T20:55:57.581",93,4]
["Test01","Kertu Heinsoo","2019-11-05T14:32:29.687",59,10]
["Test01","Rasmus Kroon","2019-11-30T20:06:31.034",74,1]
["Test03","Anette Lepp","2019-11-19T09:40:16.888",46,5]
["Test01","Karin Saar","2019-11-21T12:15:43.567",40,4]
["Test02","Getlin Allas","2019-11-21T23:32:09.425",87,5]
["Test01","Sander Kell","2019-11-24T15:51:14.614",80,3]
["Test01","Joonas Haljas","2019-11-27T10:39:49.644",62,3]
["Test02","Jana Kiisk","2019-11-06T17:50:58.762",82,10]
["Test03","Paul Hein","2019-11-30T17:24:02.934",38,1]
["Test02","Mihkel Kulp","2019-11-29T16:43:32.509",53,1]
["Test03","Brita Kaljula","2019-11-04T09:03:23.351",38,10]
["Test01","Joonas Haljas","2019-11-19T19:05:38.681",55,6]
["Test02","Katrin Laurits","2019-11-18T16:00:32.186",82,{"$f":"COUNTIFS(Test, A965,Nimi,B965,Aeg,\">=\" &C965)","v":4}]
["Test03","Mihkel Kulp","2019-11-17T08:23:05.387",66,6]
["Test04","Hans Kukk","2019-11-06T21:07:12.019",32,8]
["Test04","Karin Saar","2019-11-06T11:10:52.475",62,8]
["Test04","Mihkel Kulp","2019-11-23T18:13:42.555",66,2]
["Test02","Egert Vint","2019-11-06T18:36:26.176",32,5]
["Test03","Lauri Vahtra","2019-11-08T21:42:48.116",59,8]
["Test04","Viktoria Lumi","2019-11-03T14:34:09.132",76,8]
["Test03","Jaagup Kivi","2019-11-15T15:37:32.777",74,7]
["Test04","Anna Koel","2019-11-16T20:25:28.203",76,11]
["Test04","Anette Lepp","2019-11-26T17:46:58.093",49,1]
["Test03","Maarja Pihlak","2019-11-05T17:17:21.018",57,5]
["Test01","Viktoria Lumi","2019-11-10T20:03:43.840",37,5]
["Test01","Kertu Heinsoo","2019-11-20T10:57:22.837",43,6]
["Test03","Martin Aavik","2019-11-08T17:56:07.804",65,12]
["Test04","Diana Taal","2019-11-07T17:59:20.943",22,8]
["Test04","Paul Hein","2019-11-13T23:08:18.586",62,4]
["Test02","Hans Kukk","2019-11-01T13:49:18.493",77,8]
["Test03","Erik Pärn","2019-11-25T15:36:04.061",84,2]
["Test04","Katrin Laurits","2019-11-20T12:23:05.502",66,2]
["Test03","Getlin Allas","2019-11-06T21:28:11.848",85,7]
["Test01","Diana Taal","2019-11-05T12:32:50.369",77,6]
["Test04","Emili Loorits","2019-11-21T11:35:15.314",38,2]
["Test01","Hanna Laid","2019-11-05T23:42:28.106",88,9]
["Test04","Getlin Allas","2019-11-26T14:06:28.232",89,1]
["Test03","Armin Kaasik","2019-11-28T16:40:37.716",100,2]
["Test02","Getlin Allas","2019-11-09T08:16:19.348",47,9]
["Test03","Artur Piiri","2019-11-16T08:48:19.491",74,7]
["Test04","Hanna Laid","2019-11-06T15:31:44.623",90,13]
["Test02","Armin Kaasik","2019-11-22T22:23:54.649",35,3]
["Test04","Maarja Pihlak","2019-11-17T22:53:42.577",79,3]
["Test01","Brita Kaljula","2019-11-27T09:29:48.287",88,2]
["Test03","Diana Taal","2019-11-29T23:02:14.915",48,1]
["Test02","Artur Piiri","2019-11-09T13:02:14.646",97,3]
["Test02","Kristina Merila","2019-11-07T12:10:33.484",98,14]
["Test02","Viktoria Lumi","2019-11-08T23:41:46.359",49,8]
["Test03","Lauri Vahtra","2019-11-17T11:13:26.031",34,5]
["Test01","Urmas Lõhmus","2019-11-19T08:19:50.203",42,2]
["Test03","Anna Koel","2019-11-15T11:25:36.132",81,2]
["Test03","Carmen Sõrmus","2019-11-18T10:46:43.464",57,2]
["Test01","Robert Lentso","2019-11-26T20:35:19.526",30,3]
["Test01","Anna Koel","2019-11-06T23:54:10.604",51,3]
["Test02","Carmen Sõrmus","2019-11-15T10:14:21.417",73,5]
["Test04","Martin Aavik","2019-11-26T08:59:27.084",47,2]
["Test01","Katrin Laurits","2019-11-05T15:45:53.853",29,5]
["Test04","Reimo Kala","2019-11-26T19:27:05.872",79,2]
["Test04","Jaagup Kivi","2019-11-06T10:06:42.272",27,12]
["Test04","Anette Lepp","2019-11-03T19:28:50.441",80,11]
["Test01","Martin Aavik","2019-11-13T20:50:23.135",91,7]
["Test01","Anette Lepp","2019-11-06T13:17:54.820",94,9]
["Test03","Robert Lentso","2019-11-07T22:28:11.177",68,12]
["Test02","Viktoria Lumi","2019-11-13T14:26:10.409",78,7]
["Test03","Armin Kaasik","2019-11-29T14:15:58.537",60,1]
["Test04","Anna Koel","2019-11-18T12:05:42.152",63,10]
["Test03","Robert Lentso","2019-11-30T19:38:46.649",58,1]
["Test02","Karin Saar","2019-11-10T20:54:53.016",50,8]
["Test02","Anette Lepp","2019-11-10T18:33:56.712",99,5]
["Test02","Paul Hein","2019-11-09T12:42:09.889",88,7]
["Test01","Kertu Heinsoo","2019-11-27T11:56:43.773",90,4]
["Test04","Robert Lentso","2019-11-14T19:33:47.368",38,4]
["Test03","Karin Saar","2019-11-21T22:39:26.897",39,4]
["Test02","Armin Kaasik","2019-11-30T20:03:57.271",61,1]
["Test01","Viktoria Lumi","2019-11-04T20:56:11.367",24,8]
["Test04","Markus Niidas","2019-11-11T09:06:51.450",92,3]
["Test04","Brita Kaljula","2019-11-13T09:51:55.825",100,{"$f":"COUNTIFS(Test, A1029,Nimi,B1029,Aeg,\">=\" &C1029)","v":5}]
["Test03","Tarvo Järv","2019-11-14T12:35:59.930",27,6]
["Test01","Jana Kiisk","2019-11-06T14:58:58.241",57,9]
["Test02","Martin Aavik","2019-11-19T09:46:17.483",28,2]
["Test04","Katrin Laurits","2019-11-08T17:24:24.131",81,8]
["Test01","Hans Kukk","2019-11-05T16:57:03.584",91,7]
["Test03","Jana Kiisk","2019-11-11T11:56:30.215",87,4]
["Test02","Katrin Laurits","2019-11-24T17:01:08.744",53,3]
["Test02","Karin Saar","2019-11-05T14:28:50.382",27,11]
["Test03","Kristina Merila","2019-11-11T10:51:10.874",49,8]
["Test04","Anna Koel","2019-11-11T11:34:36.621",39,14]
["Test02","Hans Kukk","2019-11-17T15:17:21.990",65,3]
["Test04","Anette Lepp","2019-11-10T09:23:21.234",78,8]
["Test01","Diana Taal","2019-11-26T11:33:34.975",28,2]
["Test03","Robert Lentso","2019-11-15T18:07:34.693",23,10]
["Test03","Martin Aavik","2019-11-13T12:27:39.597",96,9]
["Test02","Getlin Allas","2019-11-25T16:49:56.561",90,3]
["Test01","Kertu Heinsoo","2019-11-15T08:35:50.023",74,9]
["Test01","Carmen Sõrmus","2019-11-10T13:47:18.991",47,5]
["Test02","Katrin Laurits","2019-11-30T21:42:34.400",40,1]
["Test03","Paul Hein","2019-11-29T09:30:45.221",44,2]
["Test02","Joonas Haljas","2019-11-12T09:03:56.181",67,8]
["Test01","Markus Niidas","2019-11-14T12:51:18.097",25,5]
["Test02","Mihkel Kulp","2019-11-17T08:42:36.640",86,6]
["Test01","Diana Taal","2019-11-13T17:52:37.136",71,4]
["Test03","Kertu Heinsoo","2019-11-11T15:30:14.787",31,9]
["Test02","Katrin Laurits","2019-11-26T11:00:08.073",24,2]
["Test03","Viktoria Lumi","2019-11-28T21:09:33.722",100,2]
["Test02","Lauri Vahtra","2019-11-18T21:34:57.578",54,6]
["Test03","Martin Aavik","2019-11-14T19:58:12.785",38,8]
["Test02","Paul Hein","2019-11-02T09:01:59.802",32,9]
["Test03","Artur Piiri","2019-11-13T15:27:30.617",25,9]
["Test02","Paul Hein","2019-11-22T09:47:07.259",25,4]
["Test03","Emili Loorits","2019-11-29T16:36:40.042",23,1]
["Test01","Anna Koel","2019-11-17T16:50:33.327",37,1]
["Test04","Karin Saar","2019-11-13T09:47:09.718",51,5]
["Test02","Kertu Heinsoo","2019-11-05T15:58:33.898",70,8]
["Test01","Getlin Allas","2019-11-15T16:06:55.761",97,5]
["Test03","Hanna Laid","2019-11-14T19:48:47.910",23,3]
["Test02","Carmen Sõrmus","2019-11-24T17:25:43.387",54,2]
["Test01","Brita Kaljula","2019-11-26T20:02:32.650",81,3]
["Test03","Reimo Kala","2019-11-01T17:50:16.330",71,6]
["Test03","Sander Kell","2019-11-13T13:36:17.585",93,3]
["Test01","Hans Kukk","2019-11-03T11:45:09.162",89,8]
["Test04","Reimo Kala","2019-11-30T11:29:00.525",92,1]
["Test03","Anette Lepp","2019-11-09T21:09:12.499",52,9]
["Test01","Jana Kiisk","2019-11-29T22:48:26.564",41,1]
["Test01","Joonas Haljas","2019-11-03T13:15:09.163",20,11]
["Test03","Kertu Heinsoo","2019-11-20T14:10:49.346",58,7]
["Test04","Erik Pärn","2019-11-01T13:56:54.718",83,8]
["Test01","Katrin Laurits","2019-11-17T12:49:51.852",29,3]
["Test02","Getlin Allas","2019-11-12T15:49:40.885",44,7]
["Test02","Viktoria Lumi","2019-11-26T09:15:21.281",28,1]
["Test04","Jaagup Kivi","2019-11-15T22:45:39.706",35,5]
["Test02","Urmas Lõhmus","2019-11-22T08:20:19.946",61,5]
["Test01","Brita Kaljula","2019-11-12T13:36:14.599",20,6]
["Test04","Martin Aavik","2019-11-14T21:06:36.421",78,5]
["Test04","Kristina Merila","2019-11-08T08:59:49.990",48,8]
["Test04","Martin Aavik","2019-11-13T17:25:26.004",41,6]
["Test02","Diana Taal","2019-11-16T22:01:56.331",88,5]
["Test02","Kristina Merila","2019-11-28T11:37:49.747",53,3]
["Test04","Mihkel Kulp","2019-11-07T09:25:55.584",44,6]
["Test01","Sander Kell","2019-11-28T21:53:13.018",46,1]
["Test02","Mihkel Kulp","2019-11-05T10:04:00.377",90,10]
["Test01","Hanna Laid","2019-11-24T12:35:27.589",85,{"$f":"COUNTIFS(Test, A1093,Nimi,B1093,Aeg,\">=\" &C1093)","v":2}]
["Test01","Jana Kiisk","2019-11-14T11:04:47.060",47,7]
["Test02","Egert Vint","2019-11-10T18:40:42.448",33,4]
["Test01","Erik Pärn","2019-11-29T17:33:05.968",87,1]
["Test01","Brita Kaljula","2019-11-11T21:55:15.110",54,7]
["Test03","Brita Kaljula","2019-11-03T21:07:25.328",44,11]
["Test01","Hans Kukk","2019-11-16T11:58:22.756",100,3]
["Test01","Hanna Laid","2019-11-16T17:39:12.667",85,7]
["Test01","Joonas Haljas","2019-11-22T15:38:26.465",47,4]
["Test04","Brita Kaljula","2019-11-09T21:56:28.270",97,7]
["Test03","Carmen Sõrmus","2019-11-09T22:51:02.591",67,5]
["Test04","Kaspar Raude","2019-11-18T22:57:37.132",89,2]
["Test02","Getlin Allas","2019-11-10T17:34:09.998",50,8]
["Test04","Kristina Merila","2019-11-20T14:37:20.761",20,6]
["Test03","Erik Pärn","2019-11-09T23:39:59.943",56,9]
["Test03","Brita Kaljula","2019-11-13T20:15:58.434",75,8]
["Test01","Anna Koel","2019-11-04T20:12:16.012",72,4]
["Test04","Erik Pärn","2019-11-12T14:14:44.045",45,7]
["Test02","Karin Saar","2019-11-12T09:53:30.342",51,6]
["Test04","Jaagup Kivi","2019-11-07T23:31:44.602",68,10]
["Test04","Kaspar Raude","2019-11-23T18:16:04.740",56,1]
["Test01","Kaspar Raude","2019-11-29T19:36:59.528",44,1]
["Test02","Robert Lentso","2019-11-18T10:30:44.801",40,4]
["Test02","Jana Kiisk","2019-11-25T19:47:55.510",81,3]
["Test01","Alari Suur","2019-11-23T22:47:38.292",83,3]
["Test02","Sander Kell","2019-11-27T16:43:01.406",70,2]
["Test04","Jaagup Kivi","2019-11-07T15:58:43.278",86,11]
["Test02","Armin Kaasik","2019-11-13T19:27:10.334",23,7]
["Test02","Rasmus Kroon","2019-11-02T12:16:23.131",88,7]
["Test03","Kristina Merila","2019-11-16T16:10:16.708",29,5]
["Test01","Joonas Haljas","2019-11-07T11:23:16.261",22,9]
["Test03","Katrin Laurits","2019-11-22T17:47:05.624",99,3]
["Test01","Kertu Heinsoo","2019-11-29T21:46:56.575",68,2]
["Test03","Carmen Sõrmus","2019-11-02T14:23:33.650",25,7]
["Test04","Erik Pärn","2019-11-27T19:51:07.444",98,2]
["Test02","Reimo Kala","2019-11-25T16:45:53.501",90,1]
["Test01","Rasmus Kroon","2019-11-30T10:31:53.027",67,2]
["Test03","Brita Kaljula","2019-11-20T18:45:48.949",36,5]
["Test04","Diana Taal","2019-11-12T14:52:57.026",26,4]
["Test04","Carmen Sõrmus","2019-11-18T20:16:30.626",72,2]
["Test02","Alari Suur","2019-11-16T15:07:14.419",60,2]
["Test01","Katrin Laurits","2019-11-01T09:44:23.997",86,6]
["Test01","Maarja Pihlak","2019-11-14T16:09:00.824",93,6]
["Test01","Rasmus Kroon","2019-11-26T13:54:02.176",57,3]
["Test02","Anette Lepp","2019-11-17T17:36:21.313",50,2]
["Test03","Lauri Vahtra","2019-11-25T11:04:16.049",62,2]
["Test03","Urmas Lõhmus","2019-11-25T12:46:20.455",51,2]
["Test01","Brita Kaljula","2019-11-07T23:52:13.973",71,8]
["Test02","Emili Loorits","2019-11-24T08:18:38.438",100,1]
["Test03","Anna Koel","2019-11-10T09:39:13.939",30,4]
["Test01","Diana Taal","2019-11-24T16:53:37.672",79,3]
["Test03","Katrin Laurits","2019-11-19T22:23:58.229",31,4]
["Test02","Hans Kukk","2019-11-28T20:04:12.479",89,2]
["Test03","Hans Kukk","2019-11-20T15:14:04.836",67,7]
["Test03","Armin Kaasik","2019-11-20T09:10:11.366",47,5]
["Test01","Jana Kiisk","2019-11-13T19:51:08.649",84,8]
["Test04","Kaspar Raude","2019-11-10T22:11:54.699",75,4]
["Test04","Sander Kell","2019-11-17T18:16:21.086",47,3]
["Test01","Carmen Sõrmus","2019-11-09T14:15:14.941",70,7]
["Test02","Getlin Allas","2019-11-02T23:48:46.233",20,14]
["Test03","Armin Kaasik","2019-11-23T23:10:51.553",44,4]
["Test04","Tarvo Järv","2019-11-14T17:26:18.211",90,5]
["Test03","Diana Taal","2019-11-21T11:55:44.979",63,6]
["Test03","Carmen Sõrmus","2019-11-17T17:18:00.298",20,3]
["Test01","Martin Aavik","2019-11-19T22:34:39.151",65,{"$f":"COUNTIFS(Test, A1157,Nimi,B1157,Aeg,\">=\" &C1157)","v":5}]
["Test04","Emili Loorits","2019-11-18T14:02:44.434",25,4]
["Test01","Rasmus Kroon","2019-11-15T11:13:06.513",50,9]
["Test04","Jaagup Kivi","2019-11-04T14:12:21.400",59,13]
["Test02","Erik Pärn","2019-11-10T10:51:10.361",38,10]
["Test03","Carmen Sõrmus","2019-11-10T11:42:21.071",20,4]
["Test03","Hans Kukk","2019-11-30T09:26:40.889",69,2]
["Test04","Armin Kaasik","2019-11-06T11:49:58.143",42,8]
["Test04","Karin Saar","2019-11-16T22:18:37.425",98,3]
["Test04","Kristina Merila","2019-11-07T08:54:40.790",94,9]
["Test02","Tarvo Järv","2019-11-04T19:50:49.206",86,12]
["Test03","Martin Aavik","2019-11-30T19:23:16.883",51,1]
["Test02","Emili Loorits","2019-11-20T13:07:51.520",73,3]
["Test03","Erik Pärn","2019-11-24T10:24:24.044",44,4]
["Test02","Emili Loorits","2019-11-12T21:31:26.691",47,6]
["Test02","Mihkel Kulp","2019-11-28T12:41:37.976",82,3]
["Test03","Karin Saar","2019-11-30T15:13:23.961",89,1]

{"sheet":"Liigendtabelid","index":3,"n_rows":43,"n_cols":13,"rows_kept":43,"cut":false,"hidden":false,"merged":[]}
[]
["2. Iga tudengi iga testi parim tulemus ",null,null,null,null,null,null,"1. Iga tudengi iga testi kolme viimase testisoorituse aritmeetiline keskmine"]
[]
["Max. of Tulemus","Column Labels",null,null,null,null,null,"Jnr","(Multiple Items)"]
["Row Labels","Test01","Test02","Test03","Test04","Grand Total"]
["Alari Suur",96,91,88,93,96,null,"Average of Tulemus","Column Labels"]
["Anette Lepp",94,99,97,80,99,null,"Row Labels","Test01","Test02","Test03","Test04","Grand Total"]
["Anna Koel",72,99,81,100,100,null,"Alari Suur",79,68.666666666666671,61,56,66.166666666666671]
["Armin Kaasik",95,79,100,56,100,null,"Anette Lepp",76.333333333333329,63.333333333333336,71,37.666666666666664,62.083333333333336]
["Artur Piiri",98,97,99,93,99,null,"Anna Koel",51.333333333333336,50,48.333333333333336,59.666666666666664,52.333333333333336]
["Brita Kaljula",99,100,97,100,100,null,"Armin Kaasik",75,46.666666666666664,61.666666666666664,42,56.333333333333336]
["Carmen Sõrmus",70,97,67,86,97,null,"Artur Piiri",68.333333333333329,84.333333333333329,56.666666666666664,88,74.333333333333329]
["Diana Taal",86,93,95,93,95,null,"Brita Kaljula",83,62.666666666666664,54.333333333333336,43.666666666666664,60.916666666666664]
["Egert Vint",100,81,84,78,100,null,"Carmen Sõrmus",31.333333333333332,57.333333333333336,45.666666666666664,73.333333333333329,51.916666666666664]
["Emili Loorits",69,100,85,84,100,null,"Diana Taal",53,79.333333333333329,62.666666666666664,78,68.25]
["Erik Pärn",93,94,84,98,98,null,"Egert Vint",44,41.666666666666664,64,38.333333333333336,47]
["Getlin Allas",97,92,85,98,98,null,"Emili Loorits",56.333333333333336,74.666666666666671,31.666666666666668,44,51.666666666666664]
["Hanna Laid",92,84,99,99,99,null,"Erik Pärn",71.333333333333329,59,66,86.666666666666671,70.75]
["Hans Kukk",100,97,100,96,100,null,"Getlin Allas",67.333333333333329,62.666666666666664,63.666666666666664,51.666666666666664,61.333333333333336]
["Jaagup Kivi",98,97,87,93,98,null,"Hanna Laid",70.333333333333329,53.666666666666664,69.666666666666671,49.333333333333336,60.75]
["Jana Kiisk",84,91,90,91,91,null,"Hans Kukk",75,58.666666666666664,69.666666666666671,53,64.083333333333329]
["Joonas Haljas",92,98,99,86,99,null,"Jaagup Kivi",85.666666666666671,70.666666666666671,54.333333333333336,65,68.916666666666671]
["Karin Saar",95,80,96,98,98,null,"Jana Kiisk",54,63,64.666666666666671,91,63.6]
["Kaspar Raude",95,94,91,89,95,null,"Joonas Haljas",78.333333333333329,35.666666666666664,66.666666666666671,57,59.416666666666664]
["Katrin Laurits",98,84,99,97,99,null,"Karin Saar",92,58.333333333333336,71.333333333333329,65,71.666666666666671]
["Kertu Heinsoo",90,82,95,100,100,null,"Kaspar Raude",47,79.333333333333329,70,63,64.833333333333329]
["Kristina Merila",72,99,97,94,99,null,"Katrin Laurits",46.333333333333336,39,78,64,56.833333333333336]
["Lauri Vahtra",98,93,99,97,99,null,"Kertu Heinsoo",61.666666666666664,55.666666666666664,44,54,53.833333333333336]
["Maarja Pihlak",99,97,87,91,99,null,"Kristina Merila",45,57.333333333333336,72.333333333333329,39,53.416666666666664]
["Markus Niidas",51,89,79,92,92,null,"Lauri Vahtra",52.666666666666664,67.666666666666671,65.333333333333329,50,58.916666666666664]
["Martin Aavik",91,89,98,99,99,null,"Maarja Pihlak",92,69,79.666666666666671,62.666666666666664,75.833333333333329]
["Mihkel Kulp",88,92,94,95,95,null,"Markus Niidas",39.666666666666664,77.666666666666671,57,67.666666666666671,60.5]
["Paul Hein",97,88,97,83,97,null,"Martin Aavik",41.333333333333336,46.666666666666664,59.333333333333336,76.666666666666671,56]
["Rasmus Kroon",83,95,73,95,95,null,"Mihkel Kulp",48.333333333333336,75.666666666666671,87,83,73.5]
["Reimo Kala",95,90,98,92,98,null,"Paul Hein",52.333333333333336,65,56.666666666666664,49.666666666666664,55.916666666666664]
["Robert Lentso",76,99,85,97,99,null,"Rasmus Kroon",66,61.333333333333336,35.333333333333336,84,61.666666666666664]
["Sander Kell",94,86,93,93,94,null,"Reimo Kala",75,79.666666666666671,51.666666666666664,76.333333333333329,70.666666666666671]
["Tarvo Järv",87,97,97,99,99,null,"Robert Lentso",35.666666666666664,63.333333333333336,49,69,54.25]
["Urmas Lõhmus",73,89,99,96,99,null,"Sander Kell",59.333333333333336,43.666666666666664,69.333333333333329,42.333333333333336,53.666666666666664]
["Viktoria Lumi",93,98,100,98,100,null,"Tarvo Järv",61.666666666666664,49.333333333333336,53.333333333333336,91,63.833333333333336]
["Grand Total",100,100,100,100,100,null,"Urmas Lõhmus",60.666666666666664,45,57.333333333333336,77,60]
[null,null,null,null,null,null,null,"Viktoria Lumi",46.666666666666664,63.333333333333336,80,62.333333333333336,63.083333333333336]
[null,null,null,null,null,null,null,"Grand Total",61.228571428571428,60.828571428571429,61.38095238095238,62.04854368932039,61.368421052631582]

{"sheet":"testid (2)","index":4,"n_rows":1173,"n_cols":13,"rows_kept":1173,"cut":false,"hidden":true,"merged":[]}
[null,null,null,null,null,"08:00:00","23:55:00",null,null,"Test01","Test02","Test03","Test04"]
[null,null,null,null,null,"2019-11-01","2019-11-30",null,"Katrin Laurits",{"$f":"COUNTIFS($A:$A,J$1,$B:$B,$I2)","v":8},{"$f":"COUNTIFS($A:$A,K$1,$B:$B,$I2)","v":8},12,12]
[null,null,null,null,null,null,null,null,"Anette Lepp",{"$f":"COUNTIFS($A:$A,J$1,$B:$B,$I3)","v":11},8,8,13]
["Test","Nimi","Aeg","Tulemus",null,null,"Test01",null,"Reimo Kala",8,3,7,4]
[{"$f":"INDEX($G$4:$G$7,RANDBETWEEN(1,4))","v":"Test01"},{"$f":"INDEX($I$2:$I$36,RANDBETWEEN(1,35))","v":"Urmas Lõhmus"},{"$f":"RANDBETWEEN($F$2,$G$2)+$F$1+RAND()*($G$1-$F$1)","v":"2019-11-01T09:58:44.581"},{"$f":"RANDBETWEEN(20,100)","v":74},null,null,"Test02",null,"Egert Vint",10,10,8,7]
[{"$f":"INDEX($G$4:$G$7,RANDBETWEEN(1,4))","v":"Test03"},{"$f":"INDEX($I$2:$I$36,RANDBETWEEN(1,35))","v":"Brita Kaljula"},{"$f":"RANDBETWEEN($F$2,$G$2)+$F$1+RAND()*($G$1-$F$1)","v":"2019-11-15T10:28:52.574"},{"$f":"RANDBETWEEN(20,100)","v":84},null,null,"Test03",null,"Carmen Sõrmus",11,6,6,11]
["Test01","Joonas Haljas","2019-11-09T15:44:43.198",75,null,null,"Test04",null,"Armin Kaasik",9,7,10,7]
["Test04","Jana Kiisk","2019-11-25T08:25:07.547",80,null,null,null,null,"Jana Kiisk",6,10,8,10]
["Test02","Getlin Allas","2019-11-01T10:19:20.846",74,null,null,null,null,"Kaspar Raude",15,12,9,10]
["Test02","Kaspar Raude","2019-11-14T11:29:23.093",58,null,35,null,null,"Karin Saar",7,4,10,4]
["Test02","Anna Koel","2019-11-16T10:44:22.632",55,null,4,null,null,"Hanna Laid",7,10,6,7]
["Test04","Kertu Heinsoo","2019-11-20T11:26:37.293",49,null,5,null,null,"Mihkel Kulp",7,7,13,9]
["Test01","Carmen Sõrmus","2019-11-18T21:42:00.371",88,null,{"$f":"F10*F11*F12","v":700},null,null,"Markus Niidas",9,15,8,7]
["Test01","Urmas Lõhmus","2019-11-24T12:28:38.327",93,null,null,null,null,"Alari Suur",9,11,9,11]
["Test04","Maarja Pihlak","2019-11-17T11:39:16.918",37,null,null,null,null,"Erik Pärn",9,9,6,8]
["Test01","Kertu Heinsoo","2019-11-03T23:49:04.151",24,null,null,null,null,"Martin Aavik",8,10,10,3]
["Test02","Karin Saar","2019-11-08T12:13:02.792",43,null,null,null,null,"Maarja Pihlak",8,4,3,12]
["Test03","Alari Suur","2019-11-24T19:54:42.426",29,null,null,null,null,"Urmas Lõhmus",10,8,14,15]
["Test03","Sander Kell","2019-11-01T12:26:39.021",27,null,null,null,null,"Lauri Vahtra",11,10,8,4]
["Test01","Reimo Kala","2019-11-29T15:08:48.096",39,null,null,null,null,"Emili Loorits",10,13,6,9]
["Test03","Katrin Laurits","2019-11-03T16:18:14.990",93,null,null,null,null,"Jaagup Kivi",7,9,8,5]
["Test01","Emili Loorits","2019-11-05T20:12:31.647",41,null,null,null,null,"Joonas Haljas",5,7,6,9]
["Test04","Artur Piiri","2019-11-14T18:09:29.260",30,null,null,null,null,"Robert Lentso",9,9,8,13]
["Test01","Kaspar Raude","2019-11-05T21:46:16.887",96,null,null,null,null,"Viktoria Lumi",12,10,9,13]
["Test03","Viktoria Lumi","2019-11-04T14:52:35.276",70,null,null,null,null,"Sander Kell",2,7,6,8]
["Test02","Markus Niidas","2019-11-07T21:03:31.059",25,null,null,null,null,"Hans Kukk",3,10,3,6]
["Test03","Sander Kell","2019-11-04T15:39:58.699",96,null,null,null,null,"Diana Taal",5,5,6,6]
["Test04","Alari Suur","2019-11-25T08:28:08.933",28,null,null,null,null,"Kertu Heinsoo",11,13,5,10]
["Test02","Brita Kaljula","2019-11-02T19:33:58.036",58,null,null,null,null,"Tarvo Järv",10,8,7,9]
["Test01","Mihkel Kulp","2019-11-24T21:50:41.223",51,null,null,null,null,"Paul Hein",9,9,6,5]
["Test01","Carmen Sõrmus","2019-11-14T17:20:58.111",65,null,null,null,null,"Artur Piiri",10,9,12,8]
["Test03","Brita Kaljula","2019-11-09T10:12:32.781",89,null,null,null,null,"Getlin Allas",5,7,9,5]
["Test03","Urmas Lõhmus","2019-11-24T14:50:03.885",93,null,null,null,null,"Brita Kaljula",13,11,5,9]
["Test01","Brita Kaljula","2019-11-29T23:01:01.396",28,null,null,null,null,"Anna Koel",13,7,5,6]
["Test04","Egert Vint","2019-11-02T08:41:55.063",100,null,null,null,null,"Kristina Merila",10,4,10,6]
["Test03","Carmen Sõrmus","2019-11-01T17:29:45.028",98,null,null,null,null,"Rasmus Kroon",6,10,8,11]
["Test03","Tarvo Järv","2019-11-24T13:00:21.486",85]
["Test03","Anna Koel","2019-11-09T22:35:35.982",58]
["Test04","Viktoria Lumi","2019-11-17T19:56:36.254",97]
["Test02","Alari Suur","2019-11-14T17:04:42.047",83]
["Test03","Anna Koel","2019-11-09T11:26:31.168",35]
["Test02","Hans Kukk","2019-11-09T14:33:32.029",68]
["Test01","Kaspar Raude","2019-11-06T18:53:12.889",33]
["Test02","Brita Kaljula","2019-11-11T23:21:17.788",37]
["Test04","Egert Vint","2019-11-13T20:08:17.701",37]
["Test02","Emili Loorits","2019-11-08T10:58:13.821",30]
["Test03","Jaagup Kivi","2019-11-09T14:48:56.095",94]
["Test01","Paul Hein","2019-11-15T11:11:31.812",89]
["Test01","Viktoria Lumi","2019-11-03T20:21:52.910",40]
["Test04","Diana Taal","2019-11-04T09:28:57.008",37]
["Test04","Viktoria Lumi","2019-11-20T16:55:28.181",91]
["Test01","Anna Koel","2019-11-23T13:47:39.978",31]
["Test04","Robert Lentso","2019-11-25T10:15:14.365",64]
["Test04","Joonas Haljas","2019-11-17T14:25:09.415",58]
["Test02","Hans Kukk","2019-11-28T13:18:53.561",57]
["Test02","Mihkel Kulp","2019-11-14T19:15:21.541",95]
["Test04","Tarvo Järv","2019-11-20T17:25:28.089",21]
["Test01","Mihkel Kulp","2019-11-15T13:25:34.652",68]
["Test01","Sander Kell","2019-11-05T20:26:17.233",85]
["Test02","Emili Loorits","2019-11-07T09:33:50.324",27]
["Test04","Maarja Pihlak","2019-11-09T20:48:52.413",90]
["Test01","Alari Suur","2019-11-22T19:56:25.984",23]
["Test04","Urmas Lõhmus","2019-11-21T22:38:53.914",39]
["Test01","Katrin Laurits","2019-11-22T17:58:37.455",80]
["Test02","Jaagup Kivi","2019-11-09T14:50:24.577",38]
["Test04","Anna Koel","2019-11-04T11:11:15.443",42]
["Test04","Jaagup Kivi","2019-11-26T20:34:46.859",36]
["Test02","Anette Lepp","2019-11-25T17:36:38.939",70]
["Test04","Urmas Lõhmus","2019-11-04T17:10:12.112",72]
[{"$f":"INDEX($G$4:$G$7,RANDBETWEEN(1,4))","v":"Test02"},{"$f":"INDEX($I$2:$I$36,RANDBETWEEN(1,35))","v":"Lauri Vahtra"},{"$f":"RANDBETWEEN($F$2,$G$2)+$F$1+RAND()*($G$1-$F$1)","v":"2019-11-23T19:57:28.337"},{"$f":"RANDBETWEEN(20,100)","v":98}]
["Test04","Rasmus Kroon","2019-11-04T13:46:03.071",48]
["Test04","Kristina Merila","2019-11-16T21:26:16.660",25]
["Test01","Carmen Sõrmus","2019-11-28T19:54:09.612",55]
["Test04","Tarvo Järv","2019-11-05T11:34:44.169",39]
["Test03","Diana Taal","2019-11-01T09:56:38.679",27]
["Test04","Alari Suur","2019-11-28T20:23:58.992",74]
["Test03","Mihkel Kulp","2019-11-05T08:47:33.888",59]
["Test03","Karin Saar","2019-11-09T21:09:32.017",69]
["Test03","Kristina Merila","2019-11-02T13:17:46.331",54]
["Test01","Armin Kaasik","2019-11-08T13:47:06.116",83]
["Test01","Rasmus Kroon","2019-11-01T10:09:58.371",32]
["Test01","Urmas Lõhmus","2019-11-28T10:14:59.745",52]
["Test03","Anette Lepp","2019-11-09T16:34:54.859",51]
["Test03","Katrin Laurits","2019-11-02T20:13:55.217",99]
["Test02","Rasmus Kroon","2019-11-12T11:08:32.237",98]
["Test02","Emili Loorits","2019-11-23T15:27:02.338",20]
["Test03","Markus Niidas","2019-11-14T14:56:49.848",91]
["Test03","Jana Kiisk","2019-11-19T20:00:49.516",21]
["Test03","Armin Kaasik","2019-11-03T13:37:56.252",94]
["Test01","Erik Pärn","2019-11-04T19:40:22.276",46]
["Test02","Paul Hein","2019-11-03T10:47:42.453",60]
["Test01","Anna Koel","2019-11-12T09:44:06.681",48]
["Test02","Sander Kell","2019-11-11T22:24:56.166",75]
["Test01","Anna Koel","2019-11-08T17:25:05.214",54]
["Test04","Tarvo Järv","2019-11-19T11:55:22.254",59]
["Test04","Joonas Haljas","2019-11-21T12:29:43.271",98]
["Test04","Kertu Heinsoo","2019-11-20T13:58:56.596",45]
["Test04","Hanna Laid","2019-11-26T19:33:11.435",81]
["Test01","Kaspar Raude","2019-11-08T18:04:02.123",63]
["Test02","Egert Vint","2019-11-16T12:09:44.174",90]
["Test02","Brita Kaljula","2019-11-29T21:56:49.879",43]
["Test01","Emili Loorits","2019-11-21T16:26:39.415",56]
["Test03","Jana Kiisk","2019-11-13T09:55:08.444",20]
["Test02","Urmas Lõhmus","2019-11-20T17:32:21.817",86]
["Test01","Anna Koel","2019-11-27T16:27:41.033",60]
["Test02","Kaspar Raude","2019-11-26T20:50:34.259",35]
["Test02","Hans Kukk","2019-11-21T21:42:46.786",31]
["Test01","Kertu Heinsoo","2019-11-17T21:48:07.362",56]
["Test04","Anette Lepp","2019-11-06T16:35:46.567",92]
["Test02","Armin Kaasik","2019-11-30T16:40:00.829",83]
["Test03","Erik Pärn","2019-11-13T08:01:20.808",46]
["Test03","Anna Koel","2019-11-21T19:27:50.383",49]
["Test04","Alari Suur","2019-11-13T11:54:30.932",100]
["Test03","Martin Aavik","2019-11-05T11:52:07.142",96]
["Test04","Anna Koel","2019-11-22T19:27:40.140",90]
["Test03","Lauri Vahtra","2019-11-08T19:32:00.768",81]
["Test04","Getlin Allas","2019-11-06T09:48:44.795",46]
["Test04","Jana Kiisk","2019-11-21T22:57:50.946",88]
["Test03","Hanna Laid","2019-11-15T16:56:18.267",66]
["Test03","Anette Lepp","2019-11-06T08:51:16.233",68]
["Test02","Getlin Allas","2019-11-12T08:13:25.356",96]
["Test02","Rasmus Kroon","2019-11-03T19:32:19.339",28]
["Test02","Rasmus Kroon","2019-11-11T11:29:33.341",36]
["Test02","Kaspar Raude","2019-11-17T14:08:34.162",97]
["Test01","Diana Taal","2019-11-26T10:13:19.468",39]
["Test02","Paul Hein","2019-11-21T08:27:10.642",45]
["Test03","Mihkel Kulp","2019-11-17T19:57:17.387",49]
["Test02","Paul Hein","2019-11-21T23:29:08.452",63]
["Test02","Martin Aavik","2019-11-25T20:58:35.984",26]
["Test01","Mihkel Kulp","2019-11-20T11:42:47.832",77]
["Test04","Rasmus Kroon","2019-11-18T21:06:05.760",43]
["Test03","Rasmus Kroon","2019-11-04T11:07:03.329",92]
["Test04","Sander Kell","2019-11-26T23:46:46.684",35]
[{"$f":"INDEX($G$4:$G$7,RANDBETWEEN(1,4))","v":"Test04"},{"$f":"INDEX($I$2:$I$36,RANDBETWEEN(1,35))","v":"Robert Lentso"},{"$f":"RANDBETWEEN($F$2,$G$2)+$F$1+RAND()*($G$1-$F$1)","v":"2019-11-11T17:53:58.404"},{"$f":"RANDBETWEEN(20,100)","v":33}]
["Test04","Anette Lepp","2019-11-16T20:06:20.942",67]
["Test04","Maarja Pihlak","2019-11-25T08:04:01.519",65]
["Test03","Rasmus Kroon","2019-11-26T18:55:13.212",29]
["Test01","Erik Pärn","2019-11-03T16:48:00.661",88]
["Test04","Joonas Haljas","2019-11-22T20:37:41.435",63]
["Test03","Carmen Sõrmus","2019-11-29T12:03:17.177",38]
["Test04","Armin Kaasik","2019-11-09T11:19:00.245",44]
["Test04","Kertu Heinsoo","2019-11-26T21:32:58.384",40]
["Test01","Brita Kaljula","2019-11-04T13:13:35.168",46]
["Test02","Jana Kiisk","2019-11-14T20:45:32.656",52]
["Test02","Alari Suur","2019-11-19T19:28:24.850",45]
["Test04","Urmas Lõhmus","2019-11-03T11:01:09.986",29]
["Test03","Kaspar Raude","2019-11-09T13:35:18.890",35]
["Test04","Emili Loorits","2019-11-22T20:53:59.566",50]
["Test04","Hans Kukk","2019-11-10T09:37:14.310",70]
["Test03","Anette Lepp","2019-11-06T13:41:14.261",40]
["Test03","Sander Kell","2019-11-05T16:00:19.041",50]
["Test03","Mihkel Kulp","2019-11-05T11:00:04.075",47]
["Test01","Markus Niidas","2019-11-28T22:27:38",27]
["Test04","Urmas Lõhmus","2019-11-26T17:37:45.907",35]
["Test03","Kristina Merila","2019-11-09T11:42:49.296",24]
["Test01","Egert Vint","2019-11-18T09:07:54.372",67]
["Test01","Artur Piiri","2019-11-24T14:37:58.235",38]
["Test01","Egert Vint","2019-11-04T23:03:09.567",75]
["Test01","Artur Piiri","2019-11-06T12:38:13.356",74]
["Test01","Kaspar Raude","2019-11-04T19:50:42.428",70]
["Test03","Artur Piiri","2019-11-22T23:34:55.134",52]
["Test01","Kristina Merila","2019-11-26T22:46:35.685",99]
["Test02","Paul Hein","2019-11-16T17:42:53.879",87]
["Test02","Lauri Vahtra","2019-11-03T13:44:01.294",57]
["Test01","Getlin Allas","2019-11-12T15:52:11.418",36]
["Test01","Egert Vint","2019-11-01T16:32:02.056",59]
["Test04","Maarja Pihlak","2019-11-28T20:15:38.708",47]
["Test04","Katrin Laurits","2019-11-05T15:38:45.410",89]
["Test03","Getlin Allas","2019-11-11T14:24:03.643",50]
["Test04","Armin Kaasik","2019-11-01T16:58:39.323",92]
["Test01","Kertu Heinsoo","2019-11-17T16:19:40.079",79]
["Test02","Markus Niidas","2019-11-16T09:44:45.978",47]
["Test04","Emili Loorits","2019-11-18T18:57:31.282",90]
["Test01","Robert Lentso","2019-11-17T19:29:11.379",23]
["Test04","Erik Pärn","2019-11-19T18:25:43.352",24]
["Test02","Katrin Laurits","2019-11-29T11:04:39.868",51]
["Test04","Jana Kiisk","2019-11-04T12:07:33.353",65]
["Test03","Hanna Laid","2019-11-03T10:30:13.168",91]
["Test01","Anette Lepp","2019-11-16T21:05:39.789",49]
["Test03","Mihkel Kulp","2019-11-21T18:55:11.172",66]
["Test04","Urmas Lõhmus","2019-11-19T19:08:31.380",66]
["Test04","Emili Loorits","2019-11-24T15:20:53.415",63]
["Test04","Lauri Vahtra","2019-11-12T12:27:44.632",48]
["Test01","Rasmus Kroon","2019-11-21T11:23:26.200",80]
["Test02","Alari Suur","2019-11-26T22:04:37.001",71]
["Test03","Reimo Kala","2019-11-22T08:40:27.280",40]
["Test01","Katrin Laurits","2019-11-01T15:56:05.861",89]
["Test02","Hans Kukk","2019-11-25T14:56:35.908",25]
["Test04","Mihkel Kulp","2019-11-29T11:41:12.308",80]
["Test01","Emili Loorits","2019-11-25T12:26:53.337",68]
["Test03","Hanna Laid","2019-11-02T20:12:53.514",71]
["Test01","Jana Kiisk","2019-11-08T14:34:21.387",45]
["Test01","Maarja Pihlak","2019-11-24T14:38:38.948",23]
["Test04","Viktoria Lumi","2019-11-04T09:32:20.340",51]
["Test01","Brita Kaljula","2019-11-17T16:02:17.922",96]
["Test03","Egert Vint","2019-11-14T22:17:41.717",46]
["Test04","Karin Saar","2019-11-19T20:11:16.602",36]
[{"$f":"INDEX($G$4:$G$7,RANDBETWEEN(1,4))","v":"Test04"},{"$f":"INDEX($I$2:$I$36,RANDBETWEEN(1,35))","v":"Hanna Laid"},{"$f":"RANDBETWEEN($F$2,$G$2)+$F$1+RAND()*($G$1-$F$1)","v":"2019-11-09T18:40:33.101"},{"$f":"RANDBETWEEN(20,100)","v":50}]
["Test04","Joonas Haljas","2019-11-06T12:43:34.795",39]
["Test02","Tarvo Järv","2019-11-16T15:28:31.378",78]
["Test01","Karin Saar","2019-11-23T17:58:24.013",44]
["Test02","Robert Lentso","2019-11-18T16:49:54.993",55]
["Test04","Rasmus Kroon","2019-11-22T19:41:09.214",31]
["Test03","Armin Kaasik","2019-11-28T11:30:22.608",83]
["Test04","Maarja Pihlak","2019-11-17T22:23:14.994",89]
["Test03","Viktoria Lumi","2019-11-01T18:19:56.660",27]
["Test04","Viktoria Lumi","2019-11-09T23:24:08.286",36]
["Test02","Diana Taal","2019-11-01T17:14:26.022",60]
["Test04","Egert Vint","2019-11-06T08:27:47.999",22]
["Test03","Urmas Lõhmus","2019-11-26T22:46:05.324",84]
["Test04","Artur Piiri","2019-11-10T21:26:08.704",88]
["Test04","Urmas Lõhmus","2019-11-23T08:21:04.370",75]
["Test02","Getlin Allas","2019-11-03T15:08:32.693",65]
["Test03","Emili Loorits","2019-11-22T08:00:51.092",33]
["Test03","Artur Piiri","2019-11-24T20:04:44.150",45]
["Test02","Markus Niidas","2019-11-29T09:56:26.995",21]
["Test02","Kaspar Raude","2019-11-13T18:42:29.322",73]
["Test01","Lauri Vahtra","2019-11-07T17:10:09.153",97]
["Test01","Viktoria Lumi","2019-11-26T10:08:25.809",66]
["Test03","Urmas Lõhmus","2019-11-25T18:47:15.044",95]
["Test04","Armin Kaasik","2019-11-22T19:01:06.239",57]
["Test03","Joonas Haljas","2019-11-25T14:02:58.848",21]
["Test02","Markus Niidas","2019-11-14T19:03:49.005",62]
["Test01","Urmas Lõhmus","2019-11-06T21:06:59.413",77]
["Test01","Tarvo Järv","2019-11-28T08:04:33.179",30]
["Test01","Tarvo Järv","2019-11-13T20:56:19.263",22]
["Test03","Brita Kaljula","2019-11-23T13:46:29.955",22]
["Test01","Lauri Vahtra","2019-11-20T23:36:08.443",42]
["Test03","Jaagup Kivi","2019-11-09T16:18:45.266",75]
["Test01","Emili Loorits","2019-11-19T20:40:12.343",95]
["Test03","Viktoria Lumi","2019-11-18T10:47:34.993",97]
["Test01","Anna Koel","2019-11-16T08:38:12.048",79]
["Test03","Artur Piiri","2019-11-12T18:19:37.214",27]
["Test01","Jana Kiisk","2019-11-29T17:58:38.938",66]
["Test04","Sander Kell","2019-11-04T10:52:00.972",61]
["Test01","Rasmus Kroon","2019-11-23T10:06:40.445",77]
["Test03","Artur Piiri","2019-11-19T20:30:18.182",51]
["Test03","Paul Hein","2019-11-26T14:46:33.969",53]
["Test04","Hans Kukk","2019-11-22T13:11:02.773",73]
["Test01","Viktoria Lumi","2019-11-09T20:54:34.176",89]
["Test03","Tarvo Järv","2019-11-24T18:47:31.084",24]
["Test04","Carmen Sõrmus","2019-11-03T12:28:30.171",36]
["Test02","Sander Kell","2019-11-30T16:27:38.490",28]
["Test02","Anna Koel","2019-11-10T22:55:30.485",42]
["Test01","Lauri Vahtra","2019-11-10T09:59:26.736",49]
["Test04","Egert Vint","2019-11-01T09:14:43.277",96]
["Test02","Artur Piiri","2019-11-21T12:44:33.909",67]
["Test02","Maarja Pihlak","2019-11-19T10:41:58.985",84]
["Test03","Reimo Kala","2019-11-18T20:28:32.050",82]
["Test03","Urmas Lõhmus","2019-11-17T12:33:55.140",25]
["Test02","Erik Pärn","2019-11-03T22:14:03.398",33]
["Test02","Joonas Haljas","2019-11-04T14:32:28.496",28]
["Test02","Kaspar Raude","2019-11-09T19:18:45.862",80]
["Test02","Carmen Sõrmus","2019-11-13T15:39:14.094",86]
["Test04","Erik Pärn","2019-11-18T22:20:44.057",61]
["Test04","Viktoria Lumi","2019-11-26T21:20:57.784",67]
["Test02","Katrin Laurits","2019-11-13T17:40:04.071",94]
["Test02","Rasmus Kroon","2019-11-11T16:35:37.670",81]
["Test01","Rasmus Kroon","2019-11-26T22:45:48.439",55]
["Test03","Mihkel Kulp","2019-11-29T15:43:16.372",41]
["Test01","Kertu Heinsoo","2019-11-15T10:51:30.420",51]
[{"$f":"INDEX($G$4:$G$7,RANDBETWEEN(1,4))","v":"Test03"},{"$f":"INDEX($I$2:$I$36,RANDBETWEEN(1,35))","v":"Maarja Pihlak"},{"$f":"RANDBETWEEN($F$2,$G$2)+$F$1+RAND()*($G$1-$F$1)","v":"2019-11-10T22:42:25.387"},{"$f":"RANDBETWEEN(20,100)","v":51}]
["Test01","Diana Taal","2019-11-08T13:22:54.505",21]
["Test01","Anna Koel","2019-11-14T22:06:00.053",97]
["Test01","Maarja Pihlak","2019-11-20T19:23:11.219",84]
["Test02","Emili Loorits","2019-11-06T16:05:49.746",64]
["Test04","Kaspar Raude","2019-11-15T19:46:37.032",66]
["Test01","Robert Lentso","2019-11-01T10:18:53.576",54]
["Test02","Markus Niidas","2019-11-06T16:00:03.554",61]
["Test03","Karin Saar","2019-11-22T18:54:27.251",99]
["Test01","Alari Suur","2019-11-11T15:39:26.258",42]
["Test02","Brita Kaljula","2019-11-18T20:44:16.756",33]
["Test01","Jaagup Kivi","2019-11-04T15:08:11.637",45]
["Test03","Diana Taal","2019-11-03T22:29:12.634",93]
["Test02","Reimo Kala","2019-11-25T22:31:49.022",52]
["Test03","Mihkel Kulp","2019-11-26T17:56:16.052",90]
["Test02","Mihkel Kulp","2019-11-16T10:08:11.886",33]
["Test04","Carmen Sõrmus","2019-11-15T12:36:22.556",75]
["Test02","Artur Piiri","2019-11-23T11:52:41.578",99]
["Test03","Karin Saar","2019-11-01T13:46:50.904",90]
["Test01","Viktoria Lumi","2019-11-09T08:10:01.503",74]
["Test03","Alari Suur","2019-11-18T12:40:43.655",35]
["Test04","Kaspar Raude","2019-11-16T12:13:21.810",65]
["Test03","Mihkel Kulp","2019-11-11T20:53:38.710",33]
["Test04","Hans Kukk","2019-11-07T11:37:29.392",48]
["Test04","Kaspar Raude","2019-11-01T13:43:49.505",30]
["Test02","Kaspar Raude","2019-11-04T21:11:57.919",63]
["Test03","Viktoria Lumi","2019-11-08T16:48:11.616",24]
["Test01","Jana Kiisk","2019-11-13T11:40:00.556",26]
["Test04","Urmas Lõhmus","2019-11-21T17:38:00.256",67]
["Test01","Kristina Merila","2019-11-25T16:41:38.812",64]
["Test04","Anna Koel","2019-11-19T22:24:59.770",58]
["Test02","Egert Vint","2019-11-19T12:11:07.271",71]
["Test04","Diana Taal","2019-11-11T15:10:49.207",95]
["Test02","Robert Lentso","2019-11-19T22:54:32.856",95]
["Test02","Robert Lentso","2019-11-04T15:25:45.416",74]
["Test04","Joonas Haljas","2019-11-18T16:04:45.533",62]
["Test02","Urmas Lõhmus","2019-11-18T22:54:58.392",58]
["Test03","Anette Lepp","2019-11-26T12:48:09.863",48]
["Test01","Viktoria Lumi","2019-11-02T14:05:58.462",26]
["Test03","Robert Lentso","2019-11-27T11:06:24.018",40]
["Test01","Katrin Laurits","2019-11-16T15:56:20.306",67]
["Test01","Reimo Kala","2019-11-09T12:08:42.117",72]
["Test03","Hanna Laid","2019-11-12T16:29:48.599",53]
["Test02","Urmas Lõhmus","2019-11-25T10:43:57.178",64]
["Test04","Emili Loorits","2019-11-11T17:34:16.056",46]
["Test02","Robert Lentso","2019-11-02T19:22:47.436",70]
["Test01","Emili Loorits","2019-11-30T22:05:39.015",73]
["Test04","Tarvo Järv","2019-11-12T16:52:56.499",60]
["Test04","Robert Lentso","2019-11-16T18:35:29.429",29]
["Test01","Sander Kell","2019-11-28T10:48:40.159",92]
["Test02","Kertu Heinsoo","2019-11-13T09:08:48.534",74]
["Test01","Paul Hein","2019-11-22T18:07:37.121",27]
["Test01","Alari Suur","2019-11-03T09:57:33.597",41]
["Test04","Anna Koel","2019-11-27T11:35:22.452",36]
["Test03","Erik Pärn","2019-11-24T23:21:14.983",90]
["Test01","Erik Pärn","2019-11-26T17:29:10.706",28]
["Test02","Erik Pärn","2019-11-23T14:05:37.589",40]
["Test03","Jana Kiisk","2019-11-03T11:21:22.745",90]
["Test03","Sander Kell","2019-11-27T13:56:16.931",56]
["Test04","Anette Lepp","2019-11-01T19:45:47.087",55]
["Test03","Martin Aavik","2019-11-09T09:06:54.113",53]
["Test02","Urmas Lõhmus","2019-11-25T11:52:35",35]
["Test02","Paul Hein","2019-11-22T08:20:59.588",80]
["Test02","Artur Piiri","2019-11-01T09:15:56.508",98]
[{"$f":"INDEX($G$4:$G$7,RANDBETWEEN(1,4))","v":"Test02"},{"$f":"INDEX($I$2:$I$36,RANDBETWEEN(1,35))","v":"Kaspar Raude"},{"$f":"RANDBETWEEN($F$2,$G$2)+$F$1+RAND()*($G$1-$F$1)","v":"2019-11-11T20:50:38.709"},{"$f":"RANDBETWEEN(20,100)","v":72}]
["Test03","Reimo Kala","2019-11-16T10:22:44.078",47]
["Test01","Kaspar Raude","2019-11-16T08:53:11.595",31]
["Test02","Sander Kell","2019-11-14T16:00:27.537",93]
["Test02","Getlin Allas","2019-11-05T22:45:48.222",67]
["Test01","Anna Koel","2019-11-23T17:47:14.287",48]
["Test02","Kertu Heinsoo","2019-11-11T08:30:50.764",42]
["Test03","Lauri Vahtra","2019-11-13T11:11:52.830",50]
["Test02","Jaagup Kivi","2019-11-15T10:08:45.476",24]
["Test04","Urmas Lõhmus","2019-11-21T20:05:55.731",52]
["Test02","Karin Saar","2019-11-03T16:13:51.472",81]
["Test04","Viktoria Lumi","2019-11-13T17:20:27.657",32]
["Test03","Viktoria Lumi","2019-11-17T17:36:21.152",97]
["Test03","Karin Saar","2019-11-22T14:16:13.369",42]
["Test03","Emili Loorits","2019-11-30T15:13:00.497",29]
["Test03","Kertu Heinsoo","2019-11-24T16:44:13.549",94]
["Test02","Kertu Heinsoo","2019-11-02T11:28:46.231",68]
["Test04","Joonas Haljas","2019-11-28T17:22:44.095",65]
["Test02","Viktoria Lumi","2019-11-27T12:08:25.886",91]
["Test01","Anna Koel","2019-11-23T23:29:01.019",86]
["Test04","Mihkel Kulp","2019-11-11T17:09:58.416",23]
["Test04","Brita Kaljula","2019-11-23T16:38:49.728",64]
["Test03","Mihkel Kulp","2019-11-07T17:03:34.570",79]
["Test04","Paul Hein","2019-11-20T14:52:15.261",61]
["Test02","Sander Kell","2019-11-23T17:53:04.106",46]
["Test03","Kaspar Raude","2019-11-08T18:12:01.416",70]
["Test03","Anette Lepp","2019-11-05T22:48:53.491",74]
["Test01","Urmas Lõhmus","2019-11-07T08:12:52.668",32]
["Test04","Katrin Laurits","2019-11-17T21:37:52.100",56]
["Test02","Egert Vint","2019-11-23T10:47:51.258",63]
["Test02","Hans Kukk","2019-11-09T09:13:49.485",40]
["Test04","Erik Pärn","2019-11-01T21:34:55.545",56]
["Test02","Jana Kiisk","2019-11-03T18:53:39.956",72]
["Test01","Getlin Allas","2019-11-02T16:01:00.938",42]
["Test02","Urmas Lõhmus","2019-11-03T09:58:16.593",95]
["Test02","Erik Pärn","2019-11-08T20:36:04.450",50]
["Test01","Emili Loorits","2019-11-03T21:54:55.538",60]
["Test03","Getlin Allas","2019-11-29T15:51:40.207",38]
["Test02","Armin Kaasik","2019-11-17T09:35:28.861",65]
["Test04","Kertu Heinsoo","2019-11-29T10:31:41.778",48]
["Test02","Emili Loorits","2019-11-27T11:43:36.349",43]
["Test02","Paul Hein","2019-11-16T13:53:39.857",66]
["Test03","Kaspar Raude","2019-11-23T14:31:50.047",67]
["Test03","Urmas Lõhmus","2019-11-18T21:02:36.563",85]
["Test04","Lauri Vahtra","2019-11-18T21:19:24.269",32]
["Test03","Emili Loorits","2019-11-11T16:04:39.321",65]
["Test03","Jana Kiisk","2019-11-30T20:30:05.142",93]
["Test03","Kristina Merila","2019-11-16T09:25:10.581",36]
["Test02","Brita Kaljula","2019-11-03T08:51:00.701",92]
["Test04","Tarvo Järv","2019-11-10T21:41:20.752",60]
["Test01","Egert Vint","2019-11-14T16:25:29.419",34]
["Test01","Maarja Pihlak","2019-11-18T09:27:05.967",30]
["Test03","Viktoria Lumi","2019-11-28T10:20:15.537",82]
["Test03","Egert Vint","2019-11-25T13:14:10.546",56]
["Test02","Jaagup Kivi","2019-11-22T18:37:59.270",78]
["Test01","Maarja Pihlak","2019-11-10T15:07:37.754",40]
["Test01","Karin Saar","2019-11-17T21:08:17.581",69]
["Test02","Viktoria Lumi","2019-11-28T12:07:07.389",36]
["Test04","Robert Lentso","2019-11-16T17:31:17.852",76]
["Test02","Anette Lepp","2019-11-18T19:47:27.719",52]
["Test02","Alari Suur","2019-11-28T20:26:06.160",83]
["Test01","Artur Piiri","2019-11-24T23:03:40.059",88]
["Test02","Martin Aavik","2019-11-05T18:36:26.361",58]
["Test02","Maarja Pihlak","2019-11-17T13:12:08.980",34]
[{"$f":"INDEX($G$4:$G$7,RANDBETWEEN(1,4))","v":"Test04"},{"$f":"INDEX($I$2:$I$36,RANDBETWEEN(1,35))","v":"Robert Lentso"},{"$f":"RANDBETWEEN($F$2,$G$2)+$F$1+RAND()*($G$1-$F$1)","v":"2019-11-06T12:58:14.139"},{"$f":"RANDBETWEEN(20,100)","v":84}]
["Test01","Carmen Sõrmus","2019-11-02T10:02:51.668",98]
["Test04","Brita Kaljula","2019-11-25T12:58:23.038",58]
["Test01","Robert Lentso","2019-11-30T11:16:44.164",60]
["Test04","Armin Kaasik","2019-11-12T12:56:11.189",52]
["Test02","Artur Piiri","2019-11-23T17:09:51.456",85]
["Test04","Anette Lepp","2019-11-22T13:26:16.796",23]
["Test03","Robert Lentso","2019-11-30T19:19:35.070",92]
["Test01","Robert Lentso","2019-11-18T15:11:45.966",62]
["Test01","Brita Kaljula","2019-11-05T21:17:43.569",29]
["Test02","Katrin Laurits","2019-11-20T21:42:26.033",95]
["Test01","Artur Piiri","2019-11-18T12:44:36.172",94]
["Test01","Carmen Sõrmus","2019-11-16T21:37:32.005",96]
["Test02","Jaagup Kivi","2019-11-14T19:25:04.913",68]
["Test03","Anette Lepp","2019-11-22T17:32:22.849",59]
["Test02","Hanna Laid","2019-11-20T12:39:24.728",81]
["Test04","Brita Kaljula","2019-11-24T11:25:21.797",73]
["Test01","Jana Kiisk","2019-11-21T23:14:44.585",88]
["Test02","Katrin Laurits","2019-11-10T13:06:17.996",68]
["Test04","Katrin Laurits","2019-11-22T17:51:36.683",93]
["Test04","Katrin Laurits","2019-11-22T19:53:34.595",45]
["Test02","Markus Niidas","2019-11-25T17:25:39.284",20]
["Test03","Sander Kell","2019-11-10T21:33:18.363",20]
["Test03","Getlin Allas","2019-11-24T23:33:00.467",27]
["Test03","Mihkel Kulp","2019-11-12T21:55:07.992",76]
["Test01","Kaspar Raude","2019-11-20T19:57:39.606",78]
["Test04","Jaagup Kivi","2019-11-09T13:46:04.950",52]
["Test02","Kertu Heinsoo","2019-11-12T12:24:14.884",82]
["Test04","Markus Niidas","2019-11-04T14:14:58.508",38]
["Test03","Jaagup Kivi","2019-11-19T14:07:58.617",94]
["Test02","Erik Pärn","2019-11-19T14:07:34.195",76]
["Test04","Kertu Heinsoo","2019-11-04T12:50:21.189",50]
["Test01","Getlin Allas","2019-11-17T14:39:39.992",82]
["Test02","Kristina Merila","2019-11-11T09:08:33.532",65]
["Test01","Artur Piiri","2019-11-04T13:00:05.970",23]
["Test04","Emili Loorits","2019-11-13T10:44:16.960",25]
["Test01","Robert Lentso","2019-11-01T14:43:44.820",24]
["Test01","Karin Saar","2019-11-20T12:12:15.431",65]
["Test01","Mihkel Kulp","2019-11-12T23:38:41.381",51]
["Test01","Armin Kaasik","2019-11-03T12:51:23.230",50]
["Test04","Emili Loorits","2019-11-08T10:57:14.990",58]
["Test03","Jaagup Kivi","2019-11-05T22:08:02.433",23]
["Test04","Anette Lepp","2019-11-12T13:47:40.802",98]
["Test02","Carmen Sõrmus","2019-11-13T13:40:58.524",30]
["Test03","Urmas Lõhmus","2019-11-05T19:21:01.506",67]
["Test02","Mihkel Kulp","2019-11-06T15:49:22.149",68]
["Test04","Viktoria Lumi","2019-11-08T21:51:19.532",56]
["Test03","Urmas Lõhmus","2019-11-03T16:17:45.626",36]
["Test04","Katrin Laurits","2019-11-24T16:26:00.224",67]
["Test04","Artur Piiri","2019-11-18T16:56:13.357",42]
["Test04","Markus Niidas","2019-11-22T10:42:27.874",28]
["Test01","Egert Vint","2019-11-04T15:22:03.032",34]
["Test01","Tarvo Järv","2019-11-16T23:07:25.461",77]
["Test01","Kristina Merila","2019-11-04T09:49:03.405",72]
["Test03","Armin Kaasik","2019-11-08T08:18:43.027",71]
["Test03","Egert Vint","2019-11-29T16:21:09.986",52]
["Test04","Markus Niidas","2019-11-28T18:22:23.600",41]
["Test01","Joonas Haljas","2019-11-07T14:16:53.227",88]
["Test03","Mihkel Kulp","2019-11-29T22:02:54.766",43]
["Test01","Martin Aavik","2019-11-02T10:13:32.405",50]
["Test04","Robert Lentso","2019-11-02T19:09:49.995",52]
["Test02","Viktoria Lumi","2019-11-14T12:50:05.737",34]
["Test01","Getlin Allas","2019-11-03T12:51:06.424",77]
["Test02","Jaagup Kivi","2019-11-25T16:35:36.246",90]
[{"$f":"INDEX($G$4:$G$7,RANDBETWEEN(1,4))","v":"Test04"},{"$f":"INDEX($I$2:$I$36,RANDBETWEEN(1,35))","v":"Tarvo Järv"},{"$f":"RANDBETWEEN($F$2,$G$2)+$F$1+RAND()*($G$1-$F$1)","v":"2019-11-01T20:53:00.008"},{"$f":"RANDBETWEEN(20,100)","v":39}]
["Test03","Armin Kaasik","2019-11-26T21:18:07.589",25]
["Test01","Carmen Sõrmus","2019-11-07T23:21:50.674",98]
["Test02","Emili Loorits","2019-11-26T11:52:17.239",54]
["Test04","Robert Lentso","2019-11-07T17:20:58.418",87]
["Test02","Markus Niidas","2019-11-06T18:07:48.997",79]
["Test01","Martin Aavik","2019-11-08T08:53:54.525",58]
["Test02","Hans Kukk","2019-11-29T14:46:04.745",66]
["Test04","Anette Lepp","2019-11-20T11:56:58.419",96]
["Test04","Rasmus Kroon","2019-11-18T08:17:58.139",60]
["Test02","Kertu Heinsoo","2019-11-28T19:28:13.630",82]
["Test04","Kristina Merila","2019-11-04T10:23:28.784",42]
["Test01","Viktoria Lumi","2019-11-02T19:41:36.366",48]
["Test02","Jana Kiisk","2019-11-26T19:22:31.855",92]
["Test02","Jana Kiisk","2019-11-22T20:22:31.569",23]
["Test03","Emili Loorits","2019-11-14T22:13:43.293",99]
["Test04","Jana Kiisk","2019-11-10T19:42:56.469",37]
["Test02","Martin Aavik","2019-11-28T21:04:55.377",27]
["Test02","Egert Vint","2019-11-16T20:03:00.457",32]
["Test04","Artur Piiri","2019-11-06T09:54:31.779",29]
["Test01","Anette Lepp","2019-11-27T18:10:28.098",53]
["Test02","Hanna Laid","2019-11-27T10:27:15.831",35]
["Test02","Alari Suur","2019-11-21T19:00:14.296",85]
["Test03","Getlin Allas","2019-11-26T20:14:00.511",53]
["Test03","Martin Aavik","2019-11-25T08:59:07.155",55]
["Test01","Tarvo Järv","2019-11-12T22:18:41.060",37]
["Test01","Kertu Heinsoo","2019-11-23T09:38:16.399",69]
["Test02","Robert Lentso","2019-11-23T11:07:45.180",65]
["Test04","Alari Suur","2019-11-21T14:27:53.471",42]
["Test02","Alari Suur","2019-11-19T08:01:58.473",51]
["Test03","Rasmus Kroon","2019-11-01T18:33:16.013",97]
["Test03","Karin Saar","2019-11-27T16:01:47.787",63]
["Test03","Urmas Lõhmus","2019-11-15T21:49:21.199",26]
["Test01","Urmas Lõhmus","2019-11-19T20:51:48.786",47]
["Test02","Kristina Merila","2019-11-27T22:35:15.274",25]
["Test04","Kaspar Raude","2019-11-16T20:32:18.070",49]
["Test01","Getlin Allas","2019-11-09T15:55:24.614",47]
["Test02","Mihkel Kulp","2019-11-03T10:56:31.368",36]
["Test02","Hanna Laid","2019-11-10T18:16:56.736",67]
["Test04","Anette Lepp","2019-11-10T11:17:12.060",76]
["Test04","Jana Kiisk","2019-11-16T18:05:04.349",85]
["Test03","Armin Kaasik","2019-11-10T13:54:39.442",89]
["Test02","Brita Kaljula","2019-11-30T18:44:05.730",44]
["Test04","Sander Kell","2019-11-21T21:07:04.369",64]
["Test02","Erik Pärn","2019-11-01T13:01:10.357",88]
["Test03","Urmas Lõhmus","2019-11-12T08:30:06.910",20]
["Test04","Kaspar Raude","2019-11-29T23:32:06.732",71]
["Test04","Viktoria Lumi","2019-11-27T15:58:51.111",71]
["Test04","Markus Niidas","2019-11-28T08:56:00.393",46]
["Test01","Anette Lepp","2019-11-10T17:08:24.764",30]
["Test01","Artur Piiri","2019-11-11T14:33:55.937",36]
["Test01","Urmas Lõhmus","2019-11-14T08:25:04.865",64]
["Test01","Markus Niidas","2019-11-11T18:53:06.217",90]
["Test01","Kristina Merila","2019-11-18T11:27:21.600",51]
["Test04","Urmas Lõhmus","2019-11-06T23:18:59.724",65]
["Test03","Martin Aavik","2019-11-29T12:14:56.958",75]
["Test03","Anna Koel","2019-11-12T09:07:56.304",49]
["Test01","Reimo Kala","2019-11-13T20:43:52.927",39]
["Test01","Alari Suur","2019-11-27T19:45:13.987",75]
["Test01","Brita Kaljula","2019-11-13T21:59:34.383",52]
["Test03","Egert Vint","2019-11-01T11:59:53.451",53]
["Test01","Reimo Kala","2019-11-05T15:49:13.314",64]
["Test02","Artur Piiri","2019-11-21T15:56:24.130",52]
["Test03","Kaspar Raude","2019-11-01T08:16:51.139",82]
[{"$f":"INDEX($G$4:$G$7,RANDBETWEEN(1,4))","v":"Test04"},{"$f":"INDEX($I$2:$I$36,RANDBETWEEN(1,35))","v":"Alari Suur"},{"$f":"RANDBETWEEN($F$2,$G$2)+$F$1+RAND()*($G$1-$F$1)","v":"2019-11-12T08:43:24.595"},{"$f":"RANDBETWEEN(20,100)","v":42}]
["Test04","Maarja Pihlak","2019-11-23T21:54:35.173",64]
["Test01","Hans Kukk","2019-11-08T22:43:02.643",54]
["Test04","Katrin Laurits","2019-11-13T23:30:29.389",48]
["Test04","Mihkel Kulp","2019-11-02T15:32:11.473",45]
["Test04","Kristina Merila","2019-11-08T12:43:31.454",25]
["Test04","Lauri Vahtra","2019-11-05T19:14:41.820",85]
["Test03","Katrin Laurits","2019-11-07T16:42:27.706",23]
["Test03","Kaspar Raude","2019-11-26T23:37:40.646",43]
["Test03","Joonas Haljas","2019-11-29T19:48:05.296",39]
["Test01","Brita Kaljula","2019-11-11T21:53:24.433",80]
["Test04","Kaspar Raude","2019-11-13T10:04:13.435",68]
["Test01","Lauri Vahtra","2019-11-17T13:01:23.094",88]
["Test02","Lauri Vahtra","2019-11-24T21:57:33.437",69]
["Test02","Getlin Allas","2019-11-03T21:21:05.026",97]
["Test03","Anna Koel","2019-11-15T12:59:12.143",42]
["Test03","Urmas Lõhmus","2019-11-10T21:59:13.698",39]
["Test01","Kaspar Raude","2019-11-29T13:41:43.826",88]
["Test01","Erik Pärn","2019-11-07T17:37:18.534",83]
["Test02","Egert Vint","2019-11-16T15:42:56.096",87]
["Test04","Rasmus Kroon","2019-11-14T14:07:50.271",33]
["Test02","Artur Piiri","2019-11-19T12:36:55.902",63]
["Test02","Markus Niidas","2019-11-17T23:45:17.138",78]
["Test03","Egert Vint","2019-11-09T14:57:26.647",71]
["Test02","Anna Koel","2019-11-13T09:22:18.131",54]
["Test04","Katrin Laurits","2019-11-29T15:01:05.366",70]
["Test01","Lauri Vahtra","2019-11-25T18:25:19.265",60]
["Test01","Erik Pärn","2019-11-12T13:11:19.210",29]
["Test02","Tarvo Järv","2019-11-14T23:01:11.434",61]
["Test02","Hanna Laid","2019-11-18T18:42:56.104",60]
["Test02","Maarja Pihlak","2019-11-12T23:10:22.213",45]
["Test01","Artur Piiri","2019-11-29T11:36:34.680",69]
["Test01","Lauri Vahtra","2019-11-13T18:06:22.728",66]
["Test02","Robert Lentso","2019-11-28T09:01:12.591",58]
["Test04","Hanna Laid","2019-11-15T08:19:47.995",54]
["Test03","Kristina Merila","2019-11-30T19:42:02.808",42]
["Test04","Getlin Allas","2019-11-15T19:17:03.730",23]
["Test03","Armin Kaasik","2019-11-27T20:43:20.688",23]
["Test03","Markus Niidas","2019-11-14T17:46:26.914",81]
["Test02","Martin Aavik","2019-11-02T22:09:20.882",66]
["Test02","Sander Kell","2019-11-17T08:08:00.359",87]
["Test01","Jaagup Kivi","2019-11-03T22:51:34.299",93]
["Test01","Carmen Sõrmus","2019-11-06T12:51:06.885",58]
["Test02","Martin Aavik","2019-11-20T23:41:10.437",87]
["Test03","Kaspar Raude","2019-11-02T19:34:05.426",25]
["Test01","Martin Aavik","2019-11-02T12:21:35.141",24]
["Test02","Emili Loorits","2019-11-06T21:54:46.136",96]
["Test04","Viktoria Lumi","2019-11-15T12:30:03.058",33]
["Test04","Robert Lentso","2019-11-29T17:23:36.392",27]
["Test04","Markus Niidas","2019-11-30T09:52:46.175",90]
["Test02","Kertu Heinsoo","2019-11-22T11:04:10.923",78]
["Test02","Kertu Heinsoo","2019-11-25T13:05:05.199",46]
["Test03","Jana Kiisk","2019-11-26T17:53:34.078",29]
["Test04","Lauri Vahtra","2019-11-16T20:17:59.307",21]
["Test03","Alari Suur","2019-11-25T23:26:00.245",32]
["Test03","Armin Kaasik","2019-11-13T17:30:28.804",29]
["Test02","Tarvo Järv","2019-11-10T17:00:42.663",99]
["Test04","Maarja Pihlak","2019-11-17T22:10:29.963",31]
["Test01","Anette Lepp","2019-11-07T17:25:55.242",88]
["Test03","Paul Hein","2019-11-01T18:28:57.802",73]
["Test01","Paul Hein","2019-11-04T16:21:01.569",43]
["Test04","Alari Suur","2019-11-29T22:33:13.919",65]
["Test04","Sander Kell","2019-11-14T11:09:50.771",42]
["Test04","Artur Piiri","2019-11-22T20:00:58.536",85]
[{"$f":"INDEX($G$4:$G$7,RANDBETWEEN(1,4))","v":"Test02"},{"$f":"INDEX($I$2:$I$36,RANDBETWEEN(1,35))","v":"Markus Niidas"},{"$f":"RANDBETWEEN($F$2,$G$2)+$F$1+RAND()*($G$1-$F$1)","v":"2019-11-03T22:45:14.934"},{"$f":"RANDBETWEEN(20,100)","v":29}]
["Test04","Jaagup Kivi","2019-11-03T18:01:50.364",35]
["Test01","Anna Koel","2019-11-23T15:04:13.895",51]
["Test03","Kristina Merila","2019-11-07T15:16:43.410",22]
["Test03","Diana Taal","2019-11-08T14:52:08.368",68]
["Test02","Erik Pärn","2019-11-08T11:48:10.521",64]
["Test01","Viktoria Lumi","2019-11-29T11:54:38.221",26]
["Test02","Anette Lepp","2019-11-29T11:54:08.705",27]
["Test01","Alari Suur","2019-11-06T22:42:20.408",82]
["Test04","Carmen Sõrmus","2019-11-26T09:48:47.559",37]
["Test03","Katrin Laurits","2019-11-18T17:43:48.039",79]
["Test01","Alari Suur","2019-11-28T21:41:40.669",73]
["Test04","Emili Loorits","2019-11-09T12:20:18.215",37]
["Test04","Diana Taal","2019-11-10T22:52:14.310",58]
["Test03","Joonas Haljas","2019-11-26T15:05:07.166",62]
["Test02","Martin Aavik","2019-11-19T20:20:44.307",75]
["Test01","Hanna Laid","2019-11-22T18:51:47.969",89]
["Test02","Lauri Vahtra","2019-11-16T20:31:05.428",66]
["Test02","Martin Aavik","2019-11-24T21:29:10.036",57]
["Test04","Hans Kukk","2019-11-16T13:57:29.768",72]
["Test01","Carmen Sõrmus","2019-11-06T09:40:41.277",68]
["Test03","Robert Lentso","2019-11-19T22:15:47.627",81]
["Test03","Martin Aavik","2019-11-25T19:40:20.224",38]
["Test01","Karin Saar","2019-11-30T16:32:51.851",50]
["Test04","Tarvo Järv","2019-11-27T23:10:02.854",74]
["Test02","Katrin Laurits","2019-11-17T12:35:34.707",85]
["Test01","Lauri Vahtra","2019-11-22T13:48:43.438",51]
["Test02","Anette Lepp","2019-11-10T08:43:35.564",31]
["Test03","Maarja Pihlak","2019-11-30T12:31:11.077",38]
["Test01","Viktoria Lumi","2019-11-26T20:25:27.632",62]
["Test02","Hanna Laid","2019-11-29T09:18:14.633",60]
["Test04","Kertu Heinsoo","2019-11-13T12:35:06.267",75]
["Test02","Jaagup Kivi","2019-11-10T19:00:07.680",23]
["Test01","Mihkel Kulp","2019-11-27T08:42:08.774",43]
["Test02","Brita Kaljula","2019-11-01T22:56:32.664",89]
["Test01","Martin Aavik","2019-11-27T12:44:50.508",25]
["Test03","Lauri Vahtra","2019-11-22T18:05:28.444",24]
["Test02","Paul Hein","2019-11-24T11:10:35.847",80]
["Test03","Artur Piiri","2019-11-18T23:04:17.876",100]
["Test03","Paul Hein","2019-11-17T10:52:22.308",84]
["Test03","Rasmus Kroon","2019-11-15T10:33:53.525",50]
["Test03","Hans Kukk","2019-11-23T12:20:27.533",47]
["Test03","Mihkel Kulp","2019-11-09T21:51:48.744",66]
["Test01","Hanna Laid","2019-11-18T11:38:40.079",79]
["Test04","Viktoria Lumi","2019-11-07T21:57:50.739",27]
["Test04","Brita Kaljula","2019-11-29T14:21:25.415",57]
["Test02","Anette Lepp","2019-11-23T10:53:42.090",78]
["Test01","Jaagup Kivi","2019-11-03T12:50:32.730",92]
["Test01","Anette Lepp","2019-11-01T23:03:41.670",24]
["Test02","Egert Vint","2019-11-25T15:33:37.756",80]
["Test02","Rasmus Kroon","2019-11-09T18:24:52.024",35]
["Test03","Reimo Kala","2019-11-03T18:29:07.945",67]
["Test02","Joonas Haljas","2019-11-12T14:22:53.409",74]
["Test02","Tarvo Järv","2019-11-05T18:28:44.638",61]
["Test01","Rasmus Kroon","2019-11-12T10:27:47.565",21]
["Test01","Paul Hein","2019-11-13T18:08:37.041",90]
["Test01","Joonas Haljas","2019-11-06T17:19:27.361",45]
["Test02","Egert Vint","2019-11-05T23:42:09.628",97]
["Test04","Artur Piiri","2019-11-03T14:31:15.362",67]
["Test04","Robert Lentso","2019-11-27T19:49:04.254",53]
["Test02","Robert Lentso","2019-11-10T08:33:08.559",86]
["Test04","Martin Aavik","2019-11-22T20:16:05.471",20]
["Test01","Robert Lentso","2019-11-23T18:53:34.924",86]
["Test01","Kristina Merila","2019-11-29T11:57:01.712",37]
[{"$f":"INDEX($G$4:$G$7,RANDBETWEEN(1,4))","v":"Test01"},{"$f":"INDEX($I$2:$I$36,RANDBETWEEN(1,35))","v":"Martin Aavik"},{"$f":"RANDBETWEEN($F$2,$G$2)+$F$1+RAND()*($G$1-$F$1)","v":"2019-11-11T13:03:46.920"},{"$f":"RANDBETWEEN(20,100)","v":97}]
["Test04","Egert Vint","2019-11-24T20:46:36.279",36]
["Test03","Martin Aavik","2019-11-12T12:00:04.782",61]
["Test04","Kaspar Raude","2019-11-06T12:25:10.036",66]
["Test03","Reimo Kala","2019-11-13T11:40:58.098",65]
["Test03","Artur Piiri","2019-11-02T15:45:37.765",43]
["Test03","Rasmus Kroon","2019-11-12T23:21:01.506",38]
["Test03","Paul Hein","2019-11-25T16:12:18.057",62]
["Test02","Kaspar Raude","2019-11-13T12:30:57.186",40]
["Test01","Emili Loorits","2019-11-20T18:40:35.078",25]
["Test03","Brita Kaljula","2019-11-01T19:05:33.024",22]
["Test04","Hanna Laid","2019-11-29T21:29:03.591",54]
["Test02","Kristina Merila","2019-11-25T17:47:41.570",28]
["Test03","Diana Taal","2019-11-10T19:41:08.005",28]
["Test04","Viktoria Lumi","2019-11-27T20:28:00.314",83]
["Test04","Anette Lepp","2019-11-11T19:19:53.348",39]
["Test01","Kaspar Raude","2019-11-04T08:48:01.673",24]
["Test02","Hans Kukk","2019-11-17T23:14:10.978",38]
["Test01","Jaagup Kivi","2019-11-25T21:02:20.822",99]
["Test02","Jaagup Kivi","2019-11-06T21:19:40.270",45]
["Test04","Carmen Sõrmus","2019-11-27T19:00:00.666",59]
["Test04","Jana Kiisk","2019-11-15T10:08:01.228",53]
["Test01","Tarvo Järv","2019-11-06T16:42:03.094",49]
["Test04","Anette Lepp","2019-11-30T22:56:42.847",92]
["Test02","Joonas Haljas","2019-11-07T10:46:47.844",33]
["Test01","Kertu Heinsoo","2019-11-21T20:17:17.338",25]
["Test01","Kristina Merila","2019-11-21T17:36:38.140",87]
["Test02","Kaspar Raude","2019-11-25T08:36:00.802",55]
["Test01","Alari Suur","2019-11-03T13:46:23.113",86]
["Test04","Mihkel Kulp","2019-11-17T20:39:56.340",29]
["Test02","Emili Loorits","2019-11-19T23:46:59.716",91]
["Test01","Anna Koel","2019-11-13T13:16:23.119",67]
["Test01","Anette Lepp","2019-11-25T14:01:57.450",61]
["Test02","Armin Kaasik","2019-11-27T19:46:20.386",90]
["Test03","Martin Aavik","2019-11-04T12:34:46.423",86]
["Test03","Kertu Heinsoo","2019-11-11T16:57:41.246",85]
["Test03","Armin Kaasik","2019-11-22T21:20:19.772",39]
["Test04","Robert Lentso","2019-11-01T18:58:17.951",29]
["Test01","Kertu Heinsoo","2019-11-08T17:09:34.431",50]
["Test04","Katrin Laurits","2019-11-13T08:59:09.879",56]
["Test01","Armin Kaasik","2019-11-12T13:42:45.204",89]
["Test02","Anna Koel","2019-11-02T17:15:50.716",78]
["Test03","Jaagup Kivi","2019-11-26T18:59:51.296",33]
["Test01","Hans Kukk","2019-11-26T11:42:58.143",35]
["Test04","Kaspar Raude","2019-11-28T11:20:46.051",42]
["Test02","Emili Loorits","2019-11-18T18:12:17.367",55]
["Test03","Joonas Haljas","2019-11-15T12:12:53.899",95]
["Test02","Alari Suur","2019-11-22T10:40:40.905",56]
["Test01","Diana Taal","2019-11-03T12:10:07.296",30]
["Test03","Katrin Laurits","2019-11-16T16:10:13.567",44]
["Test01","Armin Kaasik","2019-11-24T16:01:18.915",90]
["Test02","Tarvo Järv","2019-11-01T09:29:56.160",76]
["Test04","Katrin Laurits","2019-11-16T21:24:58.657",38]
["Test01","Mihkel Kulp","2019-11-23T09:55:52.148",74]
["Test01","Anna Koel","2019-11-23T14:00:07.320",53]
["Test01","Lauri Vahtra","2019-11-10T20:18:19.566",47]
["Test04","Kertu Heinsoo","2019-11-05T16:20:55.691",40]
["Test03","Alari Suur","2019-11-02T19:47:07.529",36]
["Test04","Kristina Merila","2019-11-24T12:27:25.536",27]
["Test04","Maarja Pihlak","2019-11-16T19:53:52.768",74]
["Test01","Tarvo Järv","2019-11-02T15:36:30.645",34]
["Test01","Brita Kaljula","2019-11-30T14:22:45.790",87]
["Test03","Erik Pärn","2019-11-22T23:28:17.859",64]
["Test02","Jaagup Kivi","2019-11-04T12:21:50.293",67]
[{"$f":"INDEX($G$4:$G$7,RANDBETWEEN(1,4))","v":"Test01"},{"$f":"INDEX($I$2:$I$36,RANDBETWEEN(1,35))","v":"Reimo Kala"},{"$f":"RANDBETWEEN($F$2,$G$2)+$F$1+RAND()*($G$1-$F$1)","v":"2019-11-19T18:51:08.875"},{"$f":"RANDBETWEEN(20,100)","v":99}]
["Test03","Jaagup Kivi","2019-11-17T20:12:02.682",20]
["Test01","Egert Vint","2019-11-19T13:12:31.314",28]
["Test01","Emili Loorits","2019-11-20T13:12:47.289",54]
["Test02","Mihkel Kulp","2019-11-17T12:48:21.894",53]
["Test02","Artur Piiri","2019-11-05T11:10:20.254",61]
["Test03","Anette Lepp","2019-11-08T14:39:20.295",95]
["Test03","Robert Lentso","2019-11-14T21:01:30.951",58]
["Test02","Karin Saar","2019-11-04T12:36:11.788",65]
["Test03","Armin Kaasik","2019-11-14T23:42:35.404",42]
["Test02","Anette Lepp","2019-11-17T10:38:25.545",51]
["Test04","Emili Loorits","2019-11-08T11:50:47.471",90]
["Test04","Erik Pärn","2019-11-18T22:56:12.069",43]
["Test02","Reimo Kala","2019-11-06T18:58:34.200",65]
["Test02","Sander Kell","2019-11-10T15:29:26.295",82]
["Test03","Urmas Lõhmus","2019-11-12T09:55:13.400",91]
["Test04","Alari Suur","2019-11-19T22:51:24.789",40]
["Test02","Paul Hein","2019-11-11T21:33:33.597",76]
["Test04","Armin Kaasik","2019-11-08T08:04:52.685",89]
["Test02","Martin Aavik","2019-11-05T19:17:49.385",84]
["Test04","Maarja Pihlak","2019-11-09T13:31:28.306",78]
["Test02","Lauri Vahtra","2019-11-24T15:13:49.182",99]
["Test03","Kertu Heinsoo","2019-11-29T17:21:54.987",92]
["Test01","Armin Kaasik","2019-11-18T21:38:28.496",49]
["Test01","Erik Pärn","2019-11-29T10:30:01.094",21]
["Test01","Brita Kaljula","2019-11-01T12:02:36.439",80]
["Test03","Mihkel Kulp","2019-11-08T17:37:22.444",44]
["Test03","Urmas Lõhmus","2019-11-27T09:37:43.206",40]
["Test02","Karin Saar","2019-11-30T14:44:00.822",71]
["Test01","Lauri Vahtra","2019-11-22T12:10:56.462",45]
["Test04","Urmas Lõhmus","2019-11-14T12:55:56.022",43]
["Test04","Urmas Lõhmus","2019-11-04T19:24:33.068",39]
["Test03","Karin Saar","2019-11-29T21:56:56.837",66]
["Test03","Alari Suur","2019-11-25T19:57:07.039",66]
["Test01","Carmen Sõrmus","2019-11-27T20:47:52.130",84]
["Test01","Emili Loorits","2019-11-03T22:59:09.140",30]
["Test04","Kertu Heinsoo","2019-11-22T09:20:03.376",63]
["Test02","Brita Kaljula","2019-11-30T12:19:42.334",91]
["Test03","Jana Kiisk","2019-11-08T16:59:07.245",82]
["Test02","Anna Koel","2019-11-16T08:45:02.328",76]
["Test02","Getlin Allas","2019-11-24T12:04:34.999",54]
["Test02","Katrin Laurits","2019-11-15T20:02:21.721",49]
["Test03","Jana Kiisk","2019-11-05T11:08:03.606",51]
["Test03","Tarvo Järv","2019-11-17T16:59:34.539",68]
["Test01","Markus Niidas","2019-11-25T22:29:56.632",28]
["Test04","Mihkel Kulp","2019-11-25T08:38:23.303",58]
["Test02","Emili Loorits","2019-11-07T12:01:21.144",38]
["Test02","Anna Koel","2019-11-01T20:56:29.307",97]
["Test04","Viktoria Lumi","2019-11-19T14:53:25.138",59]
["Test03","Carmen Sõrmus","2019-11-26T08:24:20.085",78]
["Test03","Kertu Heinsoo","2019-11-01T08:54:16.165",60]
["Test04","Kaspar Raude","2019-11-16T19:03:26.863",21]
["Test04","Brita Kaljula","2019-11-05T19:04:05.749",30]
["Test02","Egert Vint","2019-11-26T20:16:04.892",41]
["Test01","Urmas Lõhmus","2019-11-26T13:21:48.216",71]
["Test02","Emili Loorits","2019-11-04T19:51:43.635",41]
["Test01","Kaspar Raude","2019-11-10T17:02:30.958",77]
["Test02","Urmas Lõhmus","2019-11-09T15:16:45.936",61]
["Test01","Erik Pärn","2019-11-11T14:10:19.379",65]
["Test03","Artur Piiri","2019-11-23T09:13:44.086",60]
["Test03","Getlin Allas","2019-11-20T13:47:15.114",74]
["Test01","Viktoria Lumi","2019-11-21T17:06:12.326",60]
["Test02","Erik Pärn","2019-11-23T18:48:03.350",41]
["Test03","Viktoria Lumi","2019-11-28T19:34:25.149",91]
[{"$f":"INDEX($G$4:$G$7,RANDBETWEEN(1,4))","v":"Test04"},{"$f":"INDEX($I$2:$I$36,RANDBETWEEN(1,35))","v":"Egert Vint"},{"$f":"RANDBETWEEN($F$2,$G$2)+$F$1+RAND()*($G$1-$F$1)","v":"2019-11-09T18:29:39.420"},{"$f":"RANDBETWEEN(20,100)","v":34}]
["Test02","Urmas Lõhmus","2019-11-25T22:08:48.191",99]
["Test01","Brita Kaljula","2019-11-08T15:19:44.336",82]
["Test02","Markus Niidas","2019-11-01T18:42:57.461",62]
["Test04","Diana Taal","2019-11-23T17:44:24.459",92]
["Test01","Anette Lepp","2019-11-16T12:27:58.661",90]
["Test01","Hanna Laid","2019-11-25T23:36:06.401",96]
["Test03","Markus Niidas","2019-11-08T16:31:33.710",44]
["Test02","Artur Piiri","2019-11-19T08:18:59.571",72]
["Test03","Katrin Laurits","2019-11-14T15:42:23.515",70]
["Test02","Anette Lepp","2019-11-07T12:34:23.442",82]
["Test03","Getlin Allas","2019-11-25T18:03:48.671",95]
["Test04","Markus Niidas","2019-11-13T10:04:15.039",33]
["Test01","Reimo Kala","2019-11-21T14:03:37.259",74]
["Test04","Urmas Lõhmus","2019-11-03T11:07:12.411",59]
["Test03","Artur Piiri","2019-11-04T09:32:56.419",60]
["Test01","Alari Suur","2019-11-14T23:43:54.419",57]
["Test01","Kristina Merila","2019-11-05T17:44:27.498",51]
["Test04","Tarvo Järv","2019-11-06T22:21:00.281",71]
["Test02","Lauri Vahtra","2019-11-09T16:45:38.758",34]
["Test02","Alari Suur","2019-11-10T18:14:52.195",82]
["Test04","Urmas Lõhmus","2019-11-06T21:32:57.280",41]
["Test04","Jana Kiisk","2019-11-03T19:15:24.147",49]
["Test02","Kaspar Raude","2019-11-09T22:06:10.889",84]
["Test04","Kaspar Raude","2019-11-04T08:37:34.011",22]
["Test01","Armin Kaasik","2019-11-25T15:03:01.306",23]
["Test03","Kertu Heinsoo","2019-11-01T16:09:28.757",36]
["Test04","Mihkel Kulp","2019-11-16T15:26:12.710",68]
["Test03","Jana Kiisk","2019-11-09T19:23:17.884",26]
["Test04","Brita Kaljula","2019-11-18T23:02:23.431",70]
["Test01","Tarvo Järv","2019-11-25T13:14:00.353",26]
["Test03","Katrin Laurits","2019-11-05T13:03:55.269",50]
["Test03","Katrin Laurits","2019-11-14T20:43:31.068",61]
["Test03","Tarvo Järv","2019-11-23T19:26:19.630",73]
["Test03","Getlin Allas","2019-11-25T13:24:25.438",93]
["Test04","Armin Kaasik","2019-11-12T08:57:20.136",43]
["Test01","Anna Koel","2019-11-17T10:00:23.083",74]
["Test03","Artur Piiri","2019-11-11T18:59:07.669",57]
["Test02","Alari Suur","2019-11-23T15:14:23.682",25]
["Test04","Artur Piiri","2019-11-30T09:15:55.838",88]
["Test01","Kaspar Raude","2019-11-22T12:23:07.825",87]
["Test02","Kertu Heinsoo","2019-11-12T11:42:53.703",89]
["Test03","Katrin Laurits","2019-11-27T14:19:07.941",34]
["Test01","Kaspar Raude","2019-11-15T19:43:15.442",67]
["Test01","Katrin Laurits","2019-11-03T16:50:02.442",87]
["Test01","Reimo Kala","2019-11-18T17:14:06.508",50]
["Test04","Viktoria Lumi","2019-11-27T20:44:37.889",32]
["Test01","Anette Lepp","2019-11-08T11:29:54.422",45]
["Test03","Emili Loorits","2019-11-20T17:34:03.782",39]
["Test02","Diana Taal","2019-11-23T11:49:41.084",55]
["Test03","Karin Saar","2019-11-16T17:54:20.213",86]
["Test01","Paul Hein","2019-11-14T17:00:31.619",67]
["Test02","Katrin Laurits","2019-11-04T22:30:15.702",65]
["Test03","Mihkel Kulp","2019-11-16T20:49:50.946",48]
["Test03","Lauri Vahtra","2019-11-14T12:04:58.153",55]
["Test01","Anette Lepp","2019-11-06T16:59:49.243",41]
["Test02","Jana Kiisk","2019-11-07T21:22:16.785",89]
["Test01","Kaspar Raude","2019-11-16T23:00:05.006",24]
["Test03","Getlin Allas","2019-11-29T12:49:44.595",60]
["Test01","Robert Lentso","2019-11-09T09:19:27.833",86]
["Test03","Maarja Pihlak","2019-11-20T16:26:27.157",71]
["Test03","Karin Saar","2019-11-10T11:10:04.949",93]
["Test04","Robert Lentso","2019-11-14T09:22:28.501",68]
["Test02","Viktoria Lumi","2019-11-20T11:55:38.287",34]
[{"$f":"INDEX($G$4:$G$7,RANDBETWEEN(1,4))","v":"Test02"},{"$f":"INDEX($I$2:$I$36,RANDBETWEEN(1,35))","v":"Markus Niidas"},{"$f":"RANDBETWEEN($F$2,$G$2)+$F$1+RAND()*($G$1-$F$1)","v":"2019-11-27T23:46:11.821"},{"$f":"RANDBETWEEN(20,100)","v":29}]
["Test03","Kaspar Raude","2019-11-17T10:24:43.437",50]
["Test04","Urmas Lõhmus","2019-11-16T23:20:06.303",30]
["Test04","Tarvo Järv","2019-11-02T15:36:03.909",48]
["Test01","Lauri Vahtra","2019-11-13T20:56:48.891",25]
["Test04","Reimo Kala","2019-11-10T18:26:06.073",60]
["Test01","Kertu Heinsoo","2019-11-30T17:53:57.266",69]
["Test02","Robert Lentso","2019-11-24T13:30:27.792",81]
["Test04","Egert Vint","2019-11-15T22:46:10.355",84]
["Test02","Rasmus Kroon","2019-11-17T15:09:39.810",98]
["Test03","Robert Lentso","2019-11-17T18:23:13.375",59]
["Test02","Egert Vint","2019-11-07T13:45:14.552",44]
["Test01","Viktoria Lumi","2019-11-21T08:28:41.726",32]
["Test03","Karin Saar","2019-11-17T10:59:49.240",72]
["Test04","Martin Aavik","2019-11-02T17:49:12.386",85]
["Test02","Lauri Vahtra","2019-11-07T08:05:01.477",42]
["Test02","Artur Piiri","2019-11-04T19:18:30.834",96]
["Test01","Maarja Pihlak","2019-11-07T14:54:59.288",78]
["Test01","Paul Hein","2019-11-02T12:52:06.035",40]
["Test04","Jaagup Kivi","2019-11-22T12:57:20.776",24]
["Test03","Kristina Merila","2019-11-03T08:24:24.379",34]
["Test03","Viktoria Lumi","2019-11-14T18:51:41.709",90]
["Test03","Diana Taal","2019-11-17T09:57:00.756",55]
["Test01","Karin Saar","2019-11-19T12:23:14.298",87]
["Test04","Hanna Laid","2019-11-02T20:51:32.175",53]
["Test01","Paul Hein","2019-11-25T20:41:08.225",71]
["Test01","Carmen Sõrmus","2019-11-23T19:39:16.765",29]
["Test02","Kertu Heinsoo","2019-11-16T09:44:16.595",52]
["Test02","Viktoria Lumi","2019-11-10T20:58:23.235",56]
["Test01","Katrin Laurits","2019-11-17T14:39:43.781",79]
["Test02","Hans Kukk","2019-11-20T12:18:26.976",26]
["Test02","Jaagup Kivi","2019-11-27T18:57:13.129",39]
["Test02","Viktoria Lumi","2019-11-15T10:32:24.458",68]
["Test02","Kertu Heinsoo","2019-11-20T18:05:54.693",60]
["Test01","Katrin Laurits","2019-11-13T08:29:33.332",39]
["Test02","Mihkel Kulp","2019-11-29T13:16:38.741",26]
["Test01","Artur Piiri","2019-11-19T10:31:05.213",94]
["Test01","Robert Lentso","2019-11-01T17:18:21.999",76]
["Test01","Karin Saar","2019-11-22T13:31:28.828",23]
["Test01","Jana Kiisk","2019-11-04T20:28:50.457",74]
["Test03","Diana Taal","2019-11-02T18:00:30.044",73]
["Test01","Markus Niidas","2019-11-02T08:11:49.775",75]
["Test04","Mihkel Kulp","2019-11-20T08:51:01.359",28]
["Test02","Getlin Allas","2019-11-01T12:17:43.972",43]
["Test03","Markus Niidas","2019-11-24T19:29:52.234",87]
["Test02","Kertu Heinsoo","2019-11-21T08:42:13.549",81]
["Test04","Jana Kiisk","2019-11-06T16:29:23.134",82]
["Test02","Tarvo Järv","2019-11-17T14:16:36.854",58]
["Test01","Hanna Laid","2019-11-18T23:38:23.146",32]
["Test01","Markus Niidas","2019-11-11T10:46:44.948",66]
["Test01","Tarvo Järv","2019-11-01T23:31:47.339",60]
["Test01","Maarja Pihlak","2019-11-24T16:45:37.693",95]
["Test03","Erik Pärn","2019-11-03T15:55:54.368",50]
["Test01","Joonas Haljas","2019-11-04T20:36:23.684",23]
["Test02","Carmen Sõrmus","2019-11-08T21:54:43.239",34]
["Test01","Carmen Sõrmus","2019-11-24T21:07:52.001",79]
["Test01","Katrin Laurits","2019-11-17T11:14:32.550",38]
["Test02","Markus Niidas","2019-11-18T19:53:08.817",33]
["Test04","Rasmus Kroon","2019-11-18T22:33:17.035",76]
["Test04","Anette Lepp","2019-11-17T16:39:40.320",76]
["Test04","Katrin Laurits","2019-11-03T20:23:40.542",34]
["Test02","Kaspar Raude","2019-11-01T13:44:05.802",81]
["Test01","Brita Kaljula","2019-11-01T17:48:26.649",27]
["Test03","Martin Aavik","2019-11-03T21:39:36.323",24]
[{"$f":"INDEX($G$4:$G$7,RANDBETWEEN(1,4))","v":"Test04"},{"$f":"INDEX($I$2:$I$36,RANDBETWEEN(1,35))","v":"Jana Kiisk"},{"$f":"RANDBETWEEN($F$2,$G$2)+$F$1+RAND()*($G$1-$F$1)","v":"2019-11-09T19:23:04.872"},{"$f":"RANDBETWEEN(20,100)","v":46}]
["Test02","Armin Kaasik","2019-11-23T18:34:07.883",34]
["Test03","Hanna Laid","2019-11-30T17:28:34.315",82]
["Test01","Markus Niidas","2019-11-02T20:32:48.840",37]
["Test03","Emili Loorits","2019-11-17T14:15:49.393",72]
["Test04","Getlin Allas","2019-11-02T22:39:55.370",56]
["Test03","Katrin Laurits","2019-11-10T14:11:57.440",91]
["Test02","Armin Kaasik","2019-11-19T21:31:37.874",37]
["Test01","Reimo Kala","2019-11-26T20:35:44.829",80]
["Test03","Carmen Sõrmus","2019-11-21T23:12:42.174",37]
["Test04","Rasmus Kroon","2019-11-28T22:56:23.429",39]
["Test04","Karin Saar","2019-11-08T22:13:57.329",79]
["Test01","Kristina Merila","2019-11-03T10:20:41.308",75]
["Test01","Kaspar Raude","2019-11-05T22:35:00.814",26]
["Test01","Hanna Laid","2019-11-27T23:31:26.083",49]
["Test01","Kaspar Raude","2019-11-25T16:41:15.951",94]
["Test04","Reimo Kala","2019-11-22T22:52:49.683",77]
["Test03","Robert Lentso","2019-11-12T09:28:57.764",50]
["Test02","Lauri Vahtra","2019-11-09T16:09:30.947",69]
["Test03","Joonas Haljas","2019-11-12T08:09:05.010",85]
["Test04","Getlin Allas","2019-11-14T13:14:54.798",95]
["Test04","Kristina Merila","2019-11-22T11:13:09.550",21]
["Test01","Egert Vint","2019-11-14T22:30:13.856",67]
["Test04","Alari Suur","2019-11-12T17:01:19.695",86]
["Test02","Armin Kaasik","2019-11-04T11:38:34.119",75]
["Test01","Hanna Laid","2019-11-15T08:45:49.845",99]
["Test04","Joonas Haljas","2019-11-05T20:44:31.613",71]
["Test04","Sander Kell","2019-11-03T23:03:20.334",43]
["Test04","Carmen Sõrmus","2019-11-28T16:00:04.326",40]
["Test02","Anna Koel","2019-11-18T19:48:43.091",44]
["Test03","Paul Hein","2019-11-29T09:01:37.025",72]
["Test03","Markus Niidas","2019-11-25T11:47:37.897",61]
["Test04","Karin Saar","2019-11-28T18:09:33.961",64]
["Test02","Lauri Vahtra","2019-11-27T23:51:16.106",28]
["Test04","Robert Lentso","2019-11-02T20:42:38.076",27]
["Test02","Alari Suur","2019-11-30T08:02:36.672",22]
["Test04","Markus Niidas","2019-11-30T18:27:50.800",75]
["Test01","Katrin Laurits","2019-11-11T12:42:11.537",56]
["Test03","Alari Suur","2019-11-20T18:09:03.950",60]
["Test02","Egert Vint","2019-11-10T20:17:43.232",74]
["Test04","Diana Taal","2019-11-16T08:21:22.704",82]
["Test01","Erik Pärn","2019-11-21T08:22:46.670",34]
["Test01","Tarvo Järv","2019-11-28T22:07:56.420",84]
["Test04","Anette Lepp","2019-11-01T21:01:23.682",78]
["Test01","Brita Kaljula","2019-11-03T14:34:23.548",97]
["Test02","Carmen Sõrmus","2019-11-05T20:59:33.151",99]
["Test01","Emili Loorits","2019-11-01T22:38:10.857",33]
["Test02","Paul Hein","2019-11-05T16:50:45.216",46]
["Test01","Erik Pärn","2019-11-25T23:23:16.627",92]
["Test02","Armin Kaasik","2019-11-26T19:12:34.104",83]
["Test01","Markus Niidas","2019-11-22T09:53:03.751",77]
["Test03","Markus Niidas","2019-11-20T16:51:39.575",90]
["Test04","Anette Lepp","2019-11-22T10:39:51.106",75]
["Test04","Artur Piiri","2019-11-19T09:23:20.291",80]
["Test02","Viktoria Lumi","2019-11-23T12:19:11.436",30]
["Test02","Sander Kell","2019-11-23T21:48:55.865",36]
["Test03","Hans Kukk","2019-11-08T22:07:24.090",77]
["Test03","Armin Kaasik","2019-11-08T09:40:32.125",82]
["Test03","Lauri Vahtra","2019-11-22T22:25:26.690",51]
["Test04","Carmen Sõrmus","2019-11-20T13:37:49.045",26]
["Test01","Paul Hein","2019-11-12T15:32:32.153",89]
["Test04","Anette Lepp","2019-11-05T16:33:03.313",66]
["Test02","Kertu Heinsoo","2019-11-19T09:00:19.097",55]
["Test02","Urmas Lõhmus","2019-11-20T12:12:06.056",48]
[{"$f":"INDEX($G$4:$G$7,RANDBETWEEN(1,4))","v":"Test03"},{"$f":"INDEX($I$2:$I$36,RANDBETWEEN(1,35))","v":"Alari Suur"},{"$f":"RANDBETWEEN($F$2,$G$2)+$F$1+RAND()*($G$1-$F$1)","v":"2019-11-14T10:48:54.746"},{"$f":"RANDBETWEEN(20,100)","v":53}]
["Test03","Kaspar Raude","2019-11-23T17:51:38.429",67]
["Test03","Rasmus Kroon","2019-11-09T23:22:41.207",80]
["Test02","Jana Kiisk","2019-11-05T16:53:09.217",58]
["Test03","Kristina Merila","2019-11-08T21:19:20.064",70]
["Test02","Alari Suur","2019-11-15T12:54:09.345",73]
["Test02","Diana Taal","2019-11-03T10:08:28.991",23]
["Test02","Emili Loorits","2019-11-09T21:30:38.688",40]
["Test04","Kertu Heinsoo","2019-11-18T18:09:48.647",30]
["Test01","Martin Aavik","2019-11-19T15:25:11.148",70]
["Test03","Hans Kukk","2019-11-25T16:45:31.720",39]
["Test02","Kristina Merila","2019-11-20T19:38:37.391",64]
["Test02","Hanna Laid","2019-11-21T08:51:43.060",24]
["Test02","Jana Kiisk","2019-11-19T14:44:44.811",71]
["Test04","Katrin Laurits","2019-11-30T11:25:48.266",62]
["Test04","Brita Kaljula","2019-11-11T22:43:10.781",44]
["Test03","Viktoria Lumi","2019-11-09T18:17:49.582",52]
["Test04","Hanna Laid","2019-11-18T09:45:23.249",52]
["Test04","Carmen Sõrmus","2019-11-26T23:07:18.591",72]
["Test02","Brita Kaljula","2019-11-06T14:42:05.218",92]
["Test03","Tarvo Järv","2019-11-28T18:35:02.340",49]
["Test01","Artur Piiri","2019-11-15T15:40:30.748",63]
["Test04","Maarja Pihlak","2019-11-15T10:51:36.692",79]
["Test04","Getlin Allas","2019-11-01T09:02:00.351",85]
["Test03","Anette Lepp","2019-11-24T22:37:33.395",68]
["Test03","Martin Aavik","2019-11-03T15:33:36.499",34]
["Test02","Carmen Sõrmus","2019-11-28T19:19:16.339",81]
["Test01","Egert Vint","2019-11-08T16:03:19.719",46]
["Test04","Erik Pärn","2019-11-15T18:27:14.721",27]
["Test02","Robert Lentso","2019-11-26T18:56:02.450",26]
["Test01","Diana Taal","2019-11-05T12:12:16.193",83]
["Test01","Joonas Haljas","2019-11-09T12:14:27.974",78]
["Test02","Tarvo Järv","2019-11-29T20:56:15.664",76]
["Test03","Rasmus Kroon","2019-11-03T13:03:57.822",33]
["Test03","Artur Piiri","2019-11-20T09:41:48.055",66]
["Test02","Carmen Sõrmus","2019-11-08T14:09:31.858",30]
["Test02","Jana Kiisk","2019-11-21T18:35:31.361",24]
["Test01","Brita Kaljula","2019-11-21T21:57:02.100",70]
["Test02","Katrin Laurits","2019-11-08T20:37:04.187",86]
["Test02","Lauri Vahtra","2019-11-25T16:55:08.275",31]
["Test04","Maarja Pihlak","2019-11-06T11:26:07.298",28]
["Test03","Karin Saar","2019-11-30T20:51:40.692",39]
["Test04","Paul Hein","2019-11-01T11:07:52.257",83]
["Test03","Robert Lentso","2019-11-26T14:42:44.210",22]
["Test02","Maarja Pihlak","2019-11-05T11:26:18.300",89]
["Test04","Anna Koel","2019-11-28T08:05:54.369",72]
["Test04","Paul Hein","2019-11-24T22:08:57.966",69]
["Test01","Lauri Vahtra","2019-11-07T18:28:26.241",92]
["Test01","Egert Vint","2019-11-15T21:41:42.543",55]
["Test04","Erik Pärn","2019-11-06T21:04:27.967",34]
["Test03","Rasmus Kroon","2019-11-04T20:55:13.327",70]
["Test03","Lauri Vahtra","2019-11-25T19:22:30.514",82]
["Test01","Urmas Lõhmus","2019-11-13T14:24:24.783",61]
["Test02","Hanna Laid","2019-11-16T23:25:18.556",26]
["Test04","Kertu Heinsoo","2019-11-01T16:26:01.224",26]
["Test02","Rasmus Kroon","2019-11-09T15:43:13.469",36]
["Test03","Egert Vint","2019-11-11T19:03:46.631",31]
["Test04","Sander Kell","2019-11-27T15:55:34.440",70]
["Test04","Paul Hein","2019-11-13T09:55:02.082",80]
["Test02","Hans Kukk","2019-11-19T10:00:54.782",73]
["Test01","Markus Niidas","2019-11-04T12:28:11.365",75]
["Test02","Erik Pärn","2019-11-24T17:11:52.819",36]
["Test03","Jaagup Kivi","2019-11-29T19:55:12.929",81]
["Test02","Diana Taal","2019-11-04T11:40:09.708",63]
[{"$f":"INDEX($G$4:$G$7,RANDBETWEEN(1,4))","v":"Test03"},{"$f":"INDEX($I$2:$I$36,RANDBETWEEN(1,35))","v":"Sander Kell"},{"$f":"RANDBETWEEN($F$2,$G$2)+$F$1+RAND()*($G$1-$F$1)","v":"2019-11-21T22:18:41.115"},{"$f":"RANDBETWEEN(20,100)","v":20}]
["Test04","Mihkel Kulp","2019-11-01T15:41:21.464",90]
["Test01","Anette Lepp","2019-11-10T19:48:41.161",36]
["Test01","Maarja Pihlak","2019-11-14T16:03:22.798",91]
["Test03","Reimo Kala","2019-11-25T10:19:48.300",54]
["Test04","Brita Kaljula","2019-11-15T14:23:24.567",43]
["Test01","Paul Hein","2019-11-21T19:09:14.686",62]
["Test03","Kristina Merila","2019-11-12T09:49:39.388",56]
["Test01","Hans Kukk","2019-11-23T09:20:56.628",66]
["Test04","Robert Lentso","2019-11-19T08:28:28.664",63]
["Test01","Hanna Laid","2019-11-30T08:23:30.732",84]
["Test02","Viktoria Lumi","2019-11-12T14:48:12.874",62]
["Test01","Jaagup Kivi","2019-11-16T19:39:16.946",56]
["Test04","Martin Aavik","2019-11-29T09:55:54.139",87]
["Test04","Karin Saar","2019-11-11T19:45:28.329",90]
["Test04","Joonas Haljas","2019-11-17T22:02:50.052",54]
["Test04","Urmas Lõhmus","2019-11-14T17:27:56.101",83]
["Test02","Martin Aavik","2019-11-04T11:47:48.103",66]
["Test01","Kertu Heinsoo","2019-11-20T19:41:46.467",60]
["Test04","Kristina Merila","2019-11-08T10:18:11.097",61]
["Test01","Kertu Heinsoo","2019-11-06T08:01:01.510",85]
["Test01","Artur Piiri","2019-11-09T16:30:23.651",90]
["Test03","Joonas Haljas","2019-11-10T16:00:00.800",97]
["Test04","Carmen Sõrmus","2019-11-26T18:40:07.933",49]
["Test01","Martin Aavik","2019-11-13T10:30:37.990",48]
["Test04","Diana Taal","2019-11-24T10:57:48.695",23]
["Test04","Erik Pärn","2019-11-22T15:26:13.798",57]
["Test04","Sander Kell","2019-11-22T22:20:42.209",84]
["Test03","Katrin Laurits","2019-11-18T12:07:09.104",78]
["Test01","Alari Suur","2019-11-24T20:51:11.535",27]
["Test03","Carmen Sõrmus","2019-11-16T14:22:48.832",38]
["Test01","Tarvo Järv","2019-11-19T12:12:03.257",93]
["Test03","Getlin Allas","2019-11-10T14:09:51.073",96]
["Test04","Reimo Kala","2019-11-08T22:23:45.682",53]
["Test02","Kertu Heinsoo","2019-11-24T15:48:11.494",37]
["Test03","Alari Suur","2019-11-24T23:39:20.251",98]
["Test02","Markus Niidas","2019-11-01T14:21:52.556",98]
["Test03","Artur Piiri","2019-11-25T22:55:20.071",91]
["Test04","Rasmus Kroon","2019-11-29T12:07:23.669",71]
["Test02","Rasmus Kroon","2019-11-22T09:35:10.527",36]
["Test03","Kristina Merila","2019-11-24T10:23:59.149",70]
["Test01","Armin Kaasik","2019-11-28T22:40:55.990",48]
["Test04","Reimo Kala","2019-11-08T13:41:56.621",84]
["Test04","Joonas Haljas","2019-11-17T15:00:14.506",98]
["Test01","Armin Kaasik","2019-11-03T16:53:03.435",72]
["Test03","Egert Vint","2019-11-20T21:40:33.717",55]
["Test03","Jaagup Kivi","2019-11-13T14:14:17.360",71]
["Test03","Katrin Laurits","2019-11-21T12:41:49.233",37]
["Test01","Diana Taal","2019-11-18T19:55:13.566",67]
["Test02","Hanna Laid","2019-11-20T12:10:07.998",33]
["Test01","Kertu Heinsoo","2019-11-08T20:55:36.850",88]
["Test04","Erik Pärn","2019-11-15T14:55:15.311",87]
["Test01","Anna Koel","2019-11-04T09:26:54.092",98]
["Test03","Brita Kaljula","2019-11-10T15:18:20.042",33]
["Test01","Rasmus Kroon","2019-11-22T16:09:18.292",22]
["Test02","Hanna Laid","2019-11-22T19:27:35.407",55]
["Test04","Anna Koel","2019-11-27T22:04:03.342",31]
["Test02","Viktoria Lumi","2019-11-27T14:14:24.675",35]
["Test03","Paul Hein","2019-11-01T22:57:11.688",80]
["Test04","Alari Suur","2019-11-04T23:35:58.569",67]
["Test01","Armin Kaasik","2019-11-04T15:31:27.828",89]
["Test02","Kaspar Raude","2019-11-07T19:07:28.999",78]
["Test03","Erik Pärn","2019-11-29T15:26:43.691",43]
["Test03","Lauri Vahtra","2019-11-14T14:43:48.380",80]
[{"$f":"INDEX($G$4:$G$7,RANDBETWEEN(1,4))","v":"Test01"},{"$f":"INDEX($I$2:$I$36,RANDBETWEEN(1,35))","v":"Robert Lentso"},{"$f":"RANDBETWEEN($F$2,$G$2)+$F$1+RAND()*($G$1-$F$1)","v":"2019-11-11T21:21:27.035"},{"$f":"RANDBETWEEN(20,100)","v":23}]
["Test02","Markus Niidas","2019-11-30T13:58:18.703",75]
["Test01","Viktoria Lumi","2019-11-26T23:38:07.459",71]
["Test03","Carmen Sõrmus","2019-11-03T11:37:29.875",99]
["Test03","Egert Vint","2019-11-25T10:34:34.937",76]
["Test02","Markus Niidas","2019-11-04T18:03:42.610",43]
["Test04","Alari Suur","2019-11-04T11:20:35.746",88]
["Test02","Brita Kaljula","2019-11-13T19:30:17.308",61]
["Test02","Reimo Kala","2019-11-30T17:06:46.412",96]
["Test03","Kaspar Raude","2019-11-07T09:56:12.153",92]
["Test03","Tarvo Järv","2019-11-13T13:10:24.044",69]
["Test03","Kristina Merila","2019-11-15T16:27:54.638",78]
["Test01","Kristina Merila","2019-11-10T21:01:15.467",41]
["Test02","Jana Kiisk","2019-11-11T20:40:11.519",37]
["Test03","Markus Niidas","2019-11-04T14:49:27.732",90]
["Test02","Erik Pärn","2019-11-26T23:04:45.817",28]
["Test02","Joonas Haljas","2019-11-13T13:22:52.227",42]
["Test02","Jana Kiisk","2019-11-01T09:25:43.022",44]
["Test02","Brita Kaljula","2019-11-04T20:42:28.505",46]
["Test04","Brita Kaljula","2019-11-04T14:39:23.610",47]
["Test02","Mihkel Kulp","2019-11-24T12:52:58.118",43]
["Test03","Urmas Lõhmus","2019-11-12T19:20:53.139",59]
["Test02","Joonas Haljas","2019-11-27T13:47:28.990",92]
["Test04","Rasmus Kroon","2019-11-23T09:39:23.752",23]
["Test04","Jana Kiisk","2019-11-26T23:25:51.550",44]
["Test04","Paul Hein","2019-11-01T19:27:28.652",51]
["Test03","Markus Niidas","2019-11-13T14:32:00.643",35]
["Test04","Maarja Pihlak","2019-11-03T17:56:21.029",94]
["Test04","Hanna Laid","2019-11-18T16:52:45.595",72]
["Test01","Markus Niidas","2019-11-13T14:13:52.179",24]
["Test02","Hans Kukk","2019-11-24T12:38:03.777",67]
["Test02","Joonas Haljas","2019-11-24T08:57:14.848",26]
["Test02","Emili Loorits","2019-11-28T09:16:16.514",43]
["Test04","Hans Kukk","2019-11-21T18:44:46.053",77]
["Test01","Anette Lepp","2019-11-26T11:35:37.305",83]
["Test01","Martin Aavik","2019-11-29T15:30:51.471",65]
["Test02","Martin Aavik","2019-11-08T21:08:48.145",67]
["Test01","Viktoria Lumi","2019-11-25T16:33:37.931",69]
["Test03","Robert Lentso","2019-11-19T20:53:32.540",51]
["Test03","Lauri Vahtra","2019-11-01T17:46:07.241",46]
["Test03","Martin Aavik","2019-11-10T14:39:04.936",98]
["Test04","Jaagup Kivi","2019-11-19T08:05:17.422",89]
["Test02","Tarvo Järv","2019-11-13T19:36:07.182",98]
["Test04","Hans Kukk","2019-11-21T15:31:19.736",24]
["Test03","Reimo Kala","2019-11-10T21:19:43.684",32]
["Test03","Erik Pärn","2019-11-19T15:02:47.110",83]
["Test02","Viktoria Lumi","2019-11-08T19:46:04.856",49]
["Test04","Emili Loorits","2019-11-27T20:12:49.872",35]
["Test04","Carmen Sõrmus","2019-11-29T21:47:36.383",86]
["Test01","Karin Saar","2019-11-09T13:43:20.352",53]
["Test04","Rasmus Kroon","2019-11-06T23:46:01.887",26]
["Test03","Urmas Lõhmus","2019-11-01T09:05:43.057",26]
["Test01","Egert Vint","2019-11-02T10:36:11.155",89]
["Test02","Joonas Haljas","2019-11-20T12:23:05.622",87]
["Test04","Alari Suur","2019-11-26T19:36:24.037",51]
["Test04","Rasmus Kroon","2019-11-18T18:49:25.407",20]
["Test01","Urmas Lõhmus","2019-11-13T17:56:01.784",81]
["Test01","Brita Kaljula","2019-11-07T18:29:20.497",47]
["Test02","Anette Lepp","2019-11-08T18:16:00.331",75]
["Test04","Mihkel Kulp","2019-11-29T23:16:32.964",49]
["Test02","Diana Taal","2019-11-05T11:35:59.120",49]
["Test04","Carmen Sõrmus","2019-11-25T08:09:27.973",56]
["Test04","Armin Kaasik","2019-11-05T08:37:59.070",83]
["Test01","Jaagup Kivi","2019-11-27T10:29:33.574",67]
[{"$f":"INDEX($G$4:$G$7,RANDBETWEEN(1,4))","v":"Test03"},{"$f":"INDEX($I$2:$I$36,RANDBETWEEN(1,35))","v":"Tarvo Järv"},{"$f":"RANDBETWEEN($F$2,$G$2)+$F$1+RAND()*($G$1-$F$1)","v":"2019-11-24T13:17:17.288"},{"$f":"RANDBETWEEN(20,100)","v":94}]
["Test03","Hanna Laid","2019-11-07T18:47:37.198",98]
["Test04","Sander Kell","2019-11-19T19:44:27.101",55]
["Test02","Hanna Laid","2019-11-05T10:33:29.333",36]
["Test03","Artur Piiri","2019-11-27T22:42:02.988",32]
["Test01","Mihkel Kulp","2019-11-01T15:41:29.475",31]
["Test01","Maarja Pihlak","2019-11-01T13:26:06.616",75]
["Test04","Katrin Laurits","2019-11-24T13:05:34.273",96]
["Test01","Jana Kiisk","2019-11-02T13:57:03.925",26]
["Test01","Kristina Merila","2019-11-26T22:23:48.656",94]
["Test01","Kaspar Raude","2019-11-12T19:52:12.070",67]
["Test04","Carmen Sõrmus","2019-11-12T19:25:23.272",96]
["Test03","Alari Suur","2019-11-22T19:17:24.628",33]
["Test01","Jaagup Kivi","2019-11-06T17:41:17.029",74]
["Test02","Rasmus Kroon","2019-11-29T14:15:40.151",90]
["Test02","Rasmus Kroon","2019-11-17T11:11:12.311",73]